You are viewing a plain text version of this content. The canonical link for it is here.
Posted to dev@lucene.apache.org by Apache Jenkins Server <je...@builds.apache.org> on 2019/02/13 13:07:15 UTC
[JENKINS] Lucene-Solr-BadApples-Tests-7.x - Build # 288 - Unstable
Build: https://builds.apache.org/job/Lucene-Solr-BadApples-Tests-7.x/288/
2 tests failed.
FAILED: org.apache.solr.cloud.ChaosMonkeySafeLeaderWithPullReplicasTest.test
Error Message:
Timed out waiting for replica core_node12 (1550057703749) to replicate from leader core_node3 (0)
Stack Trace:
java.lang.AssertionError: Timed out waiting for replica core_node12 (1550057703749) to replicate from leader core_node3 (0)
at __randomizedtesting.SeedInfo.seed([C266A0C0BDB597C8:4A329F1A1349FA30]:0)
at org.junit.Assert.fail(Assert.java:88)
at org.apache.solr.cloud.AbstractFullDistribZkTestBase.waitForReplicationFromReplicas(AbstractFullDistribZkTestBase.java:2247)
at org.apache.solr.cloud.ChaosMonkeySafeLeaderWithPullReplicasTest.test(ChaosMonkeySafeLeaderWithPullReplicasTest.java:212)
at sun.reflect.NativeMethodAccessorImpl.invoke0(Native Method)
at sun.reflect.NativeMethodAccessorImpl.invoke(NativeMethodAccessorImpl.java:62)
at sun.reflect.DelegatingMethodAccessorImpl.invoke(DelegatingMethodAccessorImpl.java:43)
at java.lang.reflect.Method.invoke(Method.java:498)
at com.carrotsearch.randomizedtesting.RandomizedRunner.invoke(RandomizedRunner.java:1750)
at com.carrotsearch.randomizedtesting.RandomizedRunner$8.evaluate(RandomizedRunner.java:938)
at com.carrotsearch.randomizedtesting.RandomizedRunner$9.evaluate(RandomizedRunner.java:974)
at com.carrotsearch.randomizedtesting.RandomizedRunner$10.evaluate(RandomizedRunner.java:988)
at org.apache.solr.BaseDistributedSearchTestCase$ShardsRepeatRule$ShardsFixedStatement.callStatement(BaseDistributedSearchTestCase.java:1075)
at org.apache.solr.BaseDistributedSearchTestCase$ShardsRepeatRule$ShardsStatement.evaluate(BaseDistributedSearchTestCase.java:1047)
at com.carrotsearch.randomizedtesting.rules.SystemPropertiesRestoreRule$1.evaluate(SystemPropertiesRestoreRule.java:57)
at org.apache.lucene.util.TestRuleSetupTeardownChained$1.evaluate(TestRuleSetupTeardownChained.java:49)
at org.apache.lucene.util.AbstractBeforeAfterRule$1.evaluate(AbstractBeforeAfterRule.java:45)
at org.apache.lucene.util.TestRuleThreadAndTestName$1.evaluate(TestRuleThreadAndTestName.java:48)
at org.apache.lucene.util.TestRuleIgnoreAfterMaxFailures$1.evaluate(TestRuleIgnoreAfterMaxFailures.java:64)
at org.apache.lucene.util.TestRuleMarkFailure$1.evaluate(TestRuleMarkFailure.java:47)
at com.carrotsearch.randomizedtesting.rules.StatementAdapter.evaluate(StatementAdapter.java:36)
at com.carrotsearch.randomizedtesting.ThreadLeakControl$StatementRunner.run(ThreadLeakControl.java:368)
at com.carrotsearch.randomizedtesting.ThreadLeakControl.forkTimeoutingTask(ThreadLeakControl.java:817)
at com.carrotsearch.randomizedtesting.ThreadLeakControl$3.evaluate(ThreadLeakControl.java:468)
at com.carrotsearch.randomizedtesting.RandomizedRunner.runSingleTest(RandomizedRunner.java:947)
at com.carrotsearch.randomizedtesting.RandomizedRunner$5.evaluate(RandomizedRunner.java:832)
at com.carrotsearch.randomizedtesting.RandomizedRunner$6.evaluate(RandomizedRunner.java:883)
at com.carrotsearch.randomizedtesting.RandomizedRunner$7.evaluate(RandomizedRunner.java:894)
at com.carrotsearch.randomizedtesting.rules.StatementAdapter.evaluate(StatementAdapter.java:36)
at com.carrotsearch.randomizedtesting.rules.SystemPropertiesRestoreRule$1.evaluate(SystemPropertiesRestoreRule.java:57)
at org.apache.lucene.util.AbstractBeforeAfterRule$1.evaluate(AbstractBeforeAfterRule.java:45)
at com.carrotsearch.randomizedtesting.rules.StatementAdapter.evaluate(StatementAdapter.java:36)
at org.apache.lucene.util.TestRuleStoreClassName$1.evaluate(TestRuleStoreClassName.java:41)
at com.carrotsearch.randomizedtesting.rules.NoShadowingOrOverridesOnMethodsRule$1.evaluate(NoShadowingOrOverridesOnMethodsRule.java:40)
at com.carrotsearch.randomizedtesting.rules.NoShadowingOrOverridesOnMethodsRule$1.evaluate(NoShadowingOrOverridesOnMethodsRule.java:40)
at com.carrotsearch.randomizedtesting.rules.StatementAdapter.evaluate(StatementAdapter.java:36)
at com.carrotsearch.randomizedtesting.rules.StatementAdapter.evaluate(StatementAdapter.java:36)
at com.carrotsearch.randomizedtesting.rules.StatementAdapter.evaluate(StatementAdapter.java:36)
at org.apache.lucene.util.TestRuleAssertionsRequired$1.evaluate(TestRuleAssertionsRequired.java:53)
at org.apache.lucene.util.TestRuleMarkFailure$1.evaluate(TestRuleMarkFailure.java:47)
at org.apache.lucene.util.TestRuleIgnoreAfterMaxFailures$1.evaluate(TestRuleIgnoreAfterMaxFailures.java:64)
at org.apache.lucene.util.TestRuleIgnoreTestSuites$1.evaluate(TestRuleIgnoreTestSuites.java:54)
at com.carrotsearch.randomizedtesting.rules.StatementAdapter.evaluate(StatementAdapter.java:36)
at com.carrotsearch.randomizedtesting.ThreadLeakControl$StatementRunner.run(ThreadLeakControl.java:368)
at java.lang.Thread.run(Thread.java:748)
FAILED: org.apache.solr.schema.TestCloudSchemaless.test
Error Message:
Error from server at http://127.0.0.1:37533/collection1: Async exception during distributed update: Read timed out
Stack Trace:
org.apache.solr.client.solrj.impl.HttpSolrClient$RemoteSolrException: Error from server at http://127.0.0.1:37533/collection1: Async exception during distributed update: Read timed out
at __randomizedtesting.SeedInfo.seed([C266A0C0BDB597C8:4A329F1A1349FA30]:0)
at org.apache.solr.client.solrj.impl.HttpSolrClient.executeMethod(HttpSolrClient.java:643)
at org.apache.solr.client.solrj.impl.HttpSolrClient.request(HttpSolrClient.java:255)
at org.apache.solr.client.solrj.impl.HttpSolrClient.request(HttpSolrClient.java:244)
at org.apache.solr.client.solrj.SolrRequest.process(SolrRequest.java:194)
at org.apache.solr.client.solrj.SolrClient.add(SolrClient.java:106)
at org.apache.solr.client.solrj.SolrClient.add(SolrClient.java:71)
at org.apache.solr.client.solrj.SolrClient.add(SolrClient.java:85)
at org.apache.solr.schema.TestCloudSchemaless.test(TestCloudSchemaless.java:114)
at sun.reflect.NativeMethodAccessorImpl.invoke0(Native Method)
at sun.reflect.NativeMethodAccessorImpl.invoke(NativeMethodAccessorImpl.java:62)
at sun.reflect.DelegatingMethodAccessorImpl.invoke(DelegatingMethodAccessorImpl.java:43)
at java.lang.reflect.Method.invoke(Method.java:498)
at com.carrotsearch.randomizedtesting.RandomizedRunner.invoke(RandomizedRunner.java:1750)
at com.carrotsearch.randomizedtesting.RandomizedRunner$8.evaluate(RandomizedRunner.java:938)
at com.carrotsearch.randomizedtesting.RandomizedRunner$9.evaluate(RandomizedRunner.java:974)
at com.carrotsearch.randomizedtesting.RandomizedRunner$10.evaluate(RandomizedRunner.java:988)
at org.apache.solr.BaseDistributedSearchTestCase$ShardsRepeatRule$ShardsFixedStatement.callStatement(BaseDistributedSearchTestCase.java:1075)
at org.apache.solr.BaseDistributedSearchTestCase$ShardsRepeatRule$ShardsStatement.evaluate(BaseDistributedSearchTestCase.java:1047)
at com.carrotsearch.randomizedtesting.rules.SystemPropertiesRestoreRule$1.evaluate(SystemPropertiesRestoreRule.java:57)
at org.apache.lucene.util.TestRuleSetupTeardownChained$1.evaluate(TestRuleSetupTeardownChained.java:49)
at org.apache.lucene.util.AbstractBeforeAfterRule$1.evaluate(AbstractBeforeAfterRule.java:45)
at org.apache.lucene.util.TestRuleThreadAndTestName$1.evaluate(TestRuleThreadAndTestName.java:48)
at org.apache.lucene.util.TestRuleIgnoreAfterMaxFailures$1.evaluate(TestRuleIgnoreAfterMaxFailures.java:64)
at org.apache.lucene.util.TestRuleMarkFailure$1.evaluate(TestRuleMarkFailure.java:47)
at com.carrotsearch.randomizedtesting.rules.StatementAdapter.evaluate(StatementAdapter.java:36)
at com.carrotsearch.randomizedtesting.ThreadLeakControl$StatementRunner.run(ThreadLeakControl.java:368)
at com.carrotsearch.randomizedtesting.ThreadLeakControl.forkTimeoutingTask(ThreadLeakControl.java:817)
at com.carrotsearch.randomizedtesting.ThreadLeakControl$3.evaluate(ThreadLeakControl.java:468)
at com.carrotsearch.randomizedtesting.RandomizedRunner.runSingleTest(RandomizedRunner.java:947)
at com.carrotsearch.randomizedtesting.RandomizedRunner$5.evaluate(RandomizedRunner.java:832)
at com.carrotsearch.randomizedtesting.RandomizedRunner$6.evaluate(RandomizedRunner.java:883)
at com.carrotsearch.randomizedtesting.RandomizedRunner$7.evaluate(RandomizedRunner.java:894)
at com.carrotsearch.randomizedtesting.rules.StatementAdapter.evaluate(StatementAdapter.java:36)
at com.carrotsearch.randomizedtesting.rules.SystemPropertiesRestoreRule$1.evaluate(SystemPropertiesRestoreRule.java:57)
at org.apache.lucene.util.AbstractBeforeAfterRule$1.evaluate(AbstractBeforeAfterRule.java:45)
at com.carrotsearch.randomizedtesting.rules.StatementAdapter.evaluate(StatementAdapter.java:36)
at org.apache.lucene.util.TestRuleStoreClassName$1.evaluate(TestRuleStoreClassName.java:41)
at com.carrotsearch.randomizedtesting.rules.NoShadowingOrOverridesOnMethodsRule$1.evaluate(NoShadowingOrOverridesOnMethodsRule.java:40)
at com.carrotsearch.randomizedtesting.rules.NoShadowingOrOverridesOnMethodsRule$1.evaluate(NoShadowingOrOverridesOnMethodsRule.java:40)
at com.carrotsearch.randomizedtesting.rules.StatementAdapter.evaluate(StatementAdapter.java:36)
at com.carrotsearch.randomizedtesting.rules.StatementAdapter.evaluate(StatementAdapter.java:36)
at com.carrotsearch.randomizedtesting.rules.StatementAdapter.evaluate(StatementAdapter.java:36)
at org.apache.lucene.util.TestRuleAssertionsRequired$1.evaluate(TestRuleAssertionsRequired.java:53)
at org.apache.lucene.util.TestRuleMarkFailure$1.evaluate(TestRuleMarkFailure.java:47)
at org.apache.lucene.util.TestRuleIgnoreAfterMaxFailures$1.evaluate(TestRuleIgnoreAfterMaxFailures.java:64)
at org.apache.lucene.util.TestRuleIgnoreTestSuites$1.evaluate(TestRuleIgnoreTestSuites.java:54)
at com.carrotsearch.randomizedtesting.rules.StatementAdapter.evaluate(StatementAdapter.java:36)
at com.carrotsearch.randomizedtesting.ThreadLeakControl$StatementRunner.run(ThreadLeakControl.java:368)
at java.lang.Thread.run(Thread.java:748)
Build Log:
[...truncated 12779 lines...]
[junit4] Suite: org.apache.solr.schema.TestCloudSchemaless
[junit4] 2> 297878 INFO (SUITE-TestCloudSchemaless-seed#[C266A0C0BDB597C8]-worker) [ ] o.a.s.SolrTestCaseJ4 SecureRandom sanity checks: test.solr.allowed.securerandom=null & java.security.egd=file:/dev/./urandom
[junit4] 2> Creating dataDir: /home/jenkins/jenkins-slave/workspace/Lucene-Solr-BadApples-Tests-7.x/solr/build/solr-core/test/J2/temp/solr.schema.TestCloudSchemaless_C266A0C0BDB597C8-001/init-core-data-001
[junit4] 2> 297879 INFO (SUITE-TestCloudSchemaless-seed#[C266A0C0BDB597C8]-worker) [ ] o.a.s.SolrTestCaseJ4 Using PointFields (NUMERIC_POINTS_SYSPROP=true) w/NUMERIC_DOCVALUES_SYSPROP=true
[junit4] 2> 297913 INFO (SUITE-TestCloudSchemaless-seed#[C266A0C0BDB597C8]-worker) [ ] o.a.s.SolrTestCaseJ4 Randomized ssl (false) and clientAuth (false) via: @org.apache.solr.SolrTestCaseJ4$SuppressSSL(bugUrl=https://issues.apache.org/jira/browse/SOLR-5776)
[junit4] 2> 297913 INFO (SUITE-TestCloudSchemaless-seed#[C266A0C0BDB597C8]-worker) [ ] o.a.s.BaseDistributedSearchTestCase Setting hostContext system property: /
[junit4] 2> 298067 INFO (TEST-TestCloudSchemaless.test-seed#[C266A0C0BDB597C8]) [ ] o.a.s.c.ZkTestServer STARTING ZK TEST SERVER
[junit4] 2> 298094 INFO (ZkTestServer Run Thread) [ ] o.a.s.c.ZkTestServer client port:0.0.0.0/0.0.0.0:0
[junit4] 2> 298094 INFO (ZkTestServer Run Thread) [ ] o.a.s.c.ZkTestServer Starting server
[junit4] 2> 298187 INFO (TEST-TestCloudSchemaless.test-seed#[C266A0C0BDB597C8]) [ ] o.a.s.c.ZkTestServer start zk server on port:38689
[junit4] 2> 298187 INFO (TEST-TestCloudSchemaless.test-seed#[C266A0C0BDB597C8]) [ ] o.a.s.c.ZkTestServer parse host and port list: 127.0.0.1:38689
[junit4] 2> 298187 INFO (TEST-TestCloudSchemaless.test-seed#[C266A0C0BDB597C8]) [ ] o.a.s.c.ZkTestServer connecting to 127.0.0.1 38689
[junit4] 2> 298598 INFO (zkConnectionManagerCallback-171-thread-1) [ ] o.a.s.c.c.ConnectionManager zkClient has connected
[junit4] 2> 298897 INFO (zkConnectionManagerCallback-173-thread-1) [ ] o.a.s.c.c.ConnectionManager zkClient has connected
[junit4] 2> 298928 INFO (TEST-TestCloudSchemaless.test-seed#[C266A0C0BDB597C8]) [ ] o.a.s.c.ZkTestServer put /home/jenkins/jenkins-slave/workspace/Lucene-Solr-BadApples-Tests-7.x/solr/core/src/test-files/solr/collection1/conf/solrconfig-schemaless.xml to /configs/conf1/solrconfig.xml
[junit4] 2> 298946 INFO (TEST-TestCloudSchemaless.test-seed#[C266A0C0BDB597C8]) [ ] o.a.s.c.ZkTestServer put /home/jenkins/jenkins-slave/workspace/Lucene-Solr-BadApples-Tests-7.x/solr/core/src/test-files/solr/collection1/conf/schema-add-schema-fields-update-processor.xml to /configs/conf1/schema.xml
[junit4] 2> 298947 INFO (TEST-TestCloudSchemaless.test-seed#[C266A0C0BDB597C8]) [ ] o.a.s.c.ZkTestServer put /home/jenkins/jenkins-slave/workspace/Lucene-Solr-BadApples-Tests-7.x/solr/core/src/test-files/solr/collection1/conf/solrconfig.snippet.randomindexconfig.xml to /configs/conf1/solrconfig.snippet.randomindexconfig.xml
[junit4] 2> 298948 INFO (TEST-TestCloudSchemaless.test-seed#[C266A0C0BDB597C8]) [ ] o.a.s.c.ZkTestServer put /home/jenkins/jenkins-slave/workspace/Lucene-Solr-BadApples-Tests-7.x/solr/core/src/test-files/solr/collection1/conf/stopwords.txt to /configs/conf1/stopwords.txt
[junit4] 2> 299051 INFO (TEST-TestCloudSchemaless.test-seed#[C266A0C0BDB597C8]) [ ] o.a.s.c.ZkTestServer put /home/jenkins/jenkins-slave/workspace/Lucene-Solr-BadApples-Tests-7.x/solr/core/src/test-files/solr/collection1/conf/protwords.txt to /configs/conf1/protwords.txt
[junit4] 2> 299103 INFO (TEST-TestCloudSchemaless.test-seed#[C266A0C0BDB597C8]) [ ] o.a.s.c.ZkTestServer put /home/jenkins/jenkins-slave/workspace/Lucene-Solr-BadApples-Tests-7.x/solr/core/src/test-files/solr/collection1/conf/currency.xml to /configs/conf1/currency.xml
[junit4] 2> 299142 INFO (TEST-TestCloudSchemaless.test-seed#[C266A0C0BDB597C8]) [ ] o.a.s.c.ZkTestServer put /home/jenkins/jenkins-slave/workspace/Lucene-Solr-BadApples-Tests-7.x/solr/core/src/test-files/solr/collection1/conf/enumsConfig.xml to /configs/conf1/enumsConfig.xml
[junit4] 2> 299143 INFO (TEST-TestCloudSchemaless.test-seed#[C266A0C0BDB597C8]) [ ] o.a.s.c.ZkTestServer put /home/jenkins/jenkins-slave/workspace/Lucene-Solr-BadApples-Tests-7.x/solr/core/src/test-files/solr/collection1/conf/open-exchange-rates.json to /configs/conf1/open-exchange-rates.json
[junit4] 2> 299157 INFO (TEST-TestCloudSchemaless.test-seed#[C266A0C0BDB597C8]) [ ] o.a.s.c.ZkTestServer put /home/jenkins/jenkins-slave/workspace/Lucene-Solr-BadApples-Tests-7.x/solr/core/src/test-files/solr/collection1/conf/mapping-ISOLatin1Accent.txt to /configs/conf1/mapping-ISOLatin1Accent.txt
[junit4] 2> 299158 INFO (TEST-TestCloudSchemaless.test-seed#[C266A0C0BDB597C8]) [ ] o.a.s.c.ZkTestServer put /home/jenkins/jenkins-slave/workspace/Lucene-Solr-BadApples-Tests-7.x/solr/core/src/test-files/solr/collection1/conf/old_synonyms.txt to /configs/conf1/old_synonyms.txt
[junit4] 2> 299177 INFO (TEST-TestCloudSchemaless.test-seed#[C266A0C0BDB597C8]) [ ] o.a.s.c.ZkTestServer put /home/jenkins/jenkins-slave/workspace/Lucene-Solr-BadApples-Tests-7.x/solr/core/src/test-files/solr/collection1/conf/synonyms.txt to /configs/conf1/synonyms.txt
[junit4] 2> 299198 INFO (TEST-TestCloudSchemaless.test-seed#[C266A0C0BDB597C8]) [ ] o.a.s.c.AbstractFullDistribZkTestBase Will use NRT replicas unless explicitly asked otherwise
[junit4] 2> 300838 WARN (TEST-TestCloudSchemaless.test-seed#[C266A0C0BDB597C8]) [ ] o.e.j.s.AbstractConnector Ignoring deprecated socket close linger time
[junit4] 2> 300838 INFO (TEST-TestCloudSchemaless.test-seed#[C266A0C0BDB597C8]) [ ] o.a.s.c.s.e.JettySolrRunner Start Jetty (original configured port=0)
[junit4] 2> 300838 INFO (TEST-TestCloudSchemaless.test-seed#[C266A0C0BDB597C8]) [ ] o.a.s.c.s.e.JettySolrRunner Trying to start Jetty on port 0 try number 1 ...
[junit4] 2> 300838 INFO (TEST-TestCloudSchemaless.test-seed#[C266A0C0BDB597C8]) [ ] o.e.j.s.Server jetty-9.4.14.v20181114; built: 2018-11-14T21:20:31.478Z; git: c4550056e785fb5665914545889f21dc136ad9e6; jvm 1.8.0_191-b12
[junit4] 2> 300853 INFO (TEST-TestCloudSchemaless.test-seed#[C266A0C0BDB597C8]) [ ] o.e.j.s.session DefaultSessionIdManager workerName=node0
[junit4] 2> 300854 INFO (TEST-TestCloudSchemaless.test-seed#[C266A0C0BDB597C8]) [ ] o.e.j.s.session No SessionScavenger set, using defaults
[junit4] 2> 300854 INFO (TEST-TestCloudSchemaless.test-seed#[C266A0C0BDB597C8]) [ ] o.e.j.s.session node0 Scavenging every 660000ms
[junit4] 2> 300854 INFO (TEST-TestCloudSchemaless.test-seed#[C266A0C0BDB597C8]) [ ] o.e.j.s.h.ContextHandler Started o.e.j.s.ServletContextHandler@42e42145{/,null,AVAILABLE}
[junit4] 2> 300877 INFO (TEST-TestCloudSchemaless.test-seed#[C266A0C0BDB597C8]) [ ] o.e.j.s.AbstractConnector Started ServerConnector@77470cfb{HTTP/1.1,[http/1.1]}{127.0.0.1:45766}
[junit4] 2> 300877 INFO (TEST-TestCloudSchemaless.test-seed#[C266A0C0BDB597C8]) [ ] o.e.j.s.Server Started @301041ms
[junit4] 2> 300877 INFO (TEST-TestCloudSchemaless.test-seed#[C266A0C0BDB597C8]) [ ] o.a.s.c.s.e.JettySolrRunner Jetty properties: {solr.data.dir=/home/jenkins/jenkins-slave/workspace/Lucene-Solr-BadApples-Tests-7.x/solr/build/solr-core/test/J2/temp/solr.schema.TestCloudSchemaless_C266A0C0BDB597C8-001/tempDir-001/control/data, hostContext=/, hostPort=45766, coreRootDirectory=/home/jenkins/jenkins-slave/workspace/Lucene-Solr-BadApples-Tests-7.x/solr/build/solr-core/test/J2/temp/solr.schema.TestCloudSchemaless_C266A0C0BDB597C8-001/control-001/cores}
[junit4] 2> 300893 ERROR (TEST-TestCloudSchemaless.test-seed#[C266A0C0BDB597C8]) [ ] o.a.s.u.StartupLoggingUtils Missing Java Option solr.log.dir. Logging may be missing or incomplete.
[junit4] 2> 300893 INFO (TEST-TestCloudSchemaless.test-seed#[C266A0C0BDB597C8]) [ ] o.a.s.s.SolrDispatchFilter Using logger factory org.apache.logging.slf4j.Log4jLoggerFactory
[junit4] 2> 300894 INFO (TEST-TestCloudSchemaless.test-seed#[C266A0C0BDB597C8]) [ ] o.a.s.s.SolrDispatchFilter ___ _ Welcome to Apache Solr™ version 7.8.0
[junit4] 2> 300894 INFO (TEST-TestCloudSchemaless.test-seed#[C266A0C0BDB597C8]) [ ] o.a.s.s.SolrDispatchFilter / __| ___| |_ _ Starting in cloud mode on port null
[junit4] 2> 300894 INFO (TEST-TestCloudSchemaless.test-seed#[C266A0C0BDB597C8]) [ ] o.a.s.s.SolrDispatchFilter \__ \/ _ \ | '_| Install dir: null
[junit4] 2> 300894 INFO (TEST-TestCloudSchemaless.test-seed#[C266A0C0BDB597C8]) [ ] o.a.s.s.SolrDispatchFilter |___/\___/_|_| Start time: 2019-02-13T10:56:44.430Z
[junit4] 2> 300995 INFO (zkConnectionManagerCallback-175-thread-1) [ ] o.a.s.c.c.ConnectionManager zkClient has connected
[junit4] 2> 301312 INFO (TEST-TestCloudSchemaless.test-seed#[C266A0C0BDB597C8]) [ ] o.a.s.s.SolrDispatchFilter Loading solr.xml from SolrHome (not found in ZooKeeper)
[junit4] 2> 301312 INFO (TEST-TestCloudSchemaless.test-seed#[C266A0C0BDB597C8]) [ ] o.a.s.c.SolrXmlConfig Loading container configuration from /home/jenkins/jenkins-slave/workspace/Lucene-Solr-BadApples-Tests-7.x/solr/build/solr-core/test/J2/temp/solr.schema.TestCloudSchemaless_C266A0C0BDB597C8-001/control-001/solr.xml
[junit4] 2> 301349 INFO (TEST-TestCloudSchemaless.test-seed#[C266A0C0BDB597C8]) [ ] o.a.s.c.SolrXmlConfig Configuration parameter autoReplicaFailoverWorkLoopDelay is ignored
[junit4] 2> 301349 INFO (TEST-TestCloudSchemaless.test-seed#[C266A0C0BDB597C8]) [ ] o.a.s.c.SolrXmlConfig Configuration parameter autoReplicaFailoverBadNodeExpiration is ignored
[junit4] 2> 301351 INFO (TEST-TestCloudSchemaless.test-seed#[C266A0C0BDB597C8]) [ ] o.a.s.c.SolrXmlConfig MBean server found: com.sun.jmx.mbeanserver.JmxMBeanServer@7edc89b5, but no JMX reporters were configured - adding default JMX reporter.
[junit4] 2> 302477 INFO (TEST-TestCloudSchemaless.test-seed#[C266A0C0BDB597C8]) [ ] o.a.s.h.c.HttpShardHandlerFactory Host whitelist initialized: WhitelistHostChecker [whitelistHosts=null, whitelistHostCheckingEnabled=false]
[junit4] 2> 302586 INFO (TEST-TestCloudSchemaless.test-seed#[C266A0C0BDB597C8]) [ ] o.a.s.c.ZkContainer Zookeeper client=127.0.0.1:38689/solr
[junit4] 2> 302632 INFO (zkConnectionManagerCallback-179-thread-1) [ ] o.a.s.c.c.ConnectionManager zkClient has connected
[junit4] 2> 302847 INFO (zkConnectionManagerCallback-181-thread-1) [ ] o.a.s.c.c.ConnectionManager zkClient has connected
[junit4] 2> 305532 INFO (TEST-TestCloudSchemaless.test-seed#[C266A0C0BDB597C8]) [n:127.0.0.1:45766_ ] o.a.s.c.OverseerElectionContext I am going to be the leader 127.0.0.1:45766_
[junit4] 2> 305533 INFO (TEST-TestCloudSchemaless.test-seed#[C266A0C0BDB597C8]) [n:127.0.0.1:45766_ ] o.a.s.c.Overseer Overseer (id=74180488749383684-127.0.0.1:45766_-n_0000000000) starting
[junit4] 2> 305734 INFO (zkConnectionManagerCallback-188-thread-1) [ ] o.a.s.c.c.ConnectionManager zkClient has connected
[junit4] 2> 305789 INFO (TEST-TestCloudSchemaless.test-seed#[C266A0C0BDB597C8]) [n:127.0.0.1:45766_ ] o.a.s.c.s.i.ZkClientClusterStateProvider Cluster at 127.0.0.1:38689/solr ready
[junit4] 2> 305844 INFO (TEST-TestCloudSchemaless.test-seed#[C266A0C0BDB597C8]) [n:127.0.0.1:45766_ ] o.a.s.c.ZkController Register node as live in ZooKeeper:/live_nodes/127.0.0.1:45766_
[junit4] 2> 305844 INFO (OverseerStateUpdate-74180488749383684-127.0.0.1:45766_-n_0000000000) [n:127.0.0.1:45766_ ] o.a.s.c.Overseer Starting to work on the main queue : 127.0.0.1:45766_
[junit4] 2> 305900 INFO (OverseerStateUpdate-74180488749383684-127.0.0.1:45766_-n_0000000000) [n:127.0.0.1:45766_ ] o.a.s.c.c.ZkStateReader Updated live nodes from ZooKeeper... (0) -> (1)
[junit4] 2> 305970 INFO (zkCallback-187-thread-1) [ ] o.a.s.c.c.ZkStateReader Updated live nodes from ZooKeeper... (0) -> (1)
[junit4] 2> 306168 INFO (TEST-TestCloudSchemaless.test-seed#[C266A0C0BDB597C8]) [n:127.0.0.1:45766_ ] o.a.s.h.a.MetricsHistoryHandler No .system collection, keeping metrics history in memory.
[junit4] 2> 306353 INFO (TEST-TestCloudSchemaless.test-seed#[C266A0C0BDB597C8]) [n:127.0.0.1:45766_ ] o.a.s.m.r.SolrJmxReporter JMX monitoring for 'solr.node' (registry 'solr.node') enabled at server: com.sun.jmx.mbeanserver.JmxMBeanServer@7edc89b5
[junit4] 2> 306425 INFO (TEST-TestCloudSchemaless.test-seed#[C266A0C0BDB597C8]) [n:127.0.0.1:45766_ ] o.a.s.m.r.SolrJmxReporter JMX monitoring for 'solr.jvm' (registry 'solr.jvm') enabled at server: com.sun.jmx.mbeanserver.JmxMBeanServer@7edc89b5
[junit4] 2> 306426 INFO (TEST-TestCloudSchemaless.test-seed#[C266A0C0BDB597C8]) [n:127.0.0.1:45766_ ] o.a.s.m.r.SolrJmxReporter JMX monitoring for 'solr.jetty' (registry 'solr.jetty') enabled at server: com.sun.jmx.mbeanserver.JmxMBeanServer@7edc89b5
[junit4] 2> 306460 INFO (TEST-TestCloudSchemaless.test-seed#[C266A0C0BDB597C8]) [n:127.0.0.1:45766_ ] o.a.s.c.CorePropertiesLocator Found 0 core definitions underneath /home/jenkins/jenkins-slave/workspace/Lucene-Solr-BadApples-Tests-7.x/solr/build/solr-core/test/J2/temp/solr.schema.TestCloudSchemaless_C266A0C0BDB597C8-001/control-001/cores
[junit4] 2> 306808 INFO (zkConnectionManagerCallback-194-thread-1) [ ] o.a.s.c.c.ConnectionManager zkClient has connected
[junit4] 2> 306813 INFO (TEST-TestCloudSchemaless.test-seed#[C266A0C0BDB597C8]) [ ] o.a.s.c.c.ZkStateReader Updated live nodes from ZooKeeper... (0) -> (1)
[junit4] 2> 306816 INFO (TEST-TestCloudSchemaless.test-seed#[C266A0C0BDB597C8]) [ ] o.a.s.c.s.i.ZkClientClusterStateProvider Cluster at 127.0.0.1:38689/solr ready
[junit4] 2> 306882 INFO (qtp796429121-556) [n:127.0.0.1:45766_ ] o.a.s.h.a.CollectionsHandler Invoked Collection Action :create with params collection.configName=conf1&name=control_collection&nrtReplicas=1&action=CREATE&numShards=1&createNodeSet=127.0.0.1:45766_&wt=javabin&version=2 and sendToOCPQueue=true
[junit4] 2> 306995 INFO (OverseerThreadFactory-177-thread-1-processing-n:127.0.0.1:45766_) [n:127.0.0.1:45766_ ] o.a.s.c.a.c.CreateCollectionCmd Create collection control_collection
[junit4] 2> 307178 INFO (qtp796429121-558) [n:127.0.0.1:45766_ ] o.a.s.s.HttpSolrCall [admin] webapp=null path=/admin/metrics params={prefix=CONTAINER.fs.usableSpace,CONTAINER.fs.totalSpace,CORE.coreName&wt=javabin&version=2&group=solr.node,solr.core} status=0 QTime=0
[junit4] 2> 307179 INFO (qtp796429121-559) [n:127.0.0.1:45766_ ] o.a.s.s.HttpSolrCall [admin] webapp=null path=/admin/metrics params={prefix=CONTAINER.fs.usableSpace,CONTAINER.fs.totalSpace,CORE.coreName&wt=javabin&version=2&group=solr.node,solr.core} status=0 QTime=0
[junit4] 2> 307210 INFO (qtp796429121-555) [n:127.0.0.1:45766_ ] o.a.s.s.HttpSolrCall [admin] webapp=null path=/admin/metrics params={prefix=CONTAINER.fs.usableSpace,CONTAINER.fs.totalSpace,CORE.coreName&wt=javabin&version=2&group=solr.node,solr.core} status=0 QTime=0
[junit4] 2> 307214 INFO (qtp796429121-557) [n:127.0.0.1:45766_ ] o.a.s.s.HttpSolrCall [admin] webapp=null path=/admin/metrics params={prefix=CONTAINER.fs.usableSpace,CONTAINER.fs.totalSpace,CORE.coreName&wt=javabin&version=2&group=solr.node,solr.core} status=0 QTime=0
[junit4] 2> 307215 INFO (qtp796429121-558) [n:127.0.0.1:45766_ ] o.a.s.s.HttpSolrCall [admin] webapp=null path=/admin/metrics params={prefix=CONTAINER.fs.usableSpace,CONTAINER.fs.totalSpace,CORE.coreName&wt=javabin&version=2&group=solr.node,solr.core} status=0 QTime=0
[junit4] 2> 307323 INFO (qtp796429121-559) [n:127.0.0.1:45766_ x:control_collection_shard1_replica_n1] o.a.s.h.a.CoreAdminOperation core create command qt=/admin/cores&collection.configName=conf1&newCollection=true&name=control_collection_shard1_replica_n1&action=CREATE&numShards=1&collection=control_collection&shard=shard1&wt=javabin&version=2&replicaType=NRT
[junit4] 2> 307324 INFO (qtp796429121-559) [n:127.0.0.1:45766_ x:control_collection_shard1_replica_n1] o.a.s.c.TransientSolrCoreCacheDefault Allocating transient cache for 4 transient cores
[junit4] 2> 308747 INFO (qtp796429121-559) [n:127.0.0.1:45766_ c:control_collection s:shard1 x:control_collection_shard1_replica_n1] o.a.s.c.SolrConfig Using Lucene MatchVersion: 7.8.0
[junit4] 2> 308910 INFO (qtp796429121-559) [n:127.0.0.1:45766_ c:control_collection s:shard1 x:control_collection_shard1_replica_n1] o.a.s.s.ManagedIndexSchemaFactory The schema is configured as managed, but managed schema resource managed-schema not found - loading non-managed schema schema.xml instead
[junit4] 2> 308983 INFO (qtp796429121-559) [n:127.0.0.1:45766_ c:control_collection s:shard1 x:control_collection_shard1_replica_n1] o.a.s.s.IndexSchema [control_collection_shard1_replica_n1] Schema name=add-schema-fields-update-processor
[junit4] 2> 309163 INFO (qtp796429121-559) [n:127.0.0.1:45766_ c:control_collection s:shard1 x:control_collection_shard1_replica_n1] o.a.s.s.IndexSchema Loaded schema add-schema-fields-update-processor/1.6 with uniqueid field id
[junit4] 2> 309311 INFO (qtp796429121-559) [n:127.0.0.1:45766_ c:control_collection s:shard1 x:control_collection_shard1_replica_n1] o.a.s.s.ManagedIndexSchema Created and persisted managed schema znode at /configs/conf1/managed-schema
[junit4] 2> 309346 INFO (qtp796429121-559) [n:127.0.0.1:45766_ c:control_collection s:shard1 x:control_collection_shard1_replica_n1] o.a.s.s.ManagedIndexSchemaFactory After upgrading to managed schema in ZooKeeper, renamed the non-managed schema /configs/conf1/schema.xml to /configs/conf1/schema.xml.bak
[junit4] 2> 309346 INFO (qtp796429121-559) [n:127.0.0.1:45766_ c:control_collection s:shard1 x:control_collection_shard1_replica_n1] o.a.s.c.CoreContainer Creating SolrCore 'control_collection_shard1_replica_n1' using configuration from collection control_collection, trusted=true
[junit4] 2> 309347 INFO (qtp796429121-559) [n:127.0.0.1:45766_ c:control_collection s:shard1 x:control_collection_shard1_replica_n1] o.a.s.m.r.SolrJmxReporter JMX monitoring for 'solr.core.control_collection.shard1.replica_n1' (registry 'solr.core.control_collection.shard1.replica_n1') enabled at server: com.sun.jmx.mbeanserver.JmxMBeanServer@7edc89b5
[junit4] 2> 309381 INFO (qtp796429121-559) [n:127.0.0.1:45766_ c:control_collection s:shard1 x:control_collection_shard1_replica_n1] o.a.s.c.SolrCore [[control_collection_shard1_replica_n1] ] Opening new SolrCore at [/home/jenkins/jenkins-slave/workspace/Lucene-Solr-BadApples-Tests-7.x/solr/build/solr-core/test/J2/temp/solr.schema.TestCloudSchemaless_C266A0C0BDB597C8-001/control-001/cores/control_collection_shard1_replica_n1], dataDir=[/home/jenkins/jenkins-slave/workspace/Lucene-Solr-BadApples-Tests-7.x/solr/build/solr-core/test/J2/temp/solr.schema.TestCloudSchemaless_C266A0C0BDB597C8-001/control-001/cores/control_collection_shard1_replica_n1/data/]
[junit4] 2> 309418 INFO (qtp796429121-559) [n:127.0.0.1:45766_ c:control_collection s:shard1 x:control_collection_shard1_replica_n1] o.a.s.u.RandomMergePolicy RandomMergePolicy wrapping class org.apache.lucene.index.TieredMergePolicy: [TieredMergePolicy: maxMergeAtOnce=16, maxMergeAtOnceExplicit=45, maxMergedSegmentMB=57.6142578125, floorSegmentMB=1.916015625, forceMergeDeletesPctAllowed=10.64841656214188, segmentsPerTier=40.0, maxCFSSegmentSizeMB=8.796093022207999E12, noCFSRatio=1.0, deletesPctAllowed=42.2920030103313
[junit4] 2> 311942 INFO (qtp796429121-559) [n:127.0.0.1:45766_ c:control_collection s:shard1 x:control_collection_shard1_replica_n1] o.a.s.u.UpdateHandler Using UpdateLog implementation: org.apache.solr.update.UpdateLog
[junit4] 2> 311942 INFO (qtp796429121-559) [n:127.0.0.1:45766_ c:control_collection s:shard1 x:control_collection_shard1_replica_n1] o.a.s.u.UpdateLog Initializing UpdateLog: dataDir= defaultSyncLevel=FLUSH numRecordsToKeep=100 maxNumLogsToKeep=10 numVersionBuckets=65536
[junit4] 2> 311944 INFO (qtp796429121-559) [n:127.0.0.1:45766_ c:control_collection s:shard1 x:control_collection_shard1_replica_n1] o.a.s.u.CommitTracker Hard AutoCommit: disabled
[junit4] 2> 311944 INFO (qtp796429121-559) [n:127.0.0.1:45766_ c:control_collection s:shard1 x:control_collection_shard1_replica_n1] o.a.s.u.CommitTracker Soft AutoCommit: disabled
[junit4] 2> 311962 INFO (qtp796429121-559) [n:127.0.0.1:45766_ c:control_collection s:shard1 x:control_collection_shard1_replica_n1] o.a.s.u.RandomMergePolicy RandomMergePolicy wrapping class org.apache.lucene.index.LogDocMergePolicy: [LogDocMergePolicy: minMergeSize=1000, mergeFactor=35, maxMergeSize=9223372036854775807, maxMergeSizeForForcedMerge=9223372036854775807, calibrateSizeByDeletes=true, maxMergeDocs=2147483647, maxCFSSegmentSizeMB=8.796093022207999E12, noCFSRatio=1.0]
[junit4] 2> 311978 INFO (qtp796429121-559) [n:127.0.0.1:45766_ c:control_collection s:shard1 x:control_collection_shard1_replica_n1] o.a.s.s.SolrIndexSearcher Opening [Searcher@5822a6f1[control_collection_shard1_replica_n1] main]
[junit4] 2> 311980 INFO (qtp796429121-559) [n:127.0.0.1:45766_ c:control_collection s:shard1 x:control_collection_shard1_replica_n1] o.a.s.r.ManagedResourceStorage Configured ZooKeeperStorageIO with znodeBase: /configs/conf1
[junit4] 2> 311980 INFO (qtp796429121-559) [n:127.0.0.1:45766_ c:control_collection s:shard1 x:control_collection_shard1_replica_n1] o.a.s.r.ManagedResourceStorage Loaded null at path _rest_managed.json using ZooKeeperStorageIO:path=/configs/conf1
[junit4] 2> 312016 INFO (qtp796429121-559) [n:127.0.0.1:45766_ c:control_collection s:shard1 x:control_collection_shard1_replica_n1] o.a.s.s.ZkIndexSchemaReader Creating ZooKeeper watch for the managed schema at /configs/conf1/managed-schema
[junit4] 2> 312017 INFO (qtp796429121-559) [n:127.0.0.1:45766_ c:control_collection s:shard1 x:control_collection_shard1_replica_n1] o.a.s.s.ZkIndexSchemaReader Current schema version 0 is already the latest
[junit4] 2> 312052 INFO (qtp796429121-559) [n:127.0.0.1:45766_ c:control_collection s:shard1 x:control_collection_shard1_replica_n1] o.a.s.h.ReplicationHandler Commits will be reserved for 10000ms.
[junit4] 2> 312052 INFO (qtp796429121-559) [n:127.0.0.1:45766_ c:control_collection s:shard1 x:control_collection_shard1_replica_n1] o.a.s.u.UpdateLog Could not find max version in index or recent updates, using new clock 1625350907455602688
[junit4] 2> 312147 INFO (qtp796429121-559) [n:127.0.0.1:45766_ c:control_collection s:shard1 x:control_collection_shard1_replica_n1] o.a.s.c.ZkShardTerms Successful update of terms at /collections/control_collection/terms/shard1 to Terms{values={core_node2=0}, version=0}
[junit4] 2> 312147 INFO (qtp796429121-559) [n:127.0.0.1:45766_ c:control_collection s:shard1 x:control_collection_shard1_replica_n1] o.a.s.c.ShardLeaderElectionContextBase make sure parent is created /collections/control_collection/leaders/shard1
[junit4] 2> 312181 INFO (searcherExecutor-182-thread-1-processing-n:127.0.0.1:45766_ x:control_collection_shard1_replica_n1 c:control_collection s:shard1) [n:127.0.0.1:45766_ c:control_collection s:shard1 x:control_collection_shard1_replica_n1] o.a.s.c.SolrCore [control_collection_shard1_replica_n1] Registered new searcher Searcher@5822a6f1[control_collection_shard1_replica_n1] main{ExitableDirectoryReader(UninvertingDirectoryReader())}
[junit4] 2> 312257 INFO (qtp796429121-559) [n:127.0.0.1:45766_ c:control_collection s:shard1 x:control_collection_shard1_replica_n1] o.a.s.c.ShardLeaderElectionContext Enough replicas found to continue.
[junit4] 2> 312257 INFO (qtp796429121-559) [n:127.0.0.1:45766_ c:control_collection s:shard1 x:control_collection_shard1_replica_n1] o.a.s.c.ShardLeaderElectionContext I may be the new leader - try and sync
[junit4] 2> 312257 INFO (qtp796429121-559) [n:127.0.0.1:45766_ c:control_collection s:shard1 x:control_collection_shard1_replica_n1] o.a.s.c.SyncStrategy Sync replicas to http://127.0.0.1:45766/control_collection_shard1_replica_n1/
[junit4] 2> 312257 INFO (qtp796429121-559) [n:127.0.0.1:45766_ c:control_collection s:shard1 x:control_collection_shard1_replica_n1] o.a.s.c.SyncStrategy Sync Success - now sync replicas to me
[junit4] 2> 312290 INFO (qtp796429121-559) [n:127.0.0.1:45766_ c:control_collection s:shard1 x:control_collection_shard1_replica_n1] o.a.s.c.SyncStrategy http://127.0.0.1:45766/control_collection_shard1_replica_n1/ has no replicas
[junit4] 2> 312290 INFO (qtp796429121-559) [n:127.0.0.1:45766_ c:control_collection s:shard1 x:control_collection_shard1_replica_n1] o.a.s.c.ShardLeaderElectionContext Found all replicas participating in election, clear LIR
[junit4] 2> 312291 INFO (qtp796429121-559) [n:127.0.0.1:45766_ c:control_collection s:shard1 x:control_collection_shard1_replica_n1] o.a.s.c.ShardLeaderElectionContextBase Creating leader registration node /collections/control_collection/leaders/shard1/leader after winning as /collections/control_collection/leader_elect/shard1/election/74180488749383684-core_node2-n_0000000000
[junit4] 2> 312312 INFO (qtp796429121-559) [n:127.0.0.1:45766_ c:control_collection s:shard1 x:control_collection_shard1_replica_n1] o.a.s.c.ShardLeaderElectionContext I am the new leader: http://127.0.0.1:45766/control_collection_shard1_replica_n1/ shard1
[junit4] 2> 312334 INFO (zkCallback-180-thread-1) [ ] o.a.s.c.c.ZkStateReader A cluster state change: [WatchedEvent state:SyncConnected type:NodeDataChanged path:/collections/control_collection/state.json] for collection [control_collection] has occurred - updating... (live nodes size: [1])
[junit4] 2> 312347 INFO (zkCallback-180-thread-2) [ ] o.a.s.c.c.ZkStateReader A cluster state change: [WatchedEvent state:SyncConnected type:NodeDataChanged path:/collections/control_collection/state.json] for collection [control_collection] has occurred - updating... (live nodes size: [1])
[junit4] 2> 312348 INFO (qtp796429121-559) [n:127.0.0.1:45766_ c:control_collection s:shard1 x:control_collection_shard1_replica_n1] o.a.s.c.ZkController I am the leader, no recovery necessary
[junit4] 2> 312421 INFO (qtp796429121-559) [n:127.0.0.1:45766_ c:control_collection s:shard1 x:control_collection_shard1_replica_n1] o.a.s.s.HttpSolrCall [admin] webapp=null path=/admin/cores params={qt=/admin/cores&collection.configName=conf1&newCollection=true&name=control_collection_shard1_replica_n1&action=CREATE&numShards=1&collection=control_collection&shard=shard1&wt=javabin&version=2&replicaType=NRT} status=0 QTime=5098
[junit4] 2> 312458 INFO (zkCallback-180-thread-2) [ ] o.a.s.c.c.ZkStateReader A cluster state change: [WatchedEvent state:SyncConnected type:NodeDataChanged path:/collections/control_collection/state.json] for collection [control_collection] has occurred - updating... (live nodes size: [1])
[junit4] 2> 312458 INFO (zkCallback-180-thread-3) [ ] o.a.s.c.c.ZkStateReader A cluster state change: [WatchedEvent state:SyncConnected type:NodeDataChanged path:/collections/control_collection/state.json] for collection [control_collection] has occurred - updating... (live nodes size: [1])
[junit4] 2> 312476 INFO (zkCallback-180-thread-1) [ ] o.a.s.c.c.ZkStateReader A cluster state change: [WatchedEvent state:SyncConnected type:NodeDataChanged path:/collections/control_collection/state.json] for collection [control_collection] has occurred - updating... (live nodes size: [1])
[junit4] 2> 312655 INFO (qtp796429121-556) [n:127.0.0.1:45766_ ] o.a.s.h.a.CollectionsHandler Wait for new collection to be active for at most 45 seconds. Check all shard replicas
[junit4] 2> 312656 INFO (qtp796429121-556) [n:127.0.0.1:45766_ ] o.a.s.s.HttpSolrCall [admin] webapp=null path=/admin/collections params={collection.configName=conf1&name=control_collection&nrtReplicas=1&action=CREATE&numShards=1&createNodeSet=127.0.0.1:45766_&wt=javabin&version=2} status=0 QTime=5773
[junit4] 2> 312861 INFO (zkConnectionManagerCallback-199-thread-1) [ ] o.a.s.c.c.ConnectionManager zkClient has connected
[junit4] 2> 312876 INFO (TEST-TestCloudSchemaless.test-seed#[C266A0C0BDB597C8]) [ ] o.a.s.c.c.ZkStateReader Updated live nodes from ZooKeeper... (0) -> (1)
[junit4] 2> 312877 INFO (TEST-TestCloudSchemaless.test-seed#[C266A0C0BDB597C8]) [ ] o.a.s.c.s.i.ZkClientClusterStateProvider Cluster at 127.0.0.1:38689/solr ready
[junit4] 2> 312877 INFO (TEST-TestCloudSchemaless.test-seed#[C266A0C0BDB597C8]) [ ] o.a.s.c.ChaosMonkey monkey: init - expire sessions:false cause connection loss:false
[junit4] 2> 312895 INFO (qtp796429121-559) [n:127.0.0.1:45766_ ] o.a.s.h.a.CollectionsHandler Invoked Collection Action :create with params collection.configName=conf1&name=collection1&nrtReplicas=1&action=CREATE&numShards=4&createNodeSet=&stateFormat=2&wt=javabin&version=2 and sendToOCPQueue=true
[junit4] 2> 312919 INFO (OverseerCollectionConfigSetProcessor-74180488749383684-127.0.0.1:45766_-n_0000000000) [n:127.0.0.1:45766_ ] o.a.s.c.OverseerTaskQueue Response ZK path: /overseer/collection-queue-work/qnr-0000000000 doesn't exist. Requestor may have disconnected from ZooKeeper
[junit4] 2> 312920 INFO (OverseerThreadFactory-177-thread-2-processing-n:127.0.0.1:45766_) [n:127.0.0.1:45766_ ] o.a.s.c.a.c.CreateCollectionCmd Create collection collection1
[junit4] 2> 313497 WARN (OverseerThreadFactory-177-thread-2-processing-n:127.0.0.1:45766_) [n:127.0.0.1:45766_ ] o.a.s.c.a.c.CreateCollectionCmd It is unusual to create a collection (collection1) without cores.
[junit4] 2> 313540 INFO (qtp796429121-559) [n:127.0.0.1:45766_ ] o.a.s.h.a.CollectionsHandler Wait for new collection to be active for at most 45 seconds. Check all shard replicas
[junit4] 2> 313633 INFO (qtp796429121-559) [n:127.0.0.1:45766_ ] o.a.s.s.HttpSolrCall [admin] webapp=null path=/admin/collections params={collection.configName=conf1&name=collection1&nrtReplicas=1&action=CREATE&numShards=4&createNodeSet=&stateFormat=2&wt=javabin&version=2} status=0 QTime=737
[junit4] 2> 313651 INFO (TEST-TestCloudSchemaless.test-seed#[C266A0C0BDB597C8]) [ ] o.a.s.c.AbstractFullDistribZkTestBase Creating jetty instances pullReplicaCount=0 numOtherReplicas=8
[junit4] 2> 314941 INFO (OverseerCollectionConfigSetProcessor-74180488749383684-127.0.0.1:45766_-n_0000000000) [n:127.0.0.1:45766_ ] o.a.s.c.OverseerTaskQueue Response ZK path: /overseer/collection-queue-work/qnr-0000000002 doesn't exist. Requestor may have disconnected from ZooKeeper
[junit4] 2> 316127 INFO (TEST-TestCloudSchemaless.test-seed#[C266A0C0BDB597C8]) [ ] o.a.s.c.AbstractFullDistribZkTestBase create jetty 1 in directory /home/jenkins/jenkins-slave/workspace/Lucene-Solr-BadApples-Tests-7.x/solr/build/solr-core/test/J2/temp/solr.schema.TestCloudSchemaless_C266A0C0BDB597C8-001/shard-1-001 of type NRT
[junit4] 2> 316192 WARN (closeThreadPool-200-thread-1) [ ] o.e.j.s.AbstractConnector Ignoring deprecated socket close linger time
[junit4] 2> 316302 INFO (closeThreadPool-200-thread-1) [ ] o.a.s.c.s.e.JettySolrRunner Start Jetty (original configured port=0)
[junit4] 2> 316302 INFO (closeThreadPool-200-thread-1) [ ] o.a.s.c.s.e.JettySolrRunner Trying to start Jetty on port 0 try number 1 ...
[junit4] 2> 316302 INFO (closeThreadPool-200-thread-1) [ ] o.e.j.s.Server jetty-9.4.14.v20181114; built: 2018-11-14T21:20:31.478Z; git: c4550056e785fb5665914545889f21dc136ad9e6; jvm 1.8.0_191-b12
[junit4] 2> 316508 INFO (closeThreadPool-200-thread-1) [ ] o.e.j.s.session DefaultSessionIdManager workerName=node0
[junit4] 2> 316508 INFO (closeThreadPool-200-thread-1) [ ] o.e.j.s.session No SessionScavenger set, using defaults
[junit4] 2> 316508 INFO (closeThreadPool-200-thread-1) [ ] o.e.j.s.session node0 Scavenging every 660000ms
[junit4] 2> 316525 INFO (closeThreadPool-200-thread-1) [ ] o.e.j.s.h.ContextHandler Started o.e.j.s.ServletContextHandler@3fa96220{/,null,AVAILABLE}
[junit4] 2> 316541 INFO (closeThreadPool-200-thread-1) [ ] o.e.j.s.AbstractConnector Started ServerConnector@5228ac7e{HTTP/1.1,[http/1.1]}{127.0.0.1:41294}
[junit4] 2> 316541 INFO (closeThreadPool-200-thread-1) [ ] o.e.j.s.Server Started @316705ms
[junit4] 2> 316541 INFO (closeThreadPool-200-thread-1) [ ] o.a.s.c.s.e.JettySolrRunner Jetty properties: {solr.data.dir=/home/jenkins/jenkins-slave/workspace/Lucene-Solr-BadApples-Tests-7.x/solr/build/solr-core/test/J2/temp/solr.schema.TestCloudSchemaless_C266A0C0BDB597C8-001/tempDir-001/jetty1, replicaType=NRT, solrconfig=solrconfig.xml, hostContext=/, hostPort=41294, coreRootDirectory=/home/jenkins/jenkins-slave/workspace/Lucene-Solr-BadApples-Tests-7.x/solr/build/solr-core/test/J2/../../../../../../../../../../home/jenkins/jenkins-slave/workspace/Lucene-Solr-BadApples-Tests-7.x/solr/build/solr-core/test/J2/temp/solr.schema.TestCloudSchemaless_C266A0C0BDB597C8-001/shard-1-001/cores}
[junit4] 2> 316541 ERROR (closeThreadPool-200-thread-1) [ ] o.a.s.u.StartupLoggingUtils Missing Java Option solr.log.dir. Logging may be missing or incomplete.
[junit4] 2> 316541 INFO (closeThreadPool-200-thread-1) [ ] o.a.s.s.SolrDispatchFilter Using logger factory org.apache.logging.slf4j.Log4jLoggerFactory
[junit4] 2> 316541 INFO (closeThreadPool-200-thread-1) [ ] o.a.s.s.SolrDispatchFilter ___ _ Welcome to Apache Solr™ version 7.8.0
[junit4] 2> 316541 INFO (closeThreadPool-200-thread-1) [ ] o.a.s.s.SolrDispatchFilter / __| ___| |_ _ Starting in cloud mode on port null
[junit4] 2> 316541 INFO (closeThreadPool-200-thread-1) [ ] o.a.s.s.SolrDispatchFilter \__ \/ _ \ | '_| Install dir: null
[junit4] 2> 316541 INFO (closeThreadPool-200-thread-1) [ ] o.a.s.s.SolrDispatchFilter |___/\___/_|_| Start time: 2019-02-13T10:57:00.077Z
[junit4] 2> 316650 INFO (zkConnectionManagerCallback-202-thread-1) [ ] o.a.s.c.c.ConnectionManager zkClient has connected
[junit4] 2> 316651 INFO (closeThreadPool-200-thread-1) [ ] o.a.s.s.SolrDispatchFilter Loading solr.xml from SolrHome (not found in ZooKeeper)
[junit4] 2> 316651 INFO (closeThreadPool-200-thread-1) [ ] o.a.s.c.SolrXmlConfig Loading container configuration from /home/jenkins/jenkins-slave/workspace/Lucene-Solr-BadApples-Tests-7.x/solr/build/solr-core/test/J2/temp/solr.schema.TestCloudSchemaless_C266A0C0BDB597C8-001/shard-1-001/solr.xml
[junit4] 2> 316741 INFO (closeThreadPool-200-thread-1) [ ] o.a.s.c.SolrXmlConfig Configuration parameter autoReplicaFailoverWorkLoopDelay is ignored
[junit4] 2> 316741 INFO (closeThreadPool-200-thread-1) [ ] o.a.s.c.SolrXmlConfig Configuration parameter autoReplicaFailoverBadNodeExpiration is ignored
[junit4] 2> 316742 INFO (closeThreadPool-200-thread-1) [ ] o.a.s.c.SolrXmlConfig MBean server found: com.sun.jmx.mbeanserver.JmxMBeanServer@7edc89b5, but no JMX reporters were configured - adding default JMX reporter.
[junit4] 2> 317444 INFO (closeThreadPool-200-thread-1) [ ] o.a.s.h.c.HttpShardHandlerFactory Host whitelist initialized: WhitelistHostChecker [whitelistHosts=null, whitelistHostCheckingEnabled=false]
[junit4] 2> 317574 INFO (closeThreadPool-200-thread-1) [ ] o.a.s.c.ZkContainer Zookeeper client=127.0.0.1:38689/solr
[junit4] 2> 317630 INFO (zkConnectionManagerCallback-206-thread-1) [ ] o.a.s.c.c.ConnectionManager zkClient has connected
[junit4] 2> 317702 INFO (TEST-TestCloudSchemaless.test-seed#[C266A0C0BDB597C8]) [ ] o.a.s.c.AbstractFullDistribZkTestBase create jetty 2 in directory /home/jenkins/jenkins-slave/workspace/Lucene-Solr-BadApples-Tests-7.x/solr/build/solr-core/test/J2/temp/solr.schema.TestCloudSchemaless_C266A0C0BDB597C8-001/shard-2-001 of type NRT
[junit4] 2> 317720 INFO (zkConnectionManagerCallback-208-thread-1) [ ] o.a.s.c.c.ConnectionManager zkClient has connected
[junit4] 2> 317757 WARN (closeThreadPool-200-thread-2) [ ] o.e.j.s.AbstractConnector Ignoring deprecated socket close linger time
[junit4] 2> 317775 INFO (closeThreadPool-200-thread-2) [ ] o.a.s.c.s.e.JettySolrRunner Start Jetty (original configured port=0)
[junit4] 2> 317775 INFO (closeThreadPool-200-thread-2) [ ] o.a.s.c.s.e.JettySolrRunner Trying to start Jetty on port 0 try number 1 ...
[junit4] 2> 317775 INFO (closeThreadPool-200-thread-2) [ ] o.e.j.s.Server jetty-9.4.14.v20181114; built: 2018-11-14T21:20:31.478Z; git: c4550056e785fb5665914545889f21dc136ad9e6; jvm 1.8.0_191-b12
[junit4] 2> 317796 INFO (closeThreadPool-200-thread-1) [n:127.0.0.1:41294_ ] o.a.s.c.c.ZkStateReader Updated live nodes from ZooKeeper... (0) -> (1)
[junit4] 2> 317882 INFO (closeThreadPool-200-thread-2) [ ] o.e.j.s.session DefaultSessionIdManager workerName=node0
[junit4] 2> 317882 INFO (closeThreadPool-200-thread-2) [ ] o.e.j.s.session No SessionScavenger set, using defaults
[junit4] 2> 317882 INFO (closeThreadPool-200-thread-2) [ ] o.e.j.s.session node0 Scavenging every 660000ms
[junit4] 2> 317884 INFO (closeThreadPool-200-thread-1) [n:127.0.0.1:41294_ ] o.a.s.c.ZkController Publish node=127.0.0.1:41294_ as DOWN
[junit4] 2> 317885 INFO (closeThreadPool-200-thread-1) [n:127.0.0.1:41294_ ] o.a.s.c.TransientSolrCoreCacheDefault Allocating transient cache for 4 transient cores
[junit4] 2> 317885 INFO (closeThreadPool-200-thread-1) [n:127.0.0.1:41294_ ] o.a.s.c.ZkController Register node as live in ZooKeeper:/live_nodes/127.0.0.1:41294_
[junit4] 2> 317905 INFO (closeThreadPool-200-thread-2) [ ] o.e.j.s.h.ContextHandler Started o.e.j.s.ServletContextHandler@5d168dde{/,null,AVAILABLE}
[junit4] 2> 317979 INFO (zkCallback-187-thread-1) [ ] o.a.s.c.c.ZkStateReader Updated live nodes from ZooKeeper... (1) -> (2)
[junit4] 2> 317979 INFO (zkCallback-180-thread-3) [ ] o.a.s.c.c.ZkStateReader Updated live nodes from ZooKeeper... (1) -> (2)
[junit4] 2> 318101 INFO (zkCallback-207-thread-1) [ ] o.a.s.c.c.ZkStateReader Updated live nodes from ZooKeeper... (1) -> (2)
[junit4] 2> 318101 INFO (zkCallback-198-thread-1) [ ] o.a.s.c.c.ZkStateReader Updated live nodes from ZooKeeper... (1) -> (2)
[junit4] 2> 318102 INFO (closeThreadPool-200-thread-2) [ ] o.e.j.s.AbstractConnector Started ServerConnector@29ae184a{HTTP/1.1,[http/1.1]}{127.0.0.1:38049}
[junit4] 2> 318102 INFO (closeThreadPool-200-thread-2) [ ] o.e.j.s.Server Started @318266ms
[junit4] 2> 318102 INFO (closeThreadPool-200-thread-2) [ ] o.a.s.c.s.e.JettySolrRunner Jetty properties: {solr.data.dir=/home/jenkins/jenkins-slave/workspace/Lucene-Solr-BadApples-Tests-7.x/solr/build/solr-core/test/J2/temp/solr.schema.TestCloudSchemaless_C266A0C0BDB597C8-001/tempDir-001/jetty2, replicaType=NRT, solrconfig=solrconfig.xml, hostContext=/, hostPort=38049, coreRootDirectory=/home/jenkins/jenkins-slave/workspace/Lucene-Solr-BadApples-Tests-7.x/solr/build/solr-core/test/J2/../../../../../../../../../../home/jenkins/jenkins-slave/workspace/Lucene-Solr-BadApples-Tests-7.x/solr/build/solr-core/test/J2/temp/solr.schema.TestCloudSchemaless_C266A0C0BDB597C8-001/shard-2-001/cores}
[junit4] 2> 318102 ERROR (closeThreadPool-200-thread-2) [ ] o.a.s.u.StartupLoggingUtils Missing Java Option solr.log.dir. Logging may be missing or incomplete.
[junit4] 2> 318102 INFO (closeThreadPool-200-thread-2) [ ] o.a.s.s.SolrDispatchFilter Using logger factory org.apache.logging.slf4j.Log4jLoggerFactory
[junit4] 2> 318102 INFO (closeThreadPool-200-thread-2) [ ] o.a.s.s.SolrDispatchFilter ___ _ Welcome to Apache Solr™ version 7.8.0
[junit4] 2> 318102 INFO (closeThreadPool-200-thread-2) [ ] o.a.s.s.SolrDispatchFilter / __| ___| |_ _ Starting in cloud mode on port null
[junit4] 2> 318102 INFO (closeThreadPool-200-thread-2) [ ] o.a.s.s.SolrDispatchFilter \__ \/ _ \ | '_| Install dir: null
[junit4] 2> 318102 INFO (closeThreadPool-200-thread-2) [ ] o.a.s.s.SolrDispatchFilter |___/\___/_|_| Start time: 2019-02-13T10:57:01.638Z
[junit4] 2> 318283 INFO (zkConnectionManagerCallback-212-thread-1) [ ] o.a.s.c.c.ConnectionManager zkClient has connected
[junit4] 2> 318357 INFO (closeThreadPool-200-thread-2) [ ] o.a.s.s.SolrDispatchFilter Loading solr.xml from SolrHome (not found in ZooKeeper)
[junit4] 2> 318357 INFO (closeThreadPool-200-thread-2) [ ] o.a.s.c.SolrXmlConfig Loading container configuration from /home/jenkins/jenkins-slave/workspace/Lucene-Solr-BadApples-Tests-7.x/solr/build/solr-core/test/J2/temp/solr.schema.TestCloudSchemaless_C266A0C0BDB597C8-001/shard-2-001/solr.xml
[junit4] 2> 318393 INFO (closeThreadPool-200-thread-2) [ ] o.a.s.c.SolrXmlConfig Configuration parameter autoReplicaFailoverWorkLoopDelay is ignored
[junit4] 2> 318393 INFO (closeThreadPool-200-thread-2) [ ] o.a.s.c.SolrXmlConfig Configuration parameter autoReplicaFailoverBadNodeExpiration is ignored
[junit4] 2> 318395 INFO (closeThreadPool-200-thread-2) [ ] o.a.s.c.SolrXmlConfig MBean server found: com.sun.jmx.mbeanserver.JmxMBeanServer@7edc89b5, but no JMX reporters were configured - adding default JMX reporter.
[junit4] 2> 318530 INFO (zkConnectionManagerCallback-217-thread-1) [ ] o.a.s.c.c.ConnectionManager zkClient has connected
[junit4] 2> 318596 INFO (closeThreadPool-200-thread-1) [n:127.0.0.1:41294_ ] o.a.s.c.c.ZkStateReader Updated live nodes from ZooKeeper... (0) -> (2)
[junit4] 2> 318597 INFO (closeThreadPool-200-thread-1) [n:127.0.0.1:41294_ ] o.a.s.c.s.i.ZkClientClusterStateProvider Cluster at 127.0.0.1:38689/solr ready
[junit4] 2> 318611 INFO (closeThreadPool-200-thread-1) [n:127.0.0.1:41294_ ] o.a.s.h.a.MetricsHistoryHandler No .system collection, keeping metrics history in memory.
[junit4] 2> 318724 INFO (closeThreadPool-200-thread-1) [n:127.0.0.1:41294_ ] o.a.s.m.r.SolrJmxReporter JMX monitoring for 'solr.node' (registry 'solr.node') enabled at server: com.sun.jmx.mbeanserver.JmxMBeanServer@7edc89b5
[junit4] 2> 318940 INFO (closeThreadPool-200-thread-1) [n:127.0.0.1:41294_ ] o.a.s.m.r.SolrJmxReporter JMX monitoring for 'solr.jvm' (registry 'solr.jvm') enabled at server: com.sun.jmx.mbeanserver.JmxMBeanServer@7edc89b5
[junit4] 2> 318940 INFO (closeThreadPool-200-thread-1) [n:127.0.0.1:41294_ ] o.a.s.m.r.SolrJmxReporter JMX monitoring for 'solr.jetty' (registry 'solr.jetty') enabled at server: com.sun.jmx.mbeanserver.JmxMBeanServer@7edc89b5
[junit4] 2> 318942 INFO (closeThreadPool-200-thread-1) [n:127.0.0.1:41294_ ] o.a.s.c.CorePropertiesLocator Found 0 core definitions underneath /home/jenkins/jenkins-slave/workspace/Lucene-Solr-BadApples-Tests-7.x/solr/build/solr-core/test/J2/../../../../../../../../../../home/jenkins/jenkins-slave/workspace/Lucene-Solr-BadApples-Tests-7.x/solr/build/solr-core/test/J2/temp/solr.schema.TestCloudSchemaless_C266A0C0BDB597C8-001/shard-1-001/cores
[junit4] 2> 319231 INFO (closeThreadPool-200-thread-2) [ ] o.a.s.h.c.HttpShardHandlerFactory Host whitelist initialized: WhitelistHostChecker [whitelistHosts=null, whitelistHostCheckingEnabled=false]
[junit4] 2> 319815 INFO (closeThreadPool-200-thread-2) [ ] o.a.s.c.ZkContainer Zookeeper client=127.0.0.1:38689/solr
[junit4] 2> 319924 INFO (zkConnectionManagerCallback-222-thread-1) [ ] o.a.s.c.c.ConnectionManager zkClient has connected
[junit4] 2> 320058 INFO (TEST-TestCloudSchemaless.test-seed#[C266A0C0BDB597C8]) [ ] o.a.s.c.AbstractFullDistribZkTestBase create jetty 3 in directory /home/jenkins/jenkins-slave/workspace/Lucene-Solr-BadApples-Tests-7.x/solr/build/solr-core/test/J2/temp/solr.schema.TestCloudSchemaless_C266A0C0BDB597C8-001/shard-3-001 of type NRT
[junit4] 2> 320058 WARN (closeThreadPool-200-thread-1) [ ] o.e.j.s.AbstractConnector Ignoring deprecated socket close linger time
[junit4] 2> 320058 INFO (closeThreadPool-200-thread-1) [ ] o.a.s.c.s.e.JettySolrRunner Start Jetty (original configured port=0)
[junit4] 2> 320059 INFO (closeThreadPool-200-thread-1) [ ] o.a.s.c.s.e.JettySolrRunner Trying to start Jetty on port 0 try number 1 ...
[junit4] 2> 320059 INFO (closeThreadPool-200-thread-1) [ ] o.e.j.s.Server jetty-9.4.14.v20181114; built: 2018-11-14T21:20:31.478Z; git: c4550056e785fb5665914545889f21dc136ad9e6; jvm 1.8.0_191-b12
[junit4] 2> 320248 INFO (closeThreadPool-200-thread-1) [ ] o.e.j.s.session DefaultSessionIdManager workerName=node0
[junit4] 2> 320248 INFO (closeThreadPool-200-thread-1) [ ] o.e.j.s.session No SessionScavenger set, using defaults
[junit4] 2> 320248 INFO (closeThreadPool-200-thread-1) [ ] o.e.j.s.session node0 Scavenging every 660000ms
[junit4] 2> 320268 INFO (closeThreadPool-200-thread-1) [ ] o.e.j.s.h.ContextHandler Started o.e.j.s.ServletContextHandler@7aaa117e{/,null,AVAILABLE}
[junit4] 2> 320269 INFO (zkConnectionManagerCallback-224-thread-1) [ ] o.a.s.c.c.ConnectionManager zkClient has connected
[junit4] 2> 320277 INFO (closeThreadPool-200-thread-1) [ ] o.e.j.s.AbstractConnector Started ServerConnector@65389cc0{HTTP/1.1,[http/1.1]}{127.0.0.1:38962}
[junit4] 2> 320278 INFO (closeThreadPool-200-thread-1) [ ] o.e.j.s.Server Started @320442ms
[junit4] 2> 320278 INFO (closeThreadPool-200-thread-1) [ ] o.a.s.c.s.e.JettySolrRunner Jetty properties: {solr.data.dir=/home/jenkins/jenkins-slave/workspace/Lucene-Solr-BadApples-Tests-7.x/solr/build/solr-core/test/J2/temp/solr.schema.TestCloudSchemaless_C266A0C0BDB597C8-001/tempDir-001/jetty3, solrconfig=solrconfig.xml, hostContext=/, hostPort=38962, coreRootDirectory=/home/jenkins/jenkins-slave/workspace/Lucene-Solr-BadApples-Tests-7.x/solr/build/solr-core/test/J2/temp/solr.schema.TestCloudSchemaless_C266A0C0BDB597C8-001/shard-3-001/cores}
[junit4] 2> 320278 ERROR (closeThreadPool-200-thread-1) [ ] o.a.s.u.StartupLoggingUtils Missing Java Option solr.log.dir. Logging may be missing or incomplete.
[junit4] 2> 320278 INFO (closeThreadPool-200-thread-1) [ ] o.a.s.s.SolrDispatchFilter Using logger factory org.apache.logging.slf4j.Log4jLoggerFactory
[junit4] 2> 320278 INFO (closeThreadPool-200-thread-1) [ ] o.a.s.s.SolrDispatchFilter ___ _ Welcome to Apache Solr™ version 7.8.0
[junit4] 2> 320278 INFO (closeThreadPool-200-thread-1) [ ] o.a.s.s.SolrDispatchFilter / __| ___| |_ _ Starting in cloud mode on port null
[junit4] 2> 320278 INFO (closeThreadPool-200-thread-1) [ ] o.a.s.s.SolrDispatchFilter \__ \/ _ \ | '_| Install dir: null
[junit4] 2> 320278 INFO (closeThreadPool-200-thread-1) [ ] o.a.s.s.SolrDispatchFilter |___/\___/_|_| Start time: 2019-02-13T10:57:03.814Z
[junit4] 2> 320417 INFO (closeThreadPool-200-thread-2) [n:127.0.0.1:38049_ ] o.a.s.c.c.ZkStateReader Updated live nodes from ZooKeeper... (0) -> (2)
[junit4] 2> 320433 INFO (closeThreadPool-200-thread-2) [n:127.0.0.1:38049_ ] o.a.s.c.ZkController Publish node=127.0.0.1:38049_ as DOWN
[junit4] 2> 320434 INFO (closeThreadPool-200-thread-2) [n:127.0.0.1:38049_ ] o.a.s.c.TransientSolrCoreCacheDefault Allocating transient cache for 4 transient cores
[junit4] 2> 320434 INFO (closeThreadPool-200-thread-2) [n:127.0.0.1:38049_ ] o.a.s.c.ZkController Register node as live in ZooKeeper:/live_nodes/127.0.0.1:38049_
[junit4] 2> 320515 INFO (zkCallback-207-thread-1) [ ] o.a.s.c.c.ZkStateReader Updated live nodes from ZooKeeper... (2) -> (3)
[junit4] 2> 320515 INFO (zkCallback-180-thread-3) [ ] o.a.s.c.c.ZkStateReader Updated live nodes from ZooKeeper... (2) -> (3)
[junit4] 2> 320516 INFO (zkCallback-187-thread-1) [ ] o.a.s.c.c.ZkStateReader Updated live nodes from ZooKeeper... (2) -> (3)
[junit4] 2> 320588 INFO (zkCallback-216-thread-1) [ ] o.a.s.c.c.ZkStateReader Updated live nodes from ZooKeeper... (2) -> (3)
[junit4] 2> 320589 INFO (zkCallback-223-thread-1) [ ] o.a.s.c.c.ZkStateReader Updated live nodes from ZooKeeper... (2) -> (3)
[junit4] 2> 320596 INFO (zkConnectionManagerCallback-226-thread-1) [ ] o.a.s.c.c.ConnectionManager zkClient has connected
[junit4] 2> 320625 INFO (closeThreadPool-200-thread-1) [ ] o.a.s.s.SolrDispatchFilter Loading solr.xml from SolrHome (not found in ZooKeeper)
[junit4] 2> 320625 INFO (closeThreadPool-200-thread-1) [ ] o.a.s.c.SolrXmlConfig Loading container configuration from /home/jenkins/jenkins-slave/workspace/Lucene-Solr-BadApples-Tests-7.x/solr/build/solr-core/test/J2/temp/solr.schema.TestCloudSchemaless_C266A0C0BDB597C8-001/shard-3-001/solr.xml
[junit4] 2> 320750 INFO (zkCallback-198-thread-1) [ ] o.a.s.c.c.ZkStateReader Updated live nodes from ZooKeeper... (2) -> (3)
[junit4] 2> 320771 INFO (closeThreadPool-200-thread-1) [ ] o.a.s.c.SolrXmlConfig Configuration parameter autoReplicaFailoverWorkLoopDelay is ignored
[junit4] 2> 320771 INFO (closeThreadPool-200-thread-1) [ ] o.a.s.c.SolrXmlConfig Configuration parameter autoReplicaFailoverBadNodeExpiration is ignored
[junit4] 2> 320772 INFO (closeThreadPool-200-thread-1) [ ] o.a.s.c.SolrXmlConfig MBean server found: com.sun.jmx.mbeanserver.JmxMBeanServer@7edc89b5, but no JMX reporters were configured - adding default JMX reporter.
[junit4] 2> 321244 INFO (zkConnectionManagerCallback-233-thread-1) [ ] o.a.s.c.c.ConnectionManager zkClient has connected
[junit4] 2> 321318 INFO (closeThreadPool-200-thread-2) [n:127.0.0.1:38049_ ] o.a.s.c.c.ZkStateReader Updated live nodes from ZooKeeper... (0) -> (3)
[junit4] 2> 321338 INFO (closeThreadPool-200-thread-2) [n:127.0.0.1:38049_ ] o.a.s.c.s.i.ZkClientClusterStateProvider Cluster at 127.0.0.1:38689/solr ready
[junit4] 2> 321350 INFO (closeThreadPool-200-thread-2) [n:127.0.0.1:38049_ ] o.a.s.h.a.MetricsHistoryHandler No .system collection, keeping metrics history in memory.
[junit4] 2> 321556 INFO (closeThreadPool-200-thread-2) [n:127.0.0.1:38049_ ] o.a.s.m.r.SolrJmxReporter JMX monitoring for 'solr.node' (registry 'solr.node') enabled at server: com.sun.jmx.mbeanserver.JmxMBeanServer@7edc89b5
[junit4] 2> 321680 INFO (closeThreadPool-200-thread-2) [n:127.0.0.1:38049_ ] o.a.s.m.r.SolrJmxReporter JMX monitoring for 'solr.jvm' (registry 'solr.jvm') enabled at server: com.sun.jmx.mbeanserver.JmxMBeanServer@7edc89b5
[junit4] 2> 321680 INFO (closeThreadPool-200-thread-2) [n:127.0.0.1:38049_ ] o.a.s.m.r.SolrJmxReporter JMX monitoring for 'solr.jetty' (registry 'solr.jetty') enabled at server: com.sun.jmx.mbeanserver.JmxMBeanServer@7edc89b5
[junit4] 2> 321682 INFO (closeThreadPool-200-thread-2) [n:127.0.0.1:38049_ ] o.a.s.c.CorePropertiesLocator Found 0 core definitions underneath /home/jenkins/jenkins-slave/workspace/Lucene-Solr-BadApples-Tests-7.x/solr/build/solr-core/test/J2/../../../../../../../../../../home/jenkins/jenkins-slave/workspace/Lucene-Solr-BadApples-Tests-7.x/solr/build/solr-core/test/J2/temp/solr.schema.TestCloudSchemaless_C266A0C0BDB597C8-001/shard-2-001/cores
[junit4] 2> 322040 INFO (closeThreadPool-200-thread-1) [ ] o.a.s.h.c.HttpShardHandlerFactory Host whitelist initialized: WhitelistHostChecker [whitelistHosts=null, whitelistHostCheckingEnabled=false]
[junit4] 2> 322173 INFO (closeThreadPool-200-thread-1) [ ] o.a.s.c.ZkContainer Zookeeper client=127.0.0.1:38689/solr
[junit4] 2> 322229 INFO (zkConnectionManagerCallback-238-thread-1) [ ] o.a.s.c.c.ConnectionManager zkClient has connected
[junit4] 2> 322603 INFO (zkConnectionManagerCallback-240-thread-1) [ ] o.a.s.c.c.ConnectionManager zkClient has connected
[junit4] 2> 322739 INFO (closeThreadPool-200-thread-1) [ ] o.a.s.c.c.ZkStateReader Updated live nodes from ZooKeeper... (0) -> (3)
[junit4] 2> 322755 INFO (closeThreadPool-200-thread-1) [ ] o.a.s.c.ZkController Publish node=127.0.0.1:38962_ as DOWN
[junit4] 2> 322809 INFO (closeThreadPool-200-thread-1) [ ] o.a.s.c.TransientSolrCoreCacheDefault Allocating transient cache for 4 transient cores
[junit4] 2> 322809 INFO (closeThreadPool-200-thread-1) [ ] o.a.s.c.ZkController Register node as live in ZooKeeper:/live_nodes/127.0.0.1:38962_
[junit4] 2> 322829 INFO (zkCallback-198-thread-1) [ ] o.a.s.c.c.ZkStateReader Updated live nodes from ZooKeeper... (3) -> (4)
[junit4] 2> 322833 INFO (zkCallback-187-thread-1) [ ] o.a.s.c.c.ZkStateReader Updated live nodes from ZooKeeper... (3) -> (4)
[junit4] 2> 322833 INFO (zkCallback-207-thread-1) [ ] o.a.s.c.c.ZkStateReader Updated live nodes from ZooKeeper... (3) -> (4)
[junit4] 2> 322833 INFO (zkCallback-180-thread-1) [ ] o.a.s.c.c.ZkStateReader Updated live nodes from ZooKeeper... (3) -> (4)
[junit4] 2> 322906 INFO (zkCallback-239-thread-1) [ ] o.a.s.c.c.ZkStateReader Updated live nodes from ZooKeeper... (3) -> (4)
[junit4] 2> 323015 INFO (zkCallback-223-thread-1) [ ] o.a.s.c.c.ZkStateReader Updated live nodes from ZooKeeper... (3) -> (4)
[junit4] 2> 323015 INFO (zkCallback-232-thread-1) [ ] o.a.s.c.c.ZkStateReader Updated live nodes from ZooKeeper... (3) -> (4)
[junit4] 2> 323015 INFO (zkCallback-216-thread-1) [ ] o.a.s.c.c.ZkStateReader Updated live nodes from ZooKeeper... (3) -> (4)
[junit4] 2> 323233 INFO (TEST-TestCloudSchemaless.test-seed#[C266A0C0BDB597C8]) [ ] o.a.s.c.AbstractFullDistribZkTestBase create jetty 4 in directory /home/jenkins/jenkins-slave/workspace/Lucene-Solr-BadApples-Tests-7.x/solr/build/solr-core/test/J2/temp/solr.schema.TestCloudSchemaless_C266A0C0BDB597C8-001/shard-4-001 of type NRT
[junit4] 2> 323246 WARN (closeThreadPool-200-thread-2) [ ] o.e.j.s.AbstractConnector Ignoring deprecated socket close linger time
[junit4] 2> 323246 INFO (closeThreadPool-200-thread-2) [ ] o.a.s.c.s.e.JettySolrRunner Start Jetty (original configured port=0)
[junit4] 2> 323248 INFO (closeThreadPool-200-thread-2) [ ] o.a.s.c.s.e.JettySolrRunner Trying to start Jetty on port 0 try number 1 ...
[junit4] 2> 323248 INFO (closeThreadPool-200-thread-2) [ ] o.e.j.s.Server jetty-9.4.14.v20181114; built: 2018-11-14T21:20:31.478Z; git: c4550056e785fb5665914545889f21dc136ad9e6; jvm 1.8.0_191-b12
[junit4] 2> 323266 INFO (zkConnectionManagerCallback-247-thread-1) [ ] o.a.s.c.c.ConnectionManager zkClient has connected
[junit4] 2> 323311 INFO (closeThreadPool-200-thread-2) [ ] o.e.j.s.session DefaultSessionIdManager workerName=node0
[junit4] 2> 323311 INFO (closeThreadPool-200-thread-2) [ ] o.e.j.s.session No SessionScavenger set, using defaults
[junit4] 2> 323311 INFO (closeThreadPool-200-thread-2) [ ] o.e.j.s.session node0 Scavenging every 600000ms
[junit4] 2> 323312 INFO (closeThreadPool-200-thread-2) [ ] o.e.j.s.h.ContextHandler Started o.e.j.s.ServletContextHandler@34ce5a74{/,null,AVAILABLE}
[junit4] 2> 323477 INFO (closeThreadPool-200-thread-1) [ ] o.a.s.c.c.ZkStateReader Updated live nodes from ZooKeeper... (0) -> (4)
[junit4] 2> 323489 INFO (closeThreadPool-200-thread-2) [ ] o.e.j.s.AbstractConnector Started ServerConnector@5fd0a4a7{HTTP/1.1,[http/1.1]}{127.0.0.1:34445}
[junit4] 2> 323489 INFO (closeThreadPool-200-thread-2) [ ] o.e.j.s.Server Started @323653ms
[junit4] 2> 323489 INFO (closeThreadPool-200-thread-2) [ ] o.a.s.c.s.e.JettySolrRunner Jetty properties: {solr.data.dir=/home/jenkins/jenkins-slave/workspace/Lucene-Solr-BadApples-Tests-7.x/solr/build/solr-core/test/J2/temp/solr.schema.TestCloudSchemaless_C266A0C0BDB597C8-001/tempDir-001/jetty4, solrconfig=solrconfig.xml, hostContext=/, hostPort=34445, coreRootDirectory=/home/jenkins/jenkins-slave/workspace/Lucene-Solr-BadApples-Tests-7.x/solr/build/solr-core/test/J2/temp/solr.schema.TestCloudSchemaless_C266A0C0BDB597C8-001/shard-4-001/cores}
[junit4] 2> 323490 ERROR (closeThreadPool-200-thread-2) [ ] o.a.s.u.StartupLoggingUtils Missing Java Option solr.log.dir. Logging may be missing or incomplete.
[junit4] 2> 323490 INFO (closeThreadPool-200-thread-2) [ ] o.a.s.s.SolrDispatchFilter Using logger factory org.apache.logging.slf4j.Log4jLoggerFactory
[junit4] 2> 323490 INFO (closeThreadPool-200-thread-2) [ ] o.a.s.s.SolrDispatchFilter ___ _ Welcome to Apache Solr™ version 7.8.0
[junit4] 2> 323490 INFO (closeThreadPool-200-thread-2) [ ] o.a.s.s.SolrDispatchFilter / __| ___| |_ _ Starting in cloud mode on port null
[junit4] 2> 323490 INFO (closeThreadPool-200-thread-2) [ ] o.a.s.s.SolrDispatchFilter \__ \/ _ \ | '_| Install dir: null
[junit4] 2> 323490 INFO (closeThreadPool-200-thread-2) [ ] o.a.s.s.SolrDispatchFilter |___/\___/_|_| Start time: 2019-02-13T10:57:07.026Z
[junit4] 2> 323529 INFO (closeThreadPool-200-thread-1) [ ] o.a.s.c.s.i.ZkClientClusterStateProvider Cluster at 127.0.0.1:38689/solr ready
[junit4] 2> 323555 INFO (closeThreadPool-200-thread-1) [ ] o.a.s.h.a.MetricsHistoryHandler No .system collection, keeping metrics history in memory.
[junit4] 2> 323582 INFO (zkConnectionManagerCallback-249-thread-1) [ ] o.a.s.c.c.ConnectionManager zkClient has connected
[junit4] 2> 323619 INFO (closeThreadPool-200-thread-2) [ ] o.a.s.s.SolrDispatchFilter Loading solr.xml from SolrHome (not found in ZooKeeper)
[junit4] 2> 323619 INFO (closeThreadPool-200-thread-2) [ ] o.a.s.c.SolrXmlConfig Loading container configuration from /home/jenkins/jenkins-slave/workspace/Lucene-Solr-BadApples-Tests-7.x/solr/build/solr-core/test/J2/temp/solr.schema.TestCloudSchemaless_C266A0C0BDB597C8-001/shard-4-001/solr.xml
[junit4] 2> 323622 INFO (closeThreadPool-200-thread-2) [ ] o.a.s.c.SolrXmlConfig Configuration parameter autoReplicaFailoverWorkLoopDelay is ignored
[junit4] 2> 323622 INFO (closeThreadPool-200-thread-2) [ ] o.a.s.c.SolrXmlConfig Configuration parameter autoReplicaFailoverBadNodeExpiration is ignored
[junit4] 2> 323636 INFO (closeThreadPool-200-thread-2) [ ] o.a.s.c.SolrXmlConfig MBean server found: com.sun.jmx.mbeanserver.JmxMBeanServer@7edc89b5, but no JMX reporters were configured - adding default JMX reporter.
[junit4] 2> 323745 INFO (closeThreadPool-200-thread-1) [ ] o.a.s.m.r.SolrJmxReporter JMX monitoring for 'solr.node' (registry 'solr.node') enabled at server: com.sun.jmx.mbeanserver.JmxMBeanServer@7edc89b5
[junit4] 2> 323857 INFO (closeThreadPool-200-thread-1) [ ] o.a.s.m.r.SolrJmxReporter JMX monitoring for 'solr.jvm' (registry 'solr.jvm') enabled at server: com.sun.jmx.mbeanserver.JmxMBeanServer@7edc89b5
[junit4] 2> 323857 INFO (closeThreadPool-200-thread-1) [ ] o.a.s.m.r.SolrJmxReporter JMX monitoring for 'solr.jetty' (registry 'solr.jetty') enabled at server: com.sun.jmx.mbeanserver.JmxMBeanServer@7edc89b5
[junit4] 2> 323891 INFO (closeThreadPool-200-thread-1) [ ] o.a.s.c.CorePropertiesLocator Found 0 core definitions underneath /home/jenkins/jenkins-slave/workspace/Lucene-Solr-BadApples-Tests-7.x/solr/build/solr-core/test/J2/temp/solr.schema.TestCloudSchemaless_C266A0C0BDB597C8-001/shard-3-001/cores
[junit4] 2> 324747 INFO (closeThreadPool-200-thread-2) [ ] o.a.s.h.c.HttpShardHandlerFactory Host whitelist initialized: WhitelistHostChecker [whitelistHosts=null, whitelistHostCheckingEnabled=false]
[junit4] 2> 324769 INFO (closeThreadPool-200-thread-2) [ ] o.a.s.c.ZkContainer Zookeeper client=127.0.0.1:38689/solr
[junit4] 2> 324891 INFO (zkConnectionManagerCallback-254-thread-1) [ ] o.a.s.c.c.ConnectionManager zkClient has connected
[junit4] 2> 325054 INFO (zkConnectionManagerCallback-256-thread-1) [ ] o.a.s.c.c.ConnectionManager zkClient has connected
[junit4] 2> 325091 INFO (closeThreadPool-200-thread-2) [ ] o.a.s.c.c.ZkStateReader Updated live nodes from ZooKeeper... (0) -> (4)
[junit4] 2> 325127 INFO (closeThreadPool-200-thread-2) [ ] o.a.s.c.ZkController Publish node=127.0.0.1:34445_ as DOWN
[junit4] 2> 325128 INFO (closeThreadPool-200-thread-2) [ ] o.a.s.c.TransientSolrCoreCacheDefault Allocating transient cache for 4 transient cores
[junit4] 2> 325128 INFO (closeThreadPool-200-thread-2) [ ] o.a.s.c.ZkController Register node as live in ZooKeeper:/live_nodes/127.0.0.1:34445_
[junit4] 2> 325163 INFO (zkCallback-255-thread-1) [ ] o.a.s.c.c.ZkStateReader Updated live nodes from ZooKeeper... (4) -> (5)
[junit4] 2> 325163 INFO (zkCallback-239-thread-1) [ ] o.a.s.c.c.ZkStateReader Updated live nodes from ZooKeeper... (4) -> (5)
[junit4] 2> 325171 INFO (zkCallback-207-thread-1) [ ] o.a.s.c.c.ZkStateReader Updated live nodes from ZooKeeper... (4) -> (5)
[junit4] 2> 325171 INFO (zkCallback-187-thread-1) [ ] o.a.s.c.c.ZkStateReader Updated live nodes from ZooKeeper... (4) -> (5)
[junit4] 2> 325203 INFO (zkCallback-198-thread-1) [ ] o.a.s.c.c.ZkStateReader Updated live nodes from ZooKeeper... (4) -> (5)
[junit4] 2> 325203 INFO (zkCallback-246-thread-1) [ ] o.a.s.c.c.ZkStateReader Updated live nodes from ZooKeeper... (4) -> (5)
[junit4] 2> 325208 INFO (zkCallback-180-thread-1) [ ] o.a.s.c.c.ZkStateReader Updated live nodes from ZooKeeper... (4) -> (5)
[junit4] 2> 325208 INFO (zkCallback-232-thread-1) [ ] o.a.s.c.c.ZkStateReader Updated live nodes from ZooKeeper... (4) -> (5)
[junit4] 2> 325208 INFO (zkCallback-223-thread-1) [ ] o.a.s.c.c.ZkStateReader Updated live nodes from ZooKeeper... (4) -> (5)
[junit4] 2> 325208 INFO (zkCallback-216-thread-1) [ ] o.a.s.c.c.ZkStateReader Updated live nodes from ZooKeeper... (4) -> (5)
[junit4] 2> 325275 INFO (TEST-TestCloudSchemaless.test-seed#[C266A0C0BDB597C8]) [ ] o.a.s.c.AbstractFullDistribZkTestBase create jetty 5 in directory /home/jenkins/jenkins-slave/workspace/Lucene-Solr-BadApples-Tests-7.x/solr/build/solr-core/test/J2/temp/solr.schema.TestCloudSchemaless_C266A0C0BDB597C8-001/shard-5-001 of type NRT
[junit4] 2> 325276 WARN (closeThreadPool-200-thread-1) [ ] o.e.j.s.AbstractConnector Ignoring deprecated socket close linger time
[junit4] 2> 325276 INFO (closeThreadPool-200-thread-1) [ ] o.a.s.c.s.e.JettySolrRunner Start Jetty (original configured port=0)
[junit4] 2> 325276 INFO (closeThreadPool-200-thread-1) [ ] o.a.s.c.s.e.JettySolrRunner Trying to start Jetty on port 0 try number 1 ...
[junit4] 2> 325276 INFO (closeThreadPool-200-thread-1) [ ] o.e.j.s.Server jetty-9.4.14.v20181114; built: 2018-11-14T21:20:31.478Z; git: c4550056e785fb5665914545889f21dc136ad9e6; jvm 1.8.0_191-b12
[junit4] 2> 325369 INFO (closeThreadPool-200-thread-1) [ ] o.e.j.s.session DefaultSessionIdManager workerName=node0
[junit4] 2> 325369 INFO (closeThreadPool-200-thread-1) [ ] o.e.j.s.session No SessionScavenger set, using defaults
[junit4] 2> 325369 INFO (closeThreadPool-200-thread-1) [ ] o.e.j.s.session node0 Scavenging every 600000ms
[junit4] 2> 325401 INFO (closeThreadPool-200-thread-1) [ ] o.e.j.s.h.ContextHandler Started o.e.j.s.ServletContextHandler@34a8960b{/,null,AVAILABLE}
[junit4] 2> 325403 INFO (closeThreadPool-200-thread-1) [ ] o.e.j.s.AbstractConnector Started ServerConnector@746bacdd{HTTP/1.1,[http/1.1]}{127.0.0.1:36133}
[junit4] 2> 325403 INFO (closeThreadPool-200-thread-1) [ ] o.e.j.s.Server Started @325567ms
[junit4] 2> 325403 INFO (closeThreadPool-200-thread-1) [ ] o.a.s.c.s.e.JettySolrRunner Jetty properties: {solr.data.dir=/home/jenkins/jenkins-slave/workspace/Lucene-Solr-BadApples-Tests-7.x/solr/build/solr-core/test/J2/temp/solr.schema.TestCloudSchemaless_C266A0C0BDB597C8-001/tempDir-001/jetty5, solrconfig=solrconfig.xml, hostContext=/, hostPort=36133, coreRootDirectory=/home/jenkins/jenkins-slave/workspace/Lucene-Solr-BadApples-Tests-7.x/solr/build/solr-core/test/J2/temp/solr.schema.TestCloudSchemaless_C266A0C0BDB597C8-001/shard-5-001/cores}
[junit4] 2> 325404 ERROR (closeThreadPool-200-thread-1) [ ] o.a.s.u.StartupLoggingUtils Missing Java Option solr.log.dir. Logging may be missing or incomplete.
[junit4] 2> 325404 INFO (closeThreadPool-200-thread-1) [ ] o.a.s.s.SolrDispatchFilter Using logger factory org.apache.logging.slf4j.Log4jLoggerFactory
[junit4] 2> 325404 INFO (closeThreadPool-200-thread-1) [ ] o.a.s.s.SolrDispatchFilter ___ _ Welcome to Apache Solr™ version 7.8.0
[junit4] 2> 325404 INFO (closeThreadPool-200-thread-1) [ ] o.a.s.s.SolrDispatchFilter / __| ___| |_ _ Starting in cloud mode on port null
[junit4] 2> 325404 INFO (closeThreadPool-200-thread-1) [ ] o.a.s.s.SolrDispatchFilter \__ \/ _ \ | '_| Install dir: null
[junit4] 2> 325404 INFO (closeThreadPool-200-thread-1) [ ] o.a.s.s.SolrDispatchFilter |___/\___/_|_| Start time: 2019-02-13T10:57:08.940Z
[junit4] 2> 325588 INFO (zkConnectionManagerCallback-265-thread-1) [ ] o.a.s.c.c.ConnectionManager zkClient has connected
[junit4] 2> 325600 INFO (zkConnectionManagerCallback-263-thread-1) [ ] o.a.s.c.c.ConnectionManager zkClient has connected
[junit4] 2> 325636 INFO (closeThreadPool-200-thread-1) [ ] o.a.s.s.SolrDispatchFilter Loading solr.xml from SolrHome (not found in ZooKeeper)
[junit4] 2> 325636 INFO (closeThreadPool-200-thread-1) [ ] o.a.s.c.SolrXmlConfig Loading container configuration from /home/jenkins/jenkins-slave/workspace/Lucene-Solr-BadApples-Tests-7.x/solr/build/solr-core/test/J2/temp/solr.schema.TestCloudSchemaless_C266A0C0BDB597C8-001/shard-5-001/solr.xml
[junit4] 2> 325657 INFO (closeThreadPool-200-thread-1) [ ] o.a.s.c.SolrXmlConfig Configuration parameter autoReplicaFailoverWorkLoopDelay is ignored
[junit4] 2> 325657 INFO (closeThreadPool-200-thread-1) [ ] o.a.s.c.SolrXmlConfig Configuration parameter autoReplicaFailoverBadNodeExpiration is ignored
[junit4] 2> 325658 INFO (closeThreadPool-200-thread-1) [ ] o.a.s.c.SolrXmlConfig MBean server found: com.sun.jmx.mbeanserver.JmxMBeanServer@7edc89b5, but no JMX reporters were configured - adding default JMX reporter.
[junit4] 2> 325696 INFO (closeThreadPool-200-thread-2) [ ] o.a.s.c.c.ZkStateReader Updated live nodes from ZooKeeper... (0) -> (5)
[junit4] 2> 325712 INFO (closeThreadPool-200-thread-2) [ ] o.a.s.c.s.i.ZkClientClusterStateProvider Cluster at 127.0.0.1:38689/solr ready
[junit4] 2> 325714 INFO (closeThreadPool-200-thread-2) [ ] o.a.s.h.a.MetricsHistoryHandler No .system collection, keeping metrics history in memory.
[junit4] 2> 325863 INFO (closeThreadPool-200-thread-2) [ ] o.a.s.m.r.SolrJmxReporter JMX monitoring for 'solr.node' (registry 'solr.node') enabled at server: com.sun.jmx.mbeanserver.JmxMBeanServer@7edc89b5
[junit4] 2> 326042 INFO (closeThreadPool-200-thread-2) [ ] o.a.s.m.r.SolrJmxReporter JMX monitoring for 'solr.jvm' (registry 'solr.jvm') enabled at server: com.sun.jmx.mbeanserver.JmxMBeanServer@7edc89b5
[junit4] 2> 326187 INFO (closeThreadPool-200-thread-2) [ ] o.a.s.m.r.SolrJmxReporter JMX monitoring for 'solr.jetty' (registry 'solr.jetty') enabled at server: com.sun.jmx.mbeanserver.JmxMBeanServer@7edc89b5
[junit4] 2> 326189 INFO (closeThreadPool-200-thread-2) [ ] o.a.s.c.CorePropertiesLocator Found 0 core definitions underneath /home/jenkins/jenkins-slave/workspace/Lucene-Solr-BadApples-Tests-7.x/solr/build/solr-core/test/J2/temp/solr.schema.TestCloudSchemaless_C266A0C0BDB597C8-001/shard-4-001/cores
[junit4] 2> 326827 INFO (TEST-TestCloudSchemaless.test-seed#[C266A0C0BDB597C8]) [ ] o.a.s.c.AbstractFullDistribZkTestBase create jetty 6 in directory /home/jenkins/jenkins-slave/workspace/Lucene-Solr-BadApples-Tests-7.x/solr/build/solr-core/test/J2/temp/solr.schema.TestCloudSchemaless_C266A0C0BDB597C8-001/shard-6-001 of type NRT
[junit4] 2> 326933 INFO (closeThreadPool-200-thread-1) [ ] o.a.s.h.c.HttpShardHandlerFactory Host whitelist initialized: WhitelistHostChecker [whitelistHosts=null, whitelistHostCheckingEnabled=false]
[junit4] 2> 326933 WARN (closeThreadPool-200-thread-3) [ ] o.e.j.s.AbstractConnector Ignoring deprecated socket close linger time
[junit4] 2> 327261 INFO (closeThreadPool-200-thread-3) [ ] o.a.s.c.s.e.JettySolrRunner Start Jetty (original configured port=0)
[junit4] 2> 327261 INFO (closeThreadPool-200-thread-3) [ ] o.a.s.c.s.e.JettySolrRunner Trying to start Jetty on port 0 try number 1 ...
[junit4] 2> 327261 INFO (closeThreadPool-200-thread-3) [ ] o.e.j.s.Server jetty-9.4.14.v20181114; built: 2018-11-14T21:20:31.478Z; git: c4550056e785fb5665914545889f21dc136ad9e6; jvm 1.8.0_191-b12
[junit4] 2> 327263 INFO (closeThreadPool-200-thread-1) [ ] o.a.s.c.ZkContainer Zookeeper client=127.0.0.1:38689/solr
[junit4] 2> 327443 INFO (closeThreadPool-200-thread-3) [ ] o.e.j.s.session DefaultSessionIdManager workerName=node0
[junit4] 2> 327443 INFO (closeThreadPool-200-thread-3) [ ] o.e.j.s.session No SessionScavenger set, using defaults
[junit4] 2> 327443 INFO (closeThreadPool-200-thread-3) [ ] o.e.j.s.session node0 Scavenging every 600000ms
[junit4] 2> 327459 INFO (closeThreadPool-200-thread-3) [ ] o.e.j.s.h.ContextHandler Started o.e.j.s.ServletContextHandler@39a32464{/,null,AVAILABLE}
[junit4] 2> 327504 INFO (zkConnectionManagerCallback-270-thread-1) [ ] o.a.s.c.c.ConnectionManager zkClient has connected
[junit4] 2> 327639 INFO (closeThreadPool-200-thread-3) [ ] o.e.j.s.AbstractConnector Started ServerConnector@60808b8d{HTTP/1.1,[http/1.1]}{127.0.0.1:37533}
[junit4] 2> 327639 INFO (closeThreadPool-200-thread-3) [ ] o.e.j.s.Server Started @327803ms
[junit4] 2> 327639 INFO (closeThreadPool-200-thread-3) [ ] o.a.s.c.s.e.JettySolrRunner Jetty properties: {solr.data.dir=/home/jenkins/jenkins-slave/workspace/Lucene-Solr-BadApples-Tests-7.x/solr/build/solr-core/test/J2/temp/solr.schema.TestCloudSchemaless_C266A0C0BDB597C8-001/tempDir-001/jetty6, replicaType=NRT, solrconfig=solrconfig.xml, hostContext=/, hostPort=37533, coreRootDirectory=/home/jenkins/jenkins-slave/workspace/Lucene-Solr-BadApples-Tests-7.x/solr/build/solr-core/test/J2/../../../../../../../../../../home/jenkins/jenkins-slave/workspace/Lucene-Solr-BadApples-Tests-7.x/solr/build/solr-core/test/J2/temp/solr.schema.TestCloudSchemaless_C266A0C0BDB597C8-001/shard-6-001/cores}
[junit4] 2> 327640 ERROR (closeThreadPool-200-thread-3) [ ] o.a.s.u.StartupLoggingUtils Missing Java Option solr.log.dir. Logging may be missing or incomplete.
[junit4] 2> 327640 INFO (closeThreadPool-200-thread-3) [ ] o.a.s.s.SolrDispatchFilter Using logger factory org.apache.logging.slf4j.Log4jLoggerFactory
[junit4] 2> 327640 INFO (closeThreadPool-200-thread-3) [ ] o.a.s.s.SolrDispatchFilter ___ _ Welcome to Apache Solr™ version 7.8.0
[junit4] 2> 327640 INFO (closeThreadPool-200-thread-3) [ ] o.a.s.s.SolrDispatchFilter / __| ___| |_ _ Starting in cloud mode on port null
[junit4] 2> 327640 INFO (closeThreadPool-200-thread-3) [ ] o.a.s.s.SolrDispatchFilter \__ \/ _ \ | '_| Install dir: null
[junit4] 2> 327640 INFO (closeThreadPool-200-thread-3) [ ] o.a.s.s.SolrDispatchFilter |___/\___/_|_| Start time: 2019-02-13T10:57:11.176Z
[junit4] 2> 327878 INFO (zkConnectionManagerCallback-272-thread-1) [ ] o.a.s.c.c.ConnectionManager zkClient has connected
[junit4] 2> 327919 INFO (zkConnectionManagerCallback-274-thread-1) [ ] o.a.s.c.c.ConnectionManager zkClient has connected
[junit4] 2> 327967 INFO (closeThreadPool-200-thread-3) [ ] o.a.s.s.SolrDispatchFilter Loading solr.xml from SolrHome (not found in ZooKeeper)
[junit4] 2> 327968 INFO (closeThreadPool-200-thread-3) [ ] o.a.s.c.SolrXmlConfig Loading container configuration from /home/jenkins/jenkins-slave/workspace/Lucene-Solr-BadApples-Tests-7.x/solr/build/solr-core/test/J2/temp/solr.schema.TestCloudSchemaless_C266A0C0BDB597C8-001/shard-6-001/solr.xml
[junit4] 2> 328023 INFO (closeThreadPool-200-thread-1) [ ] o.a.s.c.c.ZkStateReader Updated live nodes from ZooKeeper... (0) -> (5)
[junit4] 2> 328102 INFO (closeThreadPool-200-thread-1) [ ] o.a.s.c.ZkController Publish node=127.0.0.1:36133_ as DOWN
[junit4] 2> 328112 INFO (closeThreadPool-200-thread-3) [ ] o.a.s.c.SolrXmlConfig Configuration parameter autoReplicaFailoverWorkLoopDelay is ignored
[junit4] 2> 328112 INFO (closeThreadPool-200-thread-3) [ ] o.a.s.c.SolrXmlConfig Configuration parameter autoReplicaFailoverBadNodeExpiration is ignored
[junit4] 2> 328113 INFO (closeThreadPool-200-thread-3) [ ] o.a.s.c.SolrXmlConfig MBean server found: com.sun.jmx.mbeanserver.JmxMBeanServer@7edc89b5, but no JMX reporters were configured - adding default JMX reporter.
[junit4] 2> 328152 INFO (closeThreadPool-200-thread-1) [ ] o.a.s.c.TransientSolrCoreCacheDefault Allocating transient cache for 4 transient cores
[junit4] 2> 328152 INFO (closeThreadPool-200-thread-1) [ ] o.a.s.c.ZkController Register node as live in ZooKeeper:/live_nodes/127.0.0.1:36133_
[junit4] 2> 328187 INFO (zkCallback-187-thread-1) [ ] o.a.s.c.c.ZkStateReader Updated live nodes from ZooKeeper... (5) -> (6)
[junit4] 2> 328187 INFO (zkCallback-207-thread-1) [ ] o.a.s.c.c.ZkStateReader Updated live nodes from ZooKeeper... (5) -> (6)
[junit4] 2> 328192 INFO (zkCallback-180-thread-1) [ ] o.a.s.c.c.ZkStateReader Updated live nodes from ZooKeeper... (5) -> (6)
[junit4] 2> 328192 INFO (zkCallback-216-thread-1) [ ] o.a.s.c.c.ZkStateReader Updated live nodes from ZooKeeper... (5) -> (6)
[junit4] 2> 328192 INFO (zkCallback-223-thread-1) [ ] o.a.s.c.c.ZkStateReader Updated live nodes from ZooKeeper... (5) -> (6)
[junit4] 2> 328209 INFO (zkCallback-239-thread-1) [ ] o.a.s.c.c.ZkStateReader Updated live nodes from ZooKeeper... (5) -> (6)
[junit4] 2> 328233 INFO (zkCallback-198-thread-1) [ ] o.a.s.c.c.ZkStateReader Updated live nodes from ZooKeeper... (5) -> (6)
[junit4] 2> 328237 INFO (zkCallback-262-thread-1) [ ] o.a.s.c.c.ZkStateReader Updated live nodes from ZooKeeper... (5) -> (6)
[junit4] 2> 328245 INFO (zkCallback-255-thread-1) [ ] o.a.s.c.c.ZkStateReader Updated live nodes from ZooKeeper... (5) -> (6)
[junit4] 2> 328246 INFO (zkCallback-246-thread-1) [ ] o.a.s.c.c.ZkStateReader Updated live nodes from ZooKeeper... (5) -> (6)
[junit4] 2> 328254 INFO (zkCallback-232-thread-1) [ ] o.a.s.c.c.ZkStateReader Updated live nodes from ZooKeeper... (5) -> (6)
[junit4] 2> 328291 INFO (zkCallback-273-thread-1) [ ] o.a.s.c.c.ZkStateReader Updated live nodes from ZooKeeper... (5) -> (6)
[junit4] 2> 328767 INFO (zkConnectionManagerCallback-281-thread-1) [ ] o.a.s.c.c.ConnectionManager zkClient has connected
[junit4] 2> 328853 INFO (closeThreadPool-200-thread-1) [ ] o.a.s.c.c.ZkStateReader Updated live nodes from ZooKeeper... (0) -> (6)
[junit4] 2> 328854 INFO (closeThreadPool-200-thread-1) [ ] o.a.s.c.s.i.ZkClientClusterStateProvider Cluster at 127.0.0.1:38689/solr ready
[junit4] 2> 328925 INFO (closeThreadPool-200-thread-1) [ ] o.a.s.h.a.MetricsHistoryHandler No .system collection, keeping metrics history in memory.
[junit4] 2> 329205 INFO (closeThreadPool-200-thread-1) [ ] o.a.s.m.r.SolrJmxReporter JMX monitoring for 'solr.node' (registry 'solr.node') enabled at server: com.sun.jmx.mbeanserver.JmxMBeanServer@7edc89b5
[junit4] 2> 329292 INFO (closeThreadPool-200-thread-1) [ ] o.a.s.m.r.SolrJmxReporter JMX monitoring for 'solr.jvm' (registry 'solr.jvm') enabled at server: com.sun.jmx.mbeanserver.JmxMBeanServer@7edc89b5
[junit4] 2> 329293 INFO (closeThreadPool-200-thread-1) [ ] o.a.s.m.r.SolrJmxReporter JMX monitoring for 'solr.jetty' (registry 'solr.jetty') enabled at server: com.sun.jmx.mbeanserver.JmxMBeanServer@7edc89b5
[junit4] 2> 329379 INFO (closeThreadPool-200-thread-1) [ ] o.a.s.c.CorePropertiesLocator Found 0 core definitions underneath /home/jenkins/jenkins-slave/workspace/Lucene-Solr-BadApples-Tests-7.x/solr/build/solr-core/test/J2/temp/solr.schema.TestCloudSchemaless_C266A0C0BDB597C8-001/shard-5-001/cores
[junit4] 2> 330400 INFO (TEST-TestCloudSchemaless.test-seed#[C266A0C0BDB597C8]) [ ] o.a.s.c.AbstractFullDistribZkTestBase create jetty 7 in directory /home/jenkins/jenkins-slave/workspace/Lucene-Solr-BadApples-Tests-7.x/solr/build/solr-core/test/J2/temp/solr.schema.TestCloudSchemaless_C266A0C0BDB597C8-001/shard-7-001 of type NRT
[junit4] 2> 330401 WARN (closeThreadPool-200-thread-1) [ ] o.e.j.s.AbstractConnector Ignoring deprecated socket close linger time
[junit4] 2> 330473 INFO (closeThreadPool-200-thread-1) [ ] o.a.s.c.s.e.JettySolrRunner Start Jetty (original configured port=0)
[junit4] 2> 330473 INFO (closeThreadPool-200-thread-1) [ ] o.a.s.c.s.e.JettySolrRunner Trying to start Jetty on port 0 try number 1 ...
[junit4] 2> 330474 INFO (closeThreadPool-200-thread-1) [ ] o.e.j.s.Server jetty-9.4.14.v20181114; built: 2018-11-14T21:20:31.478Z; git: c4550056e785fb5665914545889f21dc136ad9e6; jvm 1.8.0_191-b12
[junit4] 2> 330561 INFO (closeThreadPool-200-thread-1) [ ] o.e.j.s.session DefaultSessionIdManager workerName=node0
[junit4] 2> 330561 INFO (closeThreadPool-200-thread-1) [ ] o.e.j.s.session No SessionScavenger set, using defaults
[junit4] 2> 330561 INFO (closeThreadPool-200-thread-1) [ ] o.e.j.s.session node0 Scavenging every 600000ms
[junit4] 2> 330615 INFO (closeThreadPool-200-thread-1) [ ] o.e.j.s.h.ContextHandler Started o.e.j.s.ServletContextHandler@5c2cf170{/,null,AVAILABLE}
[junit4] 2> 330656 INFO (closeThreadPool-200-thread-1) [ ] o.e.j.s.AbstractConnector Started ServerConnector@157d0a88{HTTP/1.1,[http/1.1]}{127.0.0.1:42084}
[junit4] 2> 330657 INFO (closeThreadPool-200-thread-1) [ ] o.e.j.s.Server Started @330821ms
[junit4] 2> 330657 INFO (closeThreadPool-200-thread-1) [ ] o.a.s.c.s.e.JettySolrRunner Jetty properties: {solr.data.dir=/home/jenkins/jenkins-slave/workspace/Lucene-Solr-BadApples-Tests-7.x/solr/build/solr-core/test/J2/temp/solr.schema.TestCloudSchemaless_C266A0C0BDB597C8-001/tempDir-001/jetty7, solrconfig=solrconfig.xml, hostContext=/, hostPort=42084, coreRootDirectory=/home/jenkins/jenkins-slave/workspace/Lucene-Solr-BadApples-Tests-7.x/solr/build/solr-core/test/J2/temp/solr.schema.TestCloudSchemaless_C266A0C0BDB597C8-001/shard-7-001/cores}
[junit4] 2> 330657 ERROR (closeThreadPool-200-thread-1) [ ] o.a.s.u.StartupLoggingUtils Missing Java Option solr.log.dir. Logging may be missing or incomplete.
[junit4] 2> 330657 INFO (closeThreadPool-200-thread-1) [ ] o.a.s.s.SolrDispatchFilter Using logger factory org.apache.logging.slf4j.Log4jLoggerFactory
[junit4] 2> 330657 INFO (closeThreadPool-200-thread-
[...truncated too long message...]
BadApples-Tests-7.x/lucene/top-level-ivy-settings.xml
resolve:
ivy-availability-check:
[loadresource] Do not set property disallowed.ivy.jars.list as its length is 0.
-ivy-fail-disallowed-ivy-version:
ivy-fail:
ivy-configure:
[ivy:configure] :: loading settings :: file = /home/jenkins/jenkins-slave/workspace/Lucene-Solr-BadApples-Tests-7.x/lucene/top-level-ivy-settings.xml
resolve:
ivy-availability-check:
[loadresource] Do not set property disallowed.ivy.jars.list as its length is 0.
-ivy-fail-disallowed-ivy-version:
ivy-fail:
ivy-fail:
ivy-configure:
[ivy:configure] :: loading settings :: file = /home/jenkins/jenkins-slave/workspace/Lucene-Solr-BadApples-Tests-7.x/lucene/top-level-ivy-settings.xml
resolve:
ivy-availability-check:
[loadresource] Do not set property disallowed.ivy.jars.list as its length is 0.
-ivy-fail-disallowed-ivy-version:
ivy-fail:
ivy-configure:
[ivy:configure] :: loading settings :: file = /home/jenkins/jenkins-slave/workspace/Lucene-Solr-BadApples-Tests-7.x/lucene/top-level-ivy-settings.xml
resolve:
ivy-availability-check:
[loadresource] Do not set property disallowed.ivy.jars.list as its length is 0.
-ivy-fail-disallowed-ivy-version:
ivy-fail:
ivy-fail:
ivy-configure:
[ivy:configure] :: loading settings :: file = /home/jenkins/jenkins-slave/workspace/Lucene-Solr-BadApples-Tests-7.x/lucene/top-level-ivy-settings.xml
resolve:
ivy-availability-check:
[loadresource] Do not set property disallowed.ivy.jars.list as its length is 0.
-ivy-fail-disallowed-ivy-version:
ivy-fail:
ivy-fail:
ivy-configure:
[ivy:configure] :: loading settings :: file = /home/jenkins/jenkins-slave/workspace/Lucene-Solr-BadApples-Tests-7.x/lucene/top-level-ivy-settings.xml
resolve:
ivy-availability-check:
[loadresource] Do not set property disallowed.ivy.jars.list as its length is 0.
-ivy-fail-disallowed-ivy-version:
ivy-fail:
ivy-fail:
ivy-configure:
[ivy:configure] :: loading settings :: file = /home/jenkins/jenkins-slave/workspace/Lucene-Solr-BadApples-Tests-7.x/lucene/top-level-ivy-settings.xml
resolve:
ivy-availability-check:
[loadresource] Do not set property disallowed.ivy.jars.list as its length is 0.
-ivy-fail-disallowed-ivy-version:
ivy-fail:
ivy-fail:
ivy-configure:
[ivy:configure] :: loading settings :: file = /home/jenkins/jenkins-slave/workspace/Lucene-Solr-BadApples-Tests-7.x/lucene/top-level-ivy-settings.xml
resolve:
ivy-availability-check:
[loadresource] Do not set property disallowed.ivy.jars.list as its length is 0.
-ivy-fail-disallowed-ivy-version:
ivy-fail:
ivy-fail:
ivy-configure:
[ivy:configure] :: loading settings :: file = /home/jenkins/jenkins-slave/workspace/Lucene-Solr-BadApples-Tests-7.x/lucene/top-level-ivy-settings.xml
resolve:
ivy-availability-check:
[loadresource] Do not set property disallowed.ivy.jars.list as its length is 0.
-ivy-fail-disallowed-ivy-version:
ivy-fail:
ivy-fail:
ivy-configure:
[ivy:configure] :: loading settings :: file = /home/jenkins/jenkins-slave/workspace/Lucene-Solr-BadApples-Tests-7.x/lucene/top-level-ivy-settings.xml
resolve:
ivy-availability-check:
[loadresource] Do not set property disallowed.ivy.jars.list as its length is 0.
-ivy-fail-disallowed-ivy-version:
ivy-fail:
ivy-fail:
ivy-configure:
[ivy:configure] :: loading settings :: file = /home/jenkins/jenkins-slave/workspace/Lucene-Solr-BadApples-Tests-7.x/lucene/top-level-ivy-settings.xml
resolve:
ivy-availability-check:
[loadresource] Do not set property disallowed.ivy.jars.list as its length is 0.
-ivy-fail-disallowed-ivy-version:
ivy-fail:
ivy-fail:
ivy-configure:
[ivy:configure] :: loading settings :: file = /home/jenkins/jenkins-slave/workspace/Lucene-Solr-BadApples-Tests-7.x/lucene/top-level-ivy-settings.xml
resolve:
ivy-availability-check:
[loadresource] Do not set property disallowed.ivy.jars.list as its length is 0.
-ivy-fail-disallowed-ivy-version:
ivy-fail:
ivy-fail:
ivy-configure:
[ivy:configure] :: loading settings :: file = /home/jenkins/jenkins-slave/workspace/Lucene-Solr-BadApples-Tests-7.x/lucene/top-level-ivy-settings.xml
resolve:
ivy-availability-check:
[loadresource] Do not set property disallowed.ivy.jars.list as its length is 0.
-ivy-fail-disallowed-ivy-version:
ivy-fail:
ivy-fail:
ivy-configure:
[ivy:configure] :: loading settings :: file = /home/jenkins/jenkins-slave/workspace/Lucene-Solr-BadApples-Tests-7.x/lucene/top-level-ivy-settings.xml
resolve:
jar-checksums:
[mkdir] Created dir: /home/jenkins/jenkins-slave/workspace/Lucene-Solr-BadApples-Tests-7.x/solr/null366913484
[copy] Copying 242 files to /home/jenkins/jenkins-slave/workspace/Lucene-Solr-BadApples-Tests-7.x/solr/null366913484
[delete] Deleting directory /home/jenkins/jenkins-slave/workspace/Lucene-Solr-BadApples-Tests-7.x/solr/null366913484
check-working-copy:
[ivy:cachepath] :: resolving dependencies :: org.eclipse.jgit#org.eclipse.jgit-caller;working
[ivy:cachepath] confs: [default]
[ivy:cachepath] found org.eclipse.jgit#org.eclipse.jgit;4.6.0.201612231935-r in public
[ivy:cachepath] found com.jcraft#jsch;0.1.53 in public
[ivy:cachepath] found com.googlecode.javaewah#JavaEWAH;1.1.6 in public
[ivy:cachepath] found org.apache.httpcomponents#httpclient;4.3.6 in public
[ivy:cachepath] found org.apache.httpcomponents#httpcore;4.3.3 in public
[ivy:cachepath] found commons-logging#commons-logging;1.1.3 in public
[ivy:cachepath] found commons-codec#commons-codec;1.6 in public
[ivy:cachepath] found org.slf4j#slf4j-api;1.7.2 in public
[ivy:cachepath] :: resolution report :: resolve 70ms :: artifacts dl 1ms
---------------------------------------------------------------------
| | modules || artifacts |
| conf | number| search|dwnlded|evicted|| number|dwnlded|
---------------------------------------------------------------------
| default | 8 | 0 | 0 | 0 || 8 | 0 |
---------------------------------------------------------------------
[wc-checker] Initializing working copy...
[wc-checker] SLF4J: Failed to load class "org.slf4j.impl.StaticLoggerBinder".
[wc-checker] SLF4J: Defaulting to no-operation (NOP) logger implementation
[wc-checker] SLF4J: See http://www.slf4j.org/codes.html#StaticLoggerBinder for further details.
[wc-checker] Checking working copy status...
-jenkins-base:
BUILD SUCCESSFUL
Total time: 209 minutes 53 seconds
Archiving artifacts
java.lang.InterruptedException: no matches found within 10000
at hudson.FilePath$ValidateAntFileMask.hasMatch(FilePath.java:2847)
at hudson.FilePath$ValidateAntFileMask.invoke(FilePath.java:2726)
at hudson.FilePath$ValidateAntFileMask.invoke(FilePath.java:2707)
at hudson.FilePath$FileCallableWrapper.call(FilePath.java:3086)
Also: hudson.remoting.Channel$CallSiteStackTrace: Remote call to lucene2
at hudson.remoting.Channel.attachCallSiteStackTrace(Channel.java:1741)
at hudson.remoting.UserRequest$ExceptionResponse.retrieve(UserRequest.java:357)
at hudson.remoting.Channel.call(Channel.java:955)
at hudson.FilePath.act(FilePath.java:1072)
at hudson.FilePath.act(FilePath.java:1061)
at hudson.FilePath.validateAntFileMask(FilePath.java:2705)
at hudson.tasks.ArtifactArchiver.perform(ArtifactArchiver.java:243)
at hudson.tasks.BuildStepCompatibilityLayer.perform(BuildStepCompatibilityLayer.java:81)
at hudson.tasks.BuildStepMonitor$1.perform(BuildStepMonitor.java:20)
at hudson.model.AbstractBuild$AbstractBuildExecution.perform(AbstractBuild.java:744)
at hudson.model.AbstractBuild$AbstractBuildExecution.performAllBuildSteps(AbstractBuild.java:690)
at hudson.model.Build$BuildExecution.post2(Build.java:186)
at hudson.model.AbstractBuild$AbstractBuildExecution.post(AbstractBuild.java:635)
at hudson.model.Run.execute(Run.java:1835)
at hudson.model.FreeStyleBuild.run(FreeStyleBuild.java:43)
at hudson.model.ResourceController.execute(ResourceController.java:97)
at hudson.model.Executor.run(Executor.java:429)
Caused: hudson.FilePath$TunneledInterruptedException
at hudson.FilePath$FileCallableWrapper.call(FilePath.java:3088)
at hudson.remoting.UserRequest.perform(UserRequest.java:212)
at hudson.remoting.UserRequest.perform(UserRequest.java:54)
at hudson.remoting.Request$2.run(Request.java:369)
at hudson.remoting.InterceptingExecutorService$1.call(InterceptingExecutorService.java:72)
at java.util.concurrent.FutureTask.run(FutureTask.java:266)
at java.util.concurrent.ThreadPoolExecutor.runWorker(ThreadPoolExecutor.java:1142)
at java.util.concurrent.ThreadPoolExecutor$Worker.run(ThreadPoolExecutor.java:617)
at java.lang.Thread.run(Thread.java:748)
Caused: java.lang.InterruptedException: java.lang.InterruptedException: no matches found within 10000
at hudson.FilePath.act(FilePath.java:1074)
at hudson.FilePath.act(FilePath.java:1061)
at hudson.FilePath.validateAntFileMask(FilePath.java:2705)
at hudson.tasks.ArtifactArchiver.perform(ArtifactArchiver.java:243)
at hudson.tasks.BuildStepCompatibilityLayer.perform(BuildStepCompatibilityLayer.java:81)
at hudson.tasks.BuildStepMonitor$1.perform(BuildStepMonitor.java:20)
at hudson.model.AbstractBuild$AbstractBuildExecution.perform(AbstractBuild.java:744)
at hudson.model.AbstractBuild$AbstractBuildExecution.performAllBuildSteps(AbstractBuild.java:690)
at hudson.model.Build$BuildExecution.post2(Build.java:186)
at hudson.model.AbstractBuild$AbstractBuildExecution.post(AbstractBuild.java:635)
at hudson.model.Run.execute(Run.java:1835)
at hudson.model.FreeStyleBuild.run(FreeStyleBuild.java:43)
at hudson.model.ResourceController.execute(ResourceController.java:97)
at hudson.model.Executor.run(Executor.java:429)
No artifacts found that match the file pattern "**/*.events,heapdumps/**,**/hs_err_pid*". Configuration error?
Recording test results
Build step 'Publish JUnit test result report' changed build result to UNSTABLE
Email was triggered for: Unstable (Test Failures)
Sending email for trigger: Unstable (Test Failures)