You are viewing a plain text version of this content. The canonical link for it is here.
Posted to commits@activemq.apache.org by Apache Jenkins Server <je...@builds.apache.org> on 2016/07/28 01:36:35 UTC

Build failed in Jenkins: ActiveMQ-Java8 #779

See <https://builds.apache.org/job/ActiveMQ-Java8/779/changes>

Changes:

[christopher.l.shannon] https://issues.apache.org/jira/browse/AMQ-6377

[tabish121] https://issues.apache.org/jira/browse/AMQ-6339

[christopher.l.shannon] https://issues.apache.org/jira/browse/AMQ-6377

[tabish121] https://issues.apache.org/jira/browse/AMQ-6096

------------------------------------------
Started by an SCM change
Started by an SCM change
Started by an SCM change
Started by an SCM change
Started by an SCM change
Started by an SCM change
Started by an SCM change
[EnvInject] - Loading node environment variables.
Building remotely on H10 (docker Ubuntu ubuntu yahoo-not-h2) in workspace <https://builds.apache.org/job/ActiveMQ-Java8/ws/>
 > git rev-parse --is-inside-work-tree # timeout=10
Fetching changes from the remote Git repository
 > git config remote.origin.url https://git-wip-us.apache.org/repos/asf/activemq.git # timeout=10
Fetching upstream changes from https://git-wip-us.apache.org/repos/asf/activemq.git
 > git --version # timeout=10
 > git -c core.askpass=true fetch --tags --progress https://git-wip-us.apache.org/repos/asf/activemq.git +refs/heads/*:refs/remotes/origin/*
 > git rev-parse origin/master^{commit} # timeout=10
Checking out Revision 1bdcb4f96ffa7b08532f0ef76425416d9363c118 (origin/master)
 > git config core.sparsecheckout # timeout=10
 > git checkout -f 1bdcb4f96ffa7b08532f0ef76425416d9363c118
 > git rev-list 822e2be90e393a95cbdb998d2407b65e03bdd146 # timeout=10
[locks-and-latches] Checking to see if we really have the locks
[locks-and-latches] Have all the locks, build can start
Parsing POMs
Modules changed, recalculating dependency graph
Established TCP socket on 39606
maven32-agent.jar already up to date
maven32-interceptor.jar already up to date
maven3-interceptor-commons.jar already up to date
[ActiveMQ-Java8] $ /home/jenkins/jenkins-slave/tools/hudson.model.JDK/jdk1.8.0_05/bin/java -Xmx2048m -Xms1024m -cp /home/jenkins/jenkins-slave/maven32-agent.jar:/home/jenkins/tools/maven/latest3/boot/plexus-classworlds-2.5.2.jar:/home/jenkins/tools/maven/latest3/conf/logging jenkins.maven3.agent.Maven32Main /home/jenkins/tools/maven/latest3/ /home/jenkins/jenkins-slave/slave.jar /home/jenkins/jenkins-slave/maven32-interceptor.jar /home/jenkins/jenkins-slave/maven3-interceptor-commons.jar 39606
Exception in thread "main" java.lang.ClassNotFoundException: hudson.remoting.Launcher
	at org.codehaus.plexus.classworlds.strategy.SelfFirstStrategy.loadClass(SelfFirstStrategy.java:50)
	at org.codehaus.plexus.classworlds.realm.ClassRealm.unsynchronizedLoadClass(ClassRealm.java:271)
	at org.codehaus.plexus.classworlds.realm.ClassRealm.loadClass(ClassRealm.java:247)
	at org.codehaus.plexus.classworlds.realm.ClassRealm.loadClass(ClassRealm.java:239)
	at jenkins.maven3.agent.Maven32Main.main(Maven32Main.java:143)
	at jenkins.maven3.agent.Maven32Main.main(Maven32Main.java:74)
[locks-and-latches] Releasing all the locks
[locks-and-latches] All the locks released
ERROR: Failed to parse POMs
java.io.EOFException: unexpected stream termination
	at hudson.remoting.ChannelBuilder.negotiate(ChannelBuilder.java:365)
	at hudson.remoting.ChannelBuilder.build(ChannelBuilder.java:310)
	at hudson.slaves.Channels.forProcess(Channels.java:115)
	at hudson.maven.AbstractMavenProcessFactory.newProcess(AbstractMavenProcessFactory.java:297)
	at hudson.maven.ProcessCache.get(ProcessCache.java:236)
	at hudson.maven.MavenModuleSetBuild$MavenModuleSetBuildExecution.doRun(MavenModuleSetBuild.java:778)
	at hudson.model.AbstractBuild$AbstractBuildExecution.run(AbstractBuild.java:534)
	at hudson.model.Run.execute(Run.java:1738)
	at hudson.maven.MavenModuleSetBuild.run(MavenModuleSetBuild.java:531)
	at hudson.model.ResourceController.execute(ResourceController.java:98)
	at hudson.model.Executor.run(Executor.java:410)

Jenkins build is still unstable: ActiveMQ-Java8 #814

Posted by Apache Jenkins Server <je...@builds.apache.org>.
See <https://builds.apache.org/job/ActiveMQ-Java8/changes>


Jenkins build is still unstable: ActiveMQ-Java8 #813

Posted by Apache Jenkins Server <je...@builds.apache.org>.
See <https://builds.apache.org/job/ActiveMQ-Java8/changes>


Jenkins build is still unstable: ActiveMQ-Java8 #812

Posted by Apache Jenkins Server <je...@builds.apache.org>.
See <https://builds.apache.org/job/ActiveMQ-Java8/changes>


Jenkins build is still unstable: ActiveMQ-Java8 #811

Posted by Apache Jenkins Server <je...@builds.apache.org>.
See <https://builds.apache.org/job/ActiveMQ-Java8/changes>


Jenkins build is still unstable: ActiveMQ-Java8 #810

Posted by Apache Jenkins Server <je...@builds.apache.org>.
See <https://builds.apache.org/job/ActiveMQ-Java8/changes>


Jenkins build is still unstable: ActiveMQ-Java8 #809

Posted by Apache Jenkins Server <je...@builds.apache.org>.
See <https://builds.apache.org/job/ActiveMQ-Java8/changes>


Jenkins build is still unstable: ActiveMQ-Java8 #808

Posted by Apache Jenkins Server <je...@builds.apache.org>.
See <https://builds.apache.org/job/ActiveMQ-Java8/changes>


Jenkins build is still unstable: ActiveMQ-Java8 #807

Posted by Apache Jenkins Server <je...@builds.apache.org>.
See <https://builds.apache.org/job/ActiveMQ-Java8/changes>


Jenkins build is still unstable: ActiveMQ-Java8 #806

Posted by Apache Jenkins Server <je...@builds.apache.org>.
See <https://builds.apache.org/job/ActiveMQ-Java8/changes>


Jenkins build is unstable: ActiveMQ-Java8 #805

Posted by Apache Jenkins Server <je...@builds.apache.org>.
See <https://builds.apache.org/job/ActiveMQ-Java8/805/changes>


Build failed in Jenkins: ActiveMQ-Java8 #804

Posted by Apache Jenkins Server <je...@builds.apache.org>.
See <https://builds.apache.org/job/ActiveMQ-Java8/804/changes>

Changes:

[gtully] AMQ-6403 - add indexDirectory attribute to kahadb plist impl - settable

------------------------------------------
[...truncated 2744 lines...]
	at org.apache.felix.bundlerepository.impl.DataModelHelperImpl.writeRepository(DataModelHelperImpl.java:186)
	at org.apache.felix.obrplugin.ObrUpdate.writeRepositoryXml(ObrUpdate.java:274)
	... 34 more
[INFO] 
[INFO] >>> maven-source-plugin:2.4:jar (default-cli) > generate-sources @ activemq-blueprint >>>
[INFO] 
[INFO] --- maven-enforcer-plugin:1.3.1:enforce (default) @ activemq-blueprint ---
[INFO] 
[INFO] --- maven-bundle-plugin:2.3.7:cleanVersions (cleanVersions) @ activemq-blueprint ---
[WARNING] Failed to getClass for org.apache.maven.plugin.source.SourceJarMojo
[INFO] 
[INFO] <<< maven-source-plugin:2.4:jar (default-cli) < generate-sources @ activemq-blueprint <<<
[INFO] 
[INFO] --- maven-source-plugin:2.4:jar (default-cli) @ activemq-blueprint ---
[INFO] Building jar: <https://builds.apache.org/job/ActiveMQ-Java8/ws/activemq-blueprint/target/activemq-blueprint-5.15.0-SNAPSHOT-sources.jar>
[INFO]                                                                         
[INFO] ------------------------------------------------------------------------
[INFO] Skipping ActiveMQ :: Web Demo
[INFO] This project has been banned from the build due to previous failures.
[INFO] ------------------------------------------------------------------------
[INFO]                                                                         
[INFO] ------------------------------------------------------------------------
[INFO] Skipping ActiveMQ :: Web Console
[INFO] This project has been banned from the build due to previous failures.
[INFO] ------------------------------------------------------------------------
[INFO]                                                                         
[INFO] ------------------------------------------------------------------------
[INFO] Skipping ActiveMQ :: Karaf Integration Tests
[INFO] This project has been banned from the build due to previous failures.
[INFO] ------------------------------------------------------------------------
[INFO]                                                                         
[INFO] ------------------------------------------------------------------------
[INFO] Skipping ActiveMQ :: Integration Test :: Spring 3.1
[INFO] This project has been banned from the build due to previous failures.
[INFO] ------------------------------------------------------------------------
[INFO]                                                                         
[INFO] ------------------------------------------------------------------------
[INFO] Skipping ActiveMQ :: Assembly
[INFO] This project has been banned from the build due to previous failures.
[INFO] ------------------------------------------------------------------------
[INFO] ------------------------------------------------------------------------
[INFO] Reactor Summary:
[INFO] 
[INFO] ActiveMQ ........................................... SUCCESS [  6.953 s]
[INFO] ActiveMQ :: Openwire Generator ..................... SUCCESS [  7.354 s]
[INFO] ActiveMQ :: Client ................................. SUCCESS [02:26 min]
[INFO] ActiveMQ :: Openwire Legacy Support ................ SUCCESS [  5.748 s]
[INFO] ActiveMQ :: JAAS ................................... SUCCESS [  9.770 s]
[INFO] ActiveMQ :: Broker ................................. SUCCESS [01:38 min]
[INFO] ActiveMQ :: KahaDB Store ........................... SUCCESS [04:20 min]
[INFO] ActiveMQ :: STOMP Protocol ......................... SUCCESS [11:47 min]
[INFO] ActiveMQ :: MQTT Protocol .......................... SUCCESS [22:04 min]
[INFO] ActiveMQ :: JDBC Store ............................. SUCCESS [  5.813 s]
[INFO] ActiveMQ :: LevelDB Store .......................... FAILURE [  5.038 s]
[INFO] ActiveMQ :: Generic JMS Pool ....................... SUCCESS [ 48.359 s]
[INFO] ActiveMQ :: Pool ................................... SUCCESS [  7.724 s]
[INFO] ActiveMQ :: RA ..................................... SUCCESS [02:45 min]
[INFO] ActiveMQ :: Spring ................................. SKIPPED
[INFO] ActiveMQ :: Console ................................ SUCCESS [  7.893 s]
[INFO] ActiveMQ :: Partition Management ................... SKIPPED
[INFO] ActiveMQ :: Runtime Configuration .................. SKIPPED
[INFO] ActiveMQ :: Tooling ................................ SUCCESS [  1.651 s]
[INFO] ActiveMQ :: JUnit Rule ............................. SKIPPED
[INFO] ActiveMQ :: Unit Tests ............................. SKIPPED
[INFO] ActiveMQ :: HTTP Protocol Support .................. SKIPPED
[INFO] ActiveMQ :: AMQP ................................... SKIPPED
[INFO] ActiveMQ :: Camel .................................. SKIPPED
[INFO] ActiveMQ :: All JAR bundle ......................... SKIPPED
[INFO] ActiveMQ :: Log4j Appender ......................... SUCCESS [  7.167 s]
[INFO] ActiveMQ :: Apache Karaf ........................... SKIPPED
[INFO] ActiveMQ :: ConnectionFactory ...................... SUCCESS [  7.492 s]
[INFO] ActiveMQ :: RAR .................................... SKIPPED
[INFO] ActiveMQ :: Run Jar ................................ SUCCESS [  5.158 s]
[INFO] ActiveMQ :: Shiro .................................. SKIPPED
[INFO] ActiveMQ :: Memory Usage Test Plugin ............... SUCCESS [  4.987 s]
[INFO] ActiveMQ :: Performance Test Plugin ................ SKIPPED
[INFO] ActiveMQ :: StartUp/Stop Plugin .................... SKIPPED
[INFO] ActiveMQ :: Web .................................... SKIPPED
[INFO] ActiveMQ :: OSGi bundle ............................ SKIPPED
[INFO] ActiveMQ :: Blueprint .............................. SUCCESS [  5.616 s]
[INFO] ActiveMQ :: Web Demo ............................... SKIPPED
[INFO] ActiveMQ :: Web Console ............................ SKIPPED
[INFO] ActiveMQ :: Karaf Integration Tests ................ SKIPPED
[INFO] ActiveMQ :: Integration Test :: Spring 3.1 ......... SKIPPED
[INFO] ActiveMQ :: Assembly ............................... SKIPPED
[INFO] ------------------------------------------------------------------------
[INFO] BUILD FAILURE
[INFO] ------------------------------------------------------------------------
[INFO] Total time: 48:19 min
[INFO] Finished at: 2016-08-24T11:43:48+00:00
[INFO] Final Memory: 101M/1276M
[INFO] ------------------------------------------------------------------------
Waiting for Jenkins to finish collecting data
[ERROR] Failed to execute goal org.apache.maven.plugins:maven-compiler-plugin:3.3:compile (default-compile) on project activemq-leveldb-store: Compilation failure: Compilation failure:
[ERROR] <https://builds.apache.org/job/ActiveMQ-Java8/ws/activemq-leveldb-store/src/main/java/org/apache/activemq/store/leveldb/ReplicatedLevelDBPersistenceAdapter.java>:[19,46] cannot find symbol
[ERROR] symbol:   class ElectingLevelDBStore
[ERROR] location: package org.apache.activemq.leveldb.replicated
[ERROR] <https://builds.apache.org/job/ActiveMQ-Java8/ws/activemq-leveldb-store/src/main/java/org/apache/activemq/store/leveldb/ReplicatedLevelDBPersistenceAdapter.java>:[30,58] cannot find symbol
[ERROR] symbol: class ElectingLevelDBStore
[ERROR] <https://builds.apache.org/job/ActiveMQ-Java8/ws/activemq-leveldb-store/src/main/java/org/apache/activemq/store/leveldb/LevelDBPersistenceAdapter.java>:[19,35] cannot find symbol
[ERROR] symbol:   class LevelDBStore
[ERROR] location: package org.apache.activemq.leveldb
[ERROR] <https://builds.apache.org/job/ActiveMQ-Java8/ws/activemq-leveldb-store/src/main/java/org/apache/activemq/store/leveldb/LevelDBPersistenceAdapter.java>:[29,48] cannot find symbol
[ERROR] symbol: class LevelDBStore
[ERROR] <https://builds.apache.org/job/ActiveMQ-Java8/ws/activemq-leveldb-store/src/main/java/org/apache/activemq/leveldb/LevelDBStoreFactory.java>:[51,9] cannot find symbol
[ERROR] symbol:   class LevelDBStore
[ERROR] location: class org.apache.activemq.leveldb.LevelDBStoreFactory
[ERROR] <https://builds.apache.org/job/ActiveMQ-Java8/ws/activemq-leveldb-store/src/main/java/org/apache/activemq/leveldb/LevelDBStoreFactory.java>:[51,34] cannot find symbol
[ERROR] symbol:   class LevelDBStore
[ERROR] location: class org.apache.activemq.leveldb.LevelDBStoreFactory
[ERROR] <https://builds.apache.org/job/ActiveMQ-Java8/ws/activemq-leveldb-store/src/main/java/org/apache/activemq/store/leveldb/ReplicatedLevelDBPersistenceAdapter.java>:[30,8] org.apache.activemq.store.leveldb.ReplicatedLevelDBPersistenceAdapter is not abstract and does not override abstract method getLastProducerSequenceId(org.apache.activemq.command.ProducerId) in org.apache.activemq.store.PersistenceAdapter
[ERROR] -> [Help 1]
org.apache.maven.lifecycle.LifecycleExecutionException: Failed to execute goal org.apache.maven.plugins:maven-compiler-plugin:3.3:compile (default-compile) on project activemq-leveldb-store: Compilation failure
	at org.apache.maven.lifecycle.internal.MojoExecutor.execute(MojoExecutor.java:212)
	at org.apache.maven.lifecycle.internal.MojoExecutor.execute(MojoExecutor.java:153)
	at org.apache.maven.lifecycle.internal.MojoExecutor.execute(MojoExecutor.java:145)
	at org.apache.maven.lifecycle.internal.LifecycleModuleBuilder.buildProject(LifecycleModuleBuilder.java:116)
	at org.apache.maven.lifecycle.internal.LifecycleModuleBuilder.buildProject(LifecycleModuleBuilder.java:80)
	at org.apache.maven.lifecycle.internal.builder.singlethreaded.SingleThreadedBuilder.build(SingleThreadedBuilder.java:51)
	at org.apache.maven.lifecycle.internal.LifecycleStarter.execute(LifecycleStarter.java:128)
	at org.apache.maven.DefaultMaven.doExecute(DefaultMaven.java:307)
	at org.apache.maven.DefaultMaven.doExecute(DefaultMaven.java:193)
	at org.apache.maven.DefaultMaven.execute(DefaultMaven.java:106)
	at org.jvnet.hudson.maven3.launcher.Maven32Launcher.main(Maven32Launcher.java:132)
	at sun.reflect.NativeMethodAccessorImpl.invoke0(Native Method)
	at sun.reflect.NativeMethodAccessorImpl.invoke(NativeMethodAccessorImpl.java:62)
	at sun.reflect.DelegatingMethodAccessorImpl.invoke(DelegatingMethodAccessorImpl.java:43)
	at java.lang.reflect.Method.invoke(Method.java:498)
	at org.codehaus.plexus.classworlds.launcher.Launcher.launchStandard(Launcher.java:330)
	at org.codehaus.plexus.classworlds.launcher.Launcher.launch(Launcher.java:238)
	at jenkins.maven3.agent.Maven32Main.launch(Maven32Main.java:186)
	at sun.reflect.NativeMethodAccessorImpl.invoke0(Native Method)
	at sun.reflect.NativeMethodAccessorImpl.invoke(NativeMethodAccessorImpl.java:62)
	at sun.reflect.DelegatingMethodAccessorImpl.invoke(DelegatingMethodAccessorImpl.java:43)
	at java.lang.reflect.Method.invoke(Method.java:498)
	at hudson.maven.Maven3Builder.call(Maven3Builder.java:136)
	at hudson.maven.Maven3Builder.call(Maven3Builder.java:71)
	at hudson.remoting.UserRequest.perform(UserRequest.java:153)
	at hudson.remoting.UserRequest.perform(UserRequest.java:50)
	at hudson.remoting.Request$2.run(Request.java:332)
	at hudson.remoting.InterceptingExecutorService$1.call(InterceptingExecutorService.java:68)
	at java.util.concurrent.FutureTask.run(FutureTask.java:266)
	at java.util.concurrent.ThreadPoolExecutor.runWorker(ThreadPoolExecutor.java:1142)
	at java.util.concurrent.ThreadPoolExecutor$Worker.run(ThreadPoolExecutor.java:617)
	at java.lang.Thread.run(Thread.java:745)
Caused by: org.apache.maven.plugin.compiler.CompilationFailureException: Compilation failure
	at org.apache.maven.plugin.compiler.AbstractCompilerMojo.execute(AbstractCompilerMojo.java:911)
	at org.apache.maven.plugin.compiler.CompilerMojo.execute(CompilerMojo.java:129)
	at org.apache.maven.plugin.DefaultBuildPluginManager.executeMojo(DefaultBuildPluginManager.java:134)
	at org.apache.maven.lifecycle.internal.MojoExecutor.execute(MojoExecutor.java:207)
	... 31 more
[ERROR] 
[ERROR] Re-run Maven using the -X switch to enable full debug logging.
[ERROR] 
[ERROR] For more information about the errors and possible solutions, please read the following articles:
[ERROR] [Help 1] http://cwiki.apache.org/confluence/display/MAVEN/MojoFailureException
[ERROR] 
[ERROR] After correcting the problems, you can resume the build with the command
[ERROR]   mvn <goals> -rf :activemq-leveldb-store
[JENKINS] Archiving <https://builds.apache.org/job/ActiveMQ-Java8/ws/activemq-kahadb-store/pom.xml> to org.apache.activemq/activemq-kahadb-store/5.15.0-SNAPSHOT/activemq-kahadb-store-5.15.0-SNAPSHOT.pom
[JENKINS] Archiving <https://builds.apache.org/job/ActiveMQ-Java8/ws/activemq-kahadb-store/target/activemq-kahadb-store-5.15.0-SNAPSHOT.jar> to org.apache.activemq/activemq-kahadb-store/5.15.0-SNAPSHOT/activemq-kahadb-store-5.15.0-SNAPSHOT.jar
[JENKINS] Archiving <https://builds.apache.org/job/ActiveMQ-Java8/ws/activemq-kahadb-store/target/activemq-kahadb-store-5.15.0-SNAPSHOT-sources.jar> to org.apache.activemq/activemq-kahadb-store/5.15.0-SNAPSHOT/activemq-kahadb-store-5.15.0-SNAPSHOT-sources.jar
[JENKINS] Archiving <https://builds.apache.org/job/ActiveMQ-Java8/ws/activemq-osgi/pom.xml> to org.apache.activemq/activemq-osgi/5.15.0-SNAPSHOT/activemq-osgi-5.15.0-SNAPSHOT.pom
[JENKINS] Archiving <https://builds.apache.org/job/ActiveMQ-Java8/ws/activemq-unit-tests/pom.xml> to org.apache.activemq/activemq-unit-tests/5.15.0-SNAPSHOT/activemq-unit-tests-5.15.0-SNAPSHOT.pom
Compressed 71.24 KB of artifacts by 44.9% relative to #803
[JENKINS] Archiving <https://builds.apache.org/job/ActiveMQ-Java8/ws/activemq-openwire-legacy/pom.xml> to org.apache.activemq/activemq-openwire-legacy/5.15.0-SNAPSHOT/activemq-openwire-legacy-5.15.0-SNAPSHOT.pom
[JENKINS] Archiving <https://builds.apache.org/job/ActiveMQ-Java8/ws/activemq-openwire-legacy/target/activemq-openwire-legacy-5.15.0-SNAPSHOT.jar> to org.apache.activemq/activemq-openwire-legacy/5.15.0-SNAPSHOT/activemq-openwire-legacy-5.15.0-SNAPSHOT.jar
[JENKINS] Archiving <https://builds.apache.org/job/ActiveMQ-Java8/ws/activemq-openwire-legacy/target/activemq-openwire-legacy-5.15.0-SNAPSHOT-sources.jar> to org.apache.activemq/activemq-openwire-legacy/5.15.0-SNAPSHOT/activemq-openwire-legacy-5.15.0-SNAPSHOT-sources.jar
[JENKINS] Archiving <https://builds.apache.org/job/ActiveMQ-Java8/ws/activemq-karaf-itest/pom.xml> to org.apache.activemq/activemq-karaf-itest/5.15.0-SNAPSHOT/activemq-karaf-itest-5.15.0-SNAPSHOT.pom
[JENKINS] Archiving <https://builds.apache.org/job/ActiveMQ-Java8/ws/activemq-rar/pom.xml> to org.apache.activemq/activemq-rar/5.15.0-SNAPSHOT/activemq-rar-5.15.0-SNAPSHOT.pom
[JENKINS] Archiving <https://builds.apache.org/job/ActiveMQ-Java8/ws/activemq-http/pom.xml> to org.apache.activemq/activemq-http/5.15.0-SNAPSHOT/activemq-http-5.15.0-SNAPSHOT.pom
[JENKINS] Archiving <https://builds.apache.org/job/ActiveMQ-Java8/ws/activemq-amqp/pom.xml> to org.apache.activemq/activemq-amqp/5.15.0-SNAPSHOT/activemq-amqp-5.15.0-SNAPSHOT.pom
[JENKINS] Archiving <https://builds.apache.org/job/ActiveMQ-Java8/ws/activemq-client/pom.xml> to org.apache.activemq/activemq-client/5.15.0-SNAPSHOT/activemq-client-5.15.0-SNAPSHOT.pom
[JENKINS] Archiving <https://builds.apache.org/job/ActiveMQ-Java8/ws/activemq-client/target/activemq-client-5.15.0-SNAPSHOT.jar> to org.apache.activemq/activemq-client/5.15.0-SNAPSHOT/activemq-client-5.15.0-SNAPSHOT.jar
[JENKINS] Archiving <https://builds.apache.org/job/ActiveMQ-Java8/ws/activemq-client/target/activemq-client-5.15.0-SNAPSHOT-sources.jar> to org.apache.activemq/activemq-client/5.15.0-SNAPSHOT/activemq-client-5.15.0-SNAPSHOT-sources.jar
[JENKINS] Archiving <https://builds.apache.org/job/ActiveMQ-Java8/ws/activemq-blueprint/pom.xml> to org.apache.activemq/activemq-blueprint/5.15.0-SNAPSHOT/activemq-blueprint-5.15.0-SNAPSHOT.pom
[JENKINS] Archiving <https://builds.apache.org/job/ActiveMQ-Java8/ws/activemq-blueprint/target/activemq-blueprint-5.15.0-SNAPSHOT.jar> to org.apache.activemq/activemq-blueprint/5.15.0-SNAPSHOT/activemq-blueprint-5.15.0-SNAPSHOT.jar
[JENKINS] Archiving <https://builds.apache.org/job/ActiveMQ-Java8/ws/activemq-blueprint/target/activemq-blueprint-5.15.0-SNAPSHOT-sources.jar> to org.apache.activemq/activemq-blueprint/5.15.0-SNAPSHOT/activemq-blueprint-5.15.0-SNAPSHOT-sources.jar
[JENKINS] Archiving <https://builds.apache.org/job/ActiveMQ-Java8/ws/activemq-tooling/activemq-junit/pom.xml> to org.apache.activemq.tooling/activemq-junit/5.15.0-SNAPSHOT/activemq-junit-5.15.0-SNAPSHOT.pom
[JENKINS] Archiving <https://builds.apache.org/job/ActiveMQ-Java8/ws/activemq-tooling/pom.xml> to org.apache.activemq.tooling/activemq-tooling/5.15.0-SNAPSHOT/activemq-tooling-5.15.0-SNAPSHOT.pom
[JENKINS] Archiving <https://builds.apache.org/job/ActiveMQ-Java8/ws/activemq-jms-pool/pom.xml> to org.apache.activemq/activemq-jms-pool/5.15.0-SNAPSHOT/activemq-jms-pool-5.15.0-SNAPSHOT.pom
[JENKINS] Archiving <https://builds.apache.org/job/ActiveMQ-Java8/ws/activemq-jms-pool/target/activemq-jms-pool-5.15.0-SNAPSHOT.jar> to org.apache.activemq/activemq-jms-pool/5.15.0-SNAPSHOT/activemq-jms-pool-5.15.0-SNAPSHOT.jar
[JENKINS] Archiving <https://builds.apache.org/job/ActiveMQ-Java8/ws/activemq-jms-pool/target/activemq-jms-pool-5.15.0-SNAPSHOT-sources.jar> to org.apache.activemq/activemq-jms-pool/5.15.0-SNAPSHOT/activemq-jms-pool-5.15.0-SNAPSHOT-sources.jar
[JENKINS] Archiving <https://builds.apache.org/job/ActiveMQ-Java8/ws/activemq-pool/pom.xml> to org.apache.activemq/activemq-pool/5.15.0-SNAPSHOT/activemq-pool-5.15.0-SNAPSHOT.pom
[JENKINS] Archiving <https://builds.apache.org/job/ActiveMQ-Java8/ws/activemq-pool/target/activemq-pool-5.15.0-SNAPSHOT.jar> to org.apache.activemq/activemq-pool/5.15.0-SNAPSHOT/activemq-pool-5.15.0-SNAPSHOT.jar
[JENKINS] Archiving <https://builds.apache.org/job/ActiveMQ-Java8/ws/activemq-pool/target/activemq-pool-5.15.0-SNAPSHOT-sources.jar> to org.apache.activemq/activemq-pool/5.15.0-SNAPSHOT/activemq-pool-5.15.0-SNAPSHOT-sources.jar
[JENKINS] Archiving <https://builds.apache.org/job/ActiveMQ-Java8/ws/activemq-jdbc-store/pom.xml> to org.apache.activemq/activemq-jdbc-store/5.15.0-SNAPSHOT/activemq-jdbc-store-5.15.0-SNAPSHOT.pom
[JENKINS] Archiving <https://builds.apache.org/job/ActiveMQ-Java8/ws/activemq-jdbc-store/target/activemq-jdbc-store-5.15.0-SNAPSHOT.jar> to org.apache.activemq/activemq-jdbc-store/5.15.0-SNAPSHOT/activemq-jdbc-store-5.15.0-SNAPSHOT.jar
[JENKINS] Archiving <https://builds.apache.org/job/ActiveMQ-Java8/ws/activemq-jdbc-store/target/activemq-jdbc-store-5.15.0-SNAPSHOT-sources.jar> to org.apache.activemq/activemq-jdbc-store/5.15.0-SNAPSHOT/activemq-jdbc-store-5.15.0-SNAPSHOT-sources.jar
[JENKINS] Archiving <https://builds.apache.org/job/ActiveMQ-Java8/ws/activemq-camel/pom.xml> to org.apache.activemq/activemq-camel/5.15.0-SNAPSHOT/activemq-camel-5.15.0-SNAPSHOT.pom
[JENKINS] Archiving <https://builds.apache.org/job/ActiveMQ-Java8/ws/activemq-runtime-config/pom.xml> to org.apache.activemq/activemq-runtime-config/5.15.0-SNAPSHOT/activemq-runtime-config-5.15.0-SNAPSHOT.pom
[JENKINS] Archiving <https://builds.apache.org/job/ActiveMQ-Java8/ws/pom.xml> to org.apache.activemq/activemq-parent/5.15.0-SNAPSHOT/activemq-parent-5.15.0-SNAPSHOT.pom
Compressed 59.39 KB of artifacts by 53.9% relative to #803
[JENKINS] Archiving <https://builds.apache.org/job/ActiveMQ-Java8/ws/activemq-stomp/pom.xml> to org.apache.activemq/activemq-stomp/5.15.0-SNAPSHOT/activemq-stomp-5.15.0-SNAPSHOT.pom
[JENKINS] Archiving <https://builds.apache.org/job/ActiveMQ-Java8/ws/activemq-stomp/target/activemq-stomp-5.15.0-SNAPSHOT.jar> to org.apache.activemq/activemq-stomp/5.15.0-SNAPSHOT/activemq-stomp-5.15.0-SNAPSHOT.jar
[JENKINS] Archiving <https://builds.apache.org/job/ActiveMQ-Java8/ws/activemq-stomp/target/activemq-stomp-5.15.0-SNAPSHOT-sources.jar> to org.apache.activemq/activemq-stomp/5.15.0-SNAPSHOT/activemq-stomp-5.15.0-SNAPSHOT-sources.jar
[JENKINS] Archiving <https://builds.apache.org/job/ActiveMQ-Java8/ws/activemq-openwire-generator/pom.xml> to org.apache.activemq/activemq-openwire-generator/5.15.0-SNAPSHOT/activemq-openwire-generator-5.15.0-SNAPSHOT.pom
[JENKINS] Archiving <https://builds.apache.org/job/ActiveMQ-Java8/ws/activemq-openwire-generator/target/activemq-openwire-generator-5.15.0-SNAPSHOT.jar> to org.apache.activemq/activemq-openwire-generator/5.15.0-SNAPSHOT/activemq-openwire-generator-5.15.0-SNAPSHOT.jar
[JENKINS] Archiving <https://builds.apache.org/job/ActiveMQ-Java8/ws/activemq-openwire-generator/target/activemq-openwire-generator-5.15.0-SNAPSHOT-sources.jar> to org.apache.activemq/activemq-openwire-generator/5.15.0-SNAPSHOT/activemq-openwire-generator-5.15.0-SNAPSHOT-sources.jar
[JENKINS] Archiving <https://builds.apache.org/job/ActiveMQ-Java8/ws/activemq-broker/pom.xml> to org.apache.activemq/activemq-broker/5.15.0-SNAPSHOT/activemq-broker-5.15.0-SNAPSHOT.pom
[JENKINS] Archiving <https://builds.apache.org/job/ActiveMQ-Java8/ws/activemq-broker/target/activemq-broker-5.15.0-SNAPSHOT.jar> to org.apache.activemq/activemq-broker/5.15.0-SNAPSHOT/activemq-broker-5.15.0-SNAPSHOT.jar
[JENKINS] Archiving <https://builds.apache.org/job/ActiveMQ-Java8/ws/activemq-broker/target/activemq-broker-5.15.0-SNAPSHOT-tests.jar> to org.apache.activemq/activemq-broker/5.15.0-SNAPSHOT/activemq-broker-5.15.0-SNAPSHOT-tests.jar
[JENKINS] Archiving <https://builds.apache.org/job/ActiveMQ-Java8/ws/activemq-broker/target/activemq-broker-5.15.0-SNAPSHOT-sources.jar> to org.apache.activemq/activemq-broker/5.15.0-SNAPSHOT/activemq-broker-5.15.0-SNAPSHOT-sources.jar
[JENKINS] Archiving <https://builds.apache.org/job/ActiveMQ-Java8/ws/activemq-web-demo/pom.xml> to org.apache.activemq/activemq-web-demo/5.15.0-SNAPSHOT/activemq-web-demo-5.15.0-SNAPSHOT.pom
[JENKINS] Archiving <https://builds.apache.org/job/ActiveMQ-Java8/ws/activemq-mqtt/pom.xml> to org.apache.activemq/activemq-mqtt/5.15.0-SNAPSHOT/activemq-mqtt-5.15.0-SNAPSHOT.pom
[JENKINS] Archiving <https://builds.apache.org/job/ActiveMQ-Java8/ws/activemq-mqtt/target/activemq-mqtt-5.15.0-SNAPSHOT.jar> to org.apache.activemq/activemq-mqtt/5.15.0-SNAPSHOT/activemq-mqtt-5.15.0-SNAPSHOT.jar
[JENKINS] Archiving <https://builds.apache.org/job/ActiveMQ-Java8/ws/activemq-mqtt/target/activemq-mqtt-5.15.0-SNAPSHOT-sources.jar> to org.apache.activemq/activemq-mqtt/5.15.0-SNAPSHOT/activemq-mqtt-5.15.0-SNAPSHOT-sources.jar
[JENKINS] Archiving <https://builds.apache.org/job/ActiveMQ-Java8/ws/activemq-shiro/pom.xml> to org.apache.activemq/activemq-shiro/5.15.0-SNAPSHOT/activemq-shiro-5.15.0-SNAPSHOT.pom
[JENKINS] Archiving <https://builds.apache.org/job/ActiveMQ-Java8/ws/activemq-tooling/activemq-perf-maven-plugin/pom.xml> to org.apache.activemq.tooling/activemq-perf-maven-plugin/5.15.0-SNAPSHOT/activemq-perf-maven-plugin-5.15.0-SNAPSHOT.pom
[JENKINS] Archiving <https://builds.apache.org/job/ActiveMQ-Java8/ws/activemq-run/dependency-reduced-pom.xml> to org.apache.activemq/activemq-run/5.15.0-SNAPSHOT/activemq-run-5.15.0-SNAPSHOT.pom
[JENKINS] Archiving <https://builds.apache.org/job/ActiveMQ-Java8/ws/activemq-run/target/activemq-run-5.15.0-SNAPSHOT.jar> to org.apache.activemq/activemq-run/5.15.0-SNAPSHOT/activemq-run-5.15.0-SNAPSHOT.jar
[JENKINS] Archiving <https://builds.apache.org/job/ActiveMQ-Java8/ws/activemq-run/target/activemq-run-5.15.0-SNAPSHOT-sources.jar> to org.apache.activemq/activemq-run/5.15.0-SNAPSHOT/activemq-run-5.15.0-SNAPSHOT-sources.jar
[JENKINS] Archiving <https://builds.apache.org/job/ActiveMQ-Java8/ws/activemq-tooling/activemq-maven-plugin/pom.xml> to org.apache.activemq.tooling/activemq-maven-plugin/5.15.0-SNAPSHOT/activemq-maven-plugin-5.15.0-SNAPSHOT.pom
[JENKINS] Archiving <https://builds.apache.org/job/ActiveMQ-Java8/ws/activemq-karaf/pom.xml> to org.apache.activemq/activemq-karaf/5.15.0-SNAPSHOT/activemq-karaf-5.15.0-SNAPSHOT.pom
[JENKINS] Archiving <https://builds.apache.org/job/ActiveMQ-Java8/ws/activemq-web-console/pom.xml> to org.apache.activemq/activemq-web-console/5.15.0-SNAPSHOT/activemq-web-console-5.15.0-SNAPSHOT.pom
[JENKINS] Archiving <https://builds.apache.org/job/ActiveMQ-Java8/ws/activemq-jaas/pom.xml> to org.apache.activemq/activemq-jaas/5.15.0-SNAPSHOT/activemq-jaas-5.15.0-SNAPSHOT.pom
[JENKINS] Archiving <https://builds.apache.org/job/ActiveMQ-Java8/ws/activemq-jaas/target/activemq-jaas-5.15.0-SNAPSHOT.jar> to org.apache.activemq/activemq-jaas/5.15.0-SNAPSHOT/activemq-jaas-5.15.0-SNAPSHOT.jar
[JENKINS] Archiving <https://builds.apache.org/job/ActiveMQ-Java8/ws/activemq-jaas/target/activemq-jaas-5.15.0-SNAPSHOT-sources.jar> to org.apache.activemq/activemq-jaas/5.15.0-SNAPSHOT/activemq-jaas-5.15.0-SNAPSHOT-sources.jar
[JENKINS] Archiving <https://builds.apache.org/job/ActiveMQ-Java8/ws/activemq-itests-spring31/pom.xml> to org.apache.activemq/activemq-itests-spring31/5.15.0-SNAPSHOT/activemq-itests-spring31-5.15.0-SNAPSHOT.pom
[JENKINS] Archiving <https://builds.apache.org/job/ActiveMQ-Java8/ws/activemq-tooling/activemq-memtest-maven-plugin/pom.xml> to org.apache.activemq.tooling/activemq-memtest-maven-plugin/5.15.0-SNAPSHOT/activemq-memtest-maven-plugin-5.15.0-SNAPSHOT.pom
[JENKINS] Archiving <https://builds.apache.org/job/ActiveMQ-Java8/ws/activemq-tooling/activemq-memtest-maven-plugin/target/activemq-memtest-maven-plugin-5.15.0-SNAPSHOT.jar> to org.apache.activemq.tooling/activemq-memtest-maven-plugin/5.15.0-SNAPSHOT/activemq-memtest-maven-plugin-5.15.0-SNAPSHOT.jar
[JENKINS] Archiving <https://builds.apache.org/job/ActiveMQ-Java8/ws/activemq-tooling/activemq-memtest-maven-plugin/target/activemq-memtest-maven-plugin-5.15.0-SNAPSHOT-sources.jar> to org.apache.activemq.tooling/activemq-memtest-maven-plugin/5.15.0-SNAPSHOT/activemq-memtest-maven-plugin-5.15.0-SNAPSHOT-sources.jar
[JENKINS] Archiving <https://builds.apache.org/job/ActiveMQ-Java8/ws/activemq-ra/pom.xml> to org.apache.activemq/activemq-ra/5.15.0-SNAPSHOT/activemq-ra-5.15.0-SNAPSHOT.pom
[JENKINS] Archiving <https://builds.apache.org/job/ActiveMQ-Java8/ws/activemq-ra/target/activemq-ra-5.15.0-SNAPSHOT.jar> to org.apache.activemq/activemq-ra/5.15.0-SNAPSHOT/activemq-ra-5.15.0-SNAPSHOT.jar
[JENKINS] Archiving <https://builds.apache.org/job/ActiveMQ-Java8/ws/activemq-ra/target/xbean/activemq-ra.xsd> to org.apache.activemq/activemq-ra/5.15.0-SNAPSHOT/activemq-ra-5.15.0-SNAPSHOT.xsd
[JENKINS] Archiving <https://builds.apache.org/job/ActiveMQ-Java8/ws/activemq-ra/target/xbean/activemq-ra.xsd.html> to org.apache.activemq/activemq-ra/5.15.0-SNAPSHOT/activemq-ra-5.15.0-SNAPSHOT-schema.html
[JENKINS] Archiving <https://builds.apache.org/job/ActiveMQ-Java8/ws/activemq-ra/target/xbean/activemq-ra.xsd.html> to org.apache.activemq/activemq-ra/5.15.0-SNAPSHOT/activemq-ra-5.15.0-SNAPSHOT.xsd.html
[JENKINS] Archiving <https://builds.apache.org/job/ActiveMQ-Java8/ws/activemq-ra/target/activemq-ra-5.15.0-SNAPSHOT-sources.jar> to org.apache.activemq/activemq-ra/5.15.0-SNAPSHOT/activemq-ra-5.15.0-SNAPSHOT-sources.jar
[JENKINS] Archiving <https://builds.apache.org/job/ActiveMQ-Java8/ws/activemq-partition/pom.xml> to org.apache.activemq/activemq-partition/5.15.0-SNAPSHOT/activemq-partition-5.15.0-SNAPSHOT.pom
[JENKINS] Archiving <https://builds.apache.org/job/ActiveMQ-Java8/ws/activemq-all/pom.xml> to org.apache.activemq/activemq-all/5.15.0-SNAPSHOT/activemq-all-5.15.0-SNAPSHOT.pom
[JENKINS] Archiving <https://builds.apache.org/job/ActiveMQ-Java8/ws/assembly/pom.xml> to org.apache.activemq/apache-activemq/5.15.0-SNAPSHOT/apache-activemq-5.15.0-SNAPSHOT.pom
[JENKINS] Archiving <https://builds.apache.org/job/ActiveMQ-Java8/ws/activemq-console/pom.xml> to org.apache.activemq/activemq-console/5.15.0-SNAPSHOT/activemq-console-5.15.0-SNAPSHOT.pom
[JENKINS] Archiving <https://builds.apache.org/job/ActiveMQ-Java8/ws/activemq-console/target/activemq-console-5.15.0-SNAPSHOT.jar> to org.apache.activemq/activemq-console/5.15.0-SNAPSHOT/activemq-console-5.15.0-SNAPSHOT.jar
[JENKINS] Archiving <https://builds.apache.org/job/ActiveMQ-Java8/ws/activemq-console/target/activemq-console-5.15.0-SNAPSHOT-sources.jar> to org.apache.activemq/activemq-console/5.15.0-SNAPSHOT/activemq-console-5.15.0-SNAPSHOT-sources.jar
[JENKINS] Archiving <https://builds.apache.org/job/ActiveMQ-Java8/ws/activemq-spring/pom.xml> to org.apache.activemq/activemq-spring/5.15.0-SNAPSHOT/activemq-spring-5.15.0-SNAPSHOT.pom
[JENKINS] Archiving <https://builds.apache.org/job/ActiveMQ-Java8/ws/activemq-cf/pom.xml> to org.apache.activemq/activemq-cf/5.15.0-SNAPSHOT/activemq-cf-5.15.0-SNAPSHOT.pom
[JENKINS] Archiving <https://builds.apache.org/job/ActiveMQ-Java8/ws/activemq-cf/target/activemq-cf-5.15.0-SNAPSHOT.jar> to org.apache.activemq/activemq-cf/5.15.0-SNAPSHOT/activemq-cf-5.15.0-SNAPSHOT.jar
[JENKINS] Archiving <https://builds.apache.org/job/ActiveMQ-Java8/ws/activemq-cf/target/activemq-cf-5.15.0-SNAPSHOT-sources.jar> to org.apache.activemq/activemq-cf/5.15.0-SNAPSHOT/activemq-cf-5.15.0-SNAPSHOT-sources.jar
[JENKINS] Archiving <https://builds.apache.org/job/ActiveMQ-Java8/ws/activemq-leveldb-store/pom.xml> to org.apache.activemq/activemq-leveldb-store/5.15.0-SNAPSHOT/activemq-leveldb-store-5.15.0-SNAPSHOT.pom
[JENKINS] Archiving <https://builds.apache.org/job/ActiveMQ-Java8/ws/activemq-web/pom.xml> to org.apache.activemq/activemq-web/5.15.0-SNAPSHOT/activemq-web-5.15.0-SNAPSHOT.pom
[JENKINS] Archiving <https://builds.apache.org/job/ActiveMQ-Java8/ws/activemq-log4j-appender/pom.xml> to org.apache.activemq/activemq-log4j-appender/5.15.0-SNAPSHOT/activemq-log4j-appender-5.15.0-SNAPSHOT.pom
[JENKINS] Archiving <https://builds.apache.org/job/ActiveMQ-Java8/ws/activemq-log4j-appender/target/activemq-log4j-appender-5.15.0-SNAPSHOT.jar> to org.apache.activemq/activemq-log4j-appender/5.15.0-SNAPSHOT/activemq-log4j-appender-5.15.0-SNAPSHOT.jar
[JENKINS] Archiving <https://builds.apache.org/job/ActiveMQ-Java8/ws/activemq-log4j-appender/target/activemq-log4j-appender-5.15.0-SNAPSHOT-sources.jar> to org.apache.activemq/activemq-log4j-appender/5.15.0-SNAPSHOT/activemq-log4j-appender-5.15.0-SNAPSHOT-sources.jar
Sending e-mails to: commits@activemq.apache.org
Sending e-mails to: commits@activemq.apache.org
Sending e-mails to: commits@activemq.apache.org
[locks-and-latches] Releasing all the locks
[locks-and-latches] All the locks released
channel stopped

Jenkins build is still unstable: ActiveMQ-Java8 #803

Posted by Apache Jenkins Server <je...@builds.apache.org>.
See <https://builds.apache.org/job/ActiveMQ-Java8/changes>


Jenkins build is still unstable: ActiveMQ-Java8 #802

Posted by Apache Jenkins Server <je...@builds.apache.org>.
See <https://builds.apache.org/job/ActiveMQ-Java8/changes>


Jenkins build is still unstable: ActiveMQ-Java8 #801

Posted by Apache Jenkins Server <je...@builds.apache.org>.
See <https://builds.apache.org/job/ActiveMQ-Java8/changes>


Jenkins build is still unstable: ActiveMQ-Java8 #800

Posted by Apache Jenkins Server <je...@builds.apache.org>.
See <https://builds.apache.org/job/ActiveMQ-Java8/changes>


Jenkins build is still unstable: ActiveMQ-Java8 #799

Posted by Apache Jenkins Server <je...@builds.apache.org>.
See <https://builds.apache.org/job/ActiveMQ-Java8/changes>


Jenkins build is still unstable: ActiveMQ-Java8 #798

Posted by Apache Jenkins Server <je...@builds.apache.org>.
See <https://builds.apache.org/job/ActiveMQ-Java8/changes>


Jenkins build is still unstable: ActiveMQ-Java8 #797

Posted by Apache Jenkins Server <je...@builds.apache.org>.
See <https://builds.apache.org/job/ActiveMQ-Java8/changes>


Jenkins build is still unstable: ActiveMQ-Java8 #796

Posted by Apache Jenkins Server <je...@builds.apache.org>.
See <https://builds.apache.org/job/ActiveMQ-Java8/changes>


Jenkins build is still unstable: ActiveMQ-Java8 #795

Posted by Apache Jenkins Server <je...@builds.apache.org>.
See <https://builds.apache.org/job/ActiveMQ-Java8/changes>


Jenkins build is still unstable: ActiveMQ-Java8 #794

Posted by Apache Jenkins Server <je...@builds.apache.org>.
See <https://builds.apache.org/job/ActiveMQ-Java8/changes>


Jenkins build is still unstable: ActiveMQ-Java8 #793

Posted by Apache Jenkins Server <je...@builds.apache.org>.
See <https://builds.apache.org/job/ActiveMQ-Java8/changes>


Jenkins build is still unstable: ActiveMQ-Java8 #792

Posted by Apache Jenkins Server <je...@builds.apache.org>.
See <https://builds.apache.org/job/ActiveMQ-Java8/changes>


Jenkins build is still unstable: ActiveMQ-Java8 #791

Posted by Apache Jenkins Server <je...@builds.apache.org>.
See <https://builds.apache.org/job/ActiveMQ-Java8/changes>


Jenkins build is still unstable: ActiveMQ-Java8 #790

Posted by Apache Jenkins Server <je...@builds.apache.org>.
See <https://builds.apache.org/job/ActiveMQ-Java8/changes>


Jenkins build is still unstable: ActiveMQ-Java8 #789

Posted by Apache Jenkins Server <je...@builds.apache.org>.
See <https://builds.apache.org/job/ActiveMQ-Java8/changes>


Jenkins build is still unstable: ActiveMQ-Java8 #788

Posted by Apache Jenkins Server <je...@builds.apache.org>.
See <https://builds.apache.org/job/ActiveMQ-Java8/changes>


Jenkins build is still unstable: ActiveMQ-Java8 #787

Posted by Apache Jenkins Server <je...@builds.apache.org>.
See <https://builds.apache.org/job/ActiveMQ-Java8/changes>


Jenkins build is still unstable: ActiveMQ-Java8 #786

Posted by Apache Jenkins Server <je...@builds.apache.org>.
See <https://builds.apache.org/job/ActiveMQ-Java8/changes>


Jenkins build is still unstable: ActiveMQ-Java8 #785

Posted by Apache Jenkins Server <je...@builds.apache.org>.
See <https://builds.apache.org/job/ActiveMQ-Java8/changes>


Jenkins build is still unstable: ActiveMQ-Java8 #784

Posted by Apache Jenkins Server <je...@builds.apache.org>.
See <https://builds.apache.org/job/ActiveMQ-Java8/changes>


Jenkins build is unstable: ActiveMQ-Java8 #783

Posted by Apache Jenkins Server <je...@builds.apache.org>.
See <https://builds.apache.org/job/ActiveMQ-Java8/783/changes>


Build failed in Jenkins: ActiveMQ-Java8 #782

Posted by Apache Jenkins Server <je...@builds.apache.org>.
See <https://builds.apache.org/job/ActiveMQ-Java8/782/changes>

Changes:

[christopher.l.shannon] https://issues.apache.org/jira/browse/AMQ-6379

------------------------------------------
Started by an SCM change
[EnvInject] - Loading node environment variables.
Building remotely on H10 (docker Ubuntu ubuntu yahoo-not-h2) in workspace <https://builds.apache.org/job/ActiveMQ-Java8/ws/>
 > git rev-parse --is-inside-work-tree # timeout=10
Fetching changes from the remote Git repository
 > git config remote.origin.url https://git-wip-us.apache.org/repos/asf/activemq.git # timeout=10
Fetching upstream changes from https://git-wip-us.apache.org/repos/asf/activemq.git
 > git --version # timeout=10
 > git -c core.askpass=true fetch --tags --progress https://git-wip-us.apache.org/repos/asf/activemq.git +refs/heads/*:refs/remotes/origin/*
 > git rev-parse origin/master^{commit} # timeout=10
Checking out Revision dd971a00f2a3922e264aaa9860313b9978ec53a4 (origin/master)
 > git config core.sparsecheckout # timeout=10
 > git checkout -f dd971a00f2a3922e264aaa9860313b9978ec53a4
 > git rev-list 7118247b658335839bc792dde8f70eee2acc1f18 # timeout=10
[locks-and-latches] Checking to see if we really have the locks
[locks-and-latches] Have all the locks, build can start
Parsing POMs
Modules changed, recalculating dependency graph
Established TCP socket on 33813
maven32-agent.jar already up to date
maven32-interceptor.jar already up to date
maven3-interceptor-commons.jar already up to date
[ActiveMQ-Java8] $ /home/jenkins/jenkins-slave/tools/hudson.model.JDK/jdk1.8.0_05/bin/java -Xmx2048m -Xms1024m -cp /home/jenkins/jenkins-slave/maven32-agent.jar:/home/jenkins/tools/maven/latest3/boot/plexus-classworlds-2.5.2.jar:/home/jenkins/tools/maven/latest3/conf/logging jenkins.maven3.agent.Maven32Main /home/jenkins/tools/maven/latest3/ /home/jenkins/jenkins-slave/slave.jar /home/jenkins/jenkins-slave/maven32-interceptor.jar /home/jenkins/jenkins-slave/maven3-interceptor-commons.jar 33813
Exception in thread "main" java.lang.ClassNotFoundException: hudson.remoting.Launcher
	at org.codehaus.plexus.classworlds.strategy.SelfFirstStrategy.loadClass(SelfFirstStrategy.java:50)
	at org.codehaus.plexus.classworlds.realm.ClassRealm.unsynchronizedLoadClass(ClassRealm.java:271)
	at org.codehaus.plexus.classworlds.realm.ClassRealm.loadClass(ClassRealm.java:247)
	at org.codehaus.plexus.classworlds.realm.ClassRealm.loadClass(ClassRealm.java:239)
	at jenkins.maven3.agent.Maven32Main.main(Maven32Main.java:143)
	at jenkins.maven3.agent.Maven32Main.main(Maven32Main.java:74)
[locks-and-latches] Releasing all the locks
[locks-and-latches] All the locks released
ERROR: Failed to parse POMs
java.io.EOFException: unexpected stream termination
	at hudson.remoting.ChannelBuilder.negotiate(ChannelBuilder.java:365)
	at hudson.remoting.ChannelBuilder.build(ChannelBuilder.java:310)
	at hudson.slaves.Channels.forProcess(Channels.java:115)
	at hudson.maven.AbstractMavenProcessFactory.newProcess(AbstractMavenProcessFactory.java:297)
	at hudson.maven.ProcessCache.get(ProcessCache.java:236)
	at hudson.maven.MavenModuleSetBuild$MavenModuleSetBuildExecution.doRun(MavenModuleSetBuild.java:778)
	at hudson.model.AbstractBuild$AbstractBuildExecution.run(AbstractBuild.java:534)
	at hudson.model.Run.execute(Run.java:1738)
	at hudson.maven.MavenModuleSetBuild.run(MavenModuleSetBuild.java:531)
	at hudson.model.ResourceController.execute(ResourceController.java:98)
	at hudson.model.Executor.run(Executor.java:410)

Jenkins build is unstable: ActiveMQ-Java8 #781

Posted by Apache Jenkins Server <je...@builds.apache.org>.
See <https://builds.apache.org/job/ActiveMQ-Java8/781/changes>


Build failed in Jenkins: ActiveMQ-Java8 #780

Posted by Apache Jenkins Server <je...@builds.apache.org>.
See <https://builds.apache.org/job/ActiveMQ-Java8/780/changes>

Changes:

[christopher.l.shannon] https://issues.apache.org/jira/browse/AMQ-6377

------------------------------------------
Started by an SCM change
Started by user cshannon
[EnvInject] - Loading node environment variables.
Building remotely on H10 (docker Ubuntu ubuntu yahoo-not-h2) in workspace <https://builds.apache.org/job/ActiveMQ-Java8/ws/>
 > git rev-parse --is-inside-work-tree # timeout=10
Fetching changes from the remote Git repository
 > git config remote.origin.url https://git-wip-us.apache.org/repos/asf/activemq.git # timeout=10
Fetching upstream changes from https://git-wip-us.apache.org/repos/asf/activemq.git
 > git --version # timeout=10
 > git -c core.askpass=true fetch --tags --progress https://git-wip-us.apache.org/repos/asf/activemq.git +refs/heads/*:refs/remotes/origin/*
 > git rev-parse origin/master^{commit} # timeout=10
Checking out Revision 1a598277cf76e9bace980dfa87982584b5879710 (origin/master)
 > git config core.sparsecheckout # timeout=10
 > git checkout -f 1a598277cf76e9bace980dfa87982584b5879710
 > git rev-list 1bdcb4f96ffa7b08532f0ef76425416d9363c118 # timeout=10
[locks-and-latches] Checking to see if we really have the locks
[locks-and-latches] Have all the locks, build can start
Parsing POMs
Modules changed, recalculating dependency graph
Established TCP socket on 47748
maven32-agent.jar already up to date
maven32-interceptor.jar already up to date
maven3-interceptor-commons.jar already up to date
[ActiveMQ-Java8] $ /home/jenkins/jenkins-slave/tools/hudson.model.JDK/jdk1.8.0_05/bin/java -Xmx2048m -Xms1024m -cp /home/jenkins/jenkins-slave/maven32-agent.jar:/home/jenkins/tools/maven/latest3/boot/plexus-classworlds-2.5.2.jar:/home/jenkins/tools/maven/latest3/conf/logging jenkins.maven3.agent.Maven32Main /home/jenkins/tools/maven/latest3/ /home/jenkins/jenkins-slave/slave.jar /home/jenkins/jenkins-slave/maven32-interceptor.jar /home/jenkins/jenkins-slave/maven3-interceptor-commons.jar 47748
Exception in thread "main" java.lang.ClassNotFoundException: hudson.remoting.Launcher
	at org.codehaus.plexus.classworlds.strategy.SelfFirstStrategy.loadClass(SelfFirstStrategy.java:50)
	at org.codehaus.plexus.classworlds.realm.ClassRealm.unsynchronizedLoadClass(ClassRealm.java:271)
	at org.codehaus.plexus.classworlds.realm.ClassRealm.loadClass(ClassRealm.java:247)
	at org.codehaus.plexus.classworlds.realm.ClassRealm.loadClass(ClassRealm.java:239)
	at jenkins.maven3.agent.Maven32Main.main(Maven32Main.java:143)
	at jenkins.maven3.agent.Maven32Main.main(Maven32Main.java:74)
[locks-and-latches] Releasing all the locks
[locks-and-latches] All the locks released
ERROR: Failed to parse POMs
java.io.EOFException: unexpected stream termination
	at hudson.remoting.ChannelBuilder.negotiate(ChannelBuilder.java:365)
	at hudson.remoting.ChannelBuilder.build(ChannelBuilder.java:310)
	at hudson.slaves.Channels.forProcess(Channels.java:115)
	at hudson.maven.AbstractMavenProcessFactory.newProcess(AbstractMavenProcessFactory.java:297)
	at hudson.maven.ProcessCache.get(ProcessCache.java:236)
	at hudson.maven.MavenModuleSetBuild$MavenModuleSetBuildExecution.doRun(MavenModuleSetBuild.java:778)
	at hudson.model.AbstractBuild$AbstractBuildExecution.run(AbstractBuild.java:534)
	at hudson.model.Run.execute(Run.java:1738)
	at hudson.maven.MavenModuleSetBuild.run(MavenModuleSetBuild.java:531)
	at hudson.model.ResourceController.execute(ResourceController.java:98)
	at hudson.model.Executor.run(Executor.java:410)