You are viewing a plain text version of this content. The canonical link for it is here.
Posted to builds@beam.apache.org by Apache Jenkins Server <je...@builds.apache.org> on 2020/02/13 11:22:22 UTC
Build failed in Jenkins: beam_PostRelease_NightlySnapshot #890
See <https://builds.apache.org/job/beam_PostRelease_NightlySnapshot/890/display/redirect?page=changes>
Changes:
[yoshiki.obata] [BEAM-7198] rename ToStringCoder to ToBytesCoder for proper
[yoshiki.obata] [BEAM-7198] add comment
[yoshiki.obata] [BEAM-7198] fixup: reformatted with yapf
[github] [BEAM-3221] Clarify documentation for StandardTransforms.Primitives,
[aromanenko.dev] [BEAM-9292] Provide an ability to specify additional maven repositories
[aromanenko.dev] [BEAM-9292] KafkaIO: add io.confluent repository to published POM
[github] [BEAM-8201] Add other endpoint fields to provision API. (#10839)
[github] [BEAM-9269] Add commit deadline for Spanner writes. (#10752)
[github] [AVRO-2737] Exclude a buggy avro version from requirements spec.
[iemejia] Refine labels/categories for PR autolabeling
[github] Update roadmap page for python 3 support
[iemejia] [BEAM-9160] Removed WebIdentityTokenCredentialsProvider explicit json
------------------------------------------
[...truncated 3.44 MB...]
INFO: 2020-02-13T11:17:08.808Z: Fusing consumer WriteCounts/WriteFiles/WriteUnshardedBundlesToTempFiles/GroupUnwritten/Write into WriteCounts/WriteFiles/WriteUnshardedBundlesToTempFiles/GroupUnwritten/Reify
Feb 13, 2020 11:17:09 AM org.apache.beam.runners.dataflow.util.MonitoringUtil$LoggingHandler process
INFO: 2020-02-13T11:17:08.896Z: Fusing consumer WriteCounts/WriteFiles/WriteUnshardedBundlesToTempFiles/GroupUnwritten/GroupByWindow into WriteCounts/WriteFiles/WriteUnshardedBundlesToTempFiles/GroupUnwritten/Read
Feb 13, 2020 11:17:09 AM org.apache.beam.runners.dataflow.util.MonitoringUtil$LoggingHandler process
INFO: 2020-02-13T11:17:08.977Z: Fusing consumer WriteCounts/WriteFiles/WriteUnshardedBundlesToTempFiles/WriteUnwritten into WriteCounts/WriteFiles/WriteUnshardedBundlesToTempFiles/GroupUnwritten/GroupByWindow
Feb 13, 2020 11:17:09 AM org.apache.beam.runners.dataflow.util.MonitoringUtil$LoggingHandler process
INFO: 2020-02-13T11:17:09.036Z: Fusing consumer WriteCounts/WriteFiles/WriteUnshardedBundlesToTempFiles/DropShardNum into WriteCounts/WriteFiles/WriteUnshardedBundlesToTempFiles/WriteUnwritten
Feb 13, 2020 11:17:09 AM org.apache.beam.runners.dataflow.util.MonitoringUtil$LoggingHandler process
INFO: 2020-02-13T11:17:09.634Z: Executing operation WriteCounts/WriteFiles/FinalizeTempFileBundles/Reshuffle.ViaRandomKey/Reshuffle/GroupByKey/Create
Feb 13, 2020 11:17:09 AM org.apache.beam.runners.dataflow.util.MonitoringUtil$LoggingHandler process
INFO: 2020-02-13T11:17:09.673Z: Executing operation WordCount.CountWords/Count.PerElement/Combine.perKey(Count)/GroupByKey/Create
Feb 13, 2020 11:17:09 AM org.apache.beam.runners.dataflow.util.MonitoringUtil$LoggingHandler process
INFO: 2020-02-13T11:17:09.700Z: Executing operation WriteCounts/WriteFiles/WriteUnshardedBundlesToTempFiles/GroupUnwritten/Create
Feb 13, 2020 11:17:09 AM org.apache.beam.runners.dataflow.util.MonitoringUtil$LoggingHandler process
INFO: 2020-02-13T11:17:09.718Z: Starting 1 workers in us-central1-a...
Feb 13, 2020 11:17:12 AM org.apache.beam.runners.dataflow.util.MonitoringUtil$LoggingHandler process
INFO: 2020-02-13T11:17:09.759Z: Finished operation WriteCounts/WriteFiles/FinalizeTempFileBundles/Reshuffle.ViaRandomKey/Reshuffle/GroupByKey/Create
Feb 13, 2020 11:17:12 AM org.apache.beam.runners.dataflow.util.MonitoringUtil$LoggingHandler process
INFO: 2020-02-13T11:17:09.776Z: Finished operation WriteCounts/WriteFiles/WriteUnshardedBundlesToTempFiles/GroupUnwritten/Create
Feb 13, 2020 11:17:12 AM org.apache.beam.runners.dataflow.util.MonitoringUtil$LoggingHandler process
INFO: 2020-02-13T11:17:09.776Z: Finished operation WordCount.CountWords/Count.PerElement/Combine.perKey(Count)/GroupByKey/Create
Feb 13, 2020 11:17:12 AM org.apache.beam.runners.dataflow.util.MonitoringUtil$LoggingHandler process
INFO: 2020-02-13T11:17:09.945Z: Executing operation ReadLines/Read+WordCount.CountWords/ParDo(ExtractWords)+WordCount.CountWords/Count.PerElement/Init/Map+WordCount.CountWords/Count.PerElement/Combine.perKey(Count)/GroupByKey+WordCount.CountWords/Count.PerElement/Combine.perKey(Count)/Combine.GroupedValues/Partial+WordCount.CountWords/Count.PerElement/Combine.perKey(Count)/GroupByKey/Reify+WordCount.CountWords/Count.PerElement/Combine.perKey(Count)/GroupByKey/Write
Feb 13, 2020 11:17:32 AM org.apache.beam.runners.dataflow.util.MonitoringUtil$LoggingHandler process
WARNING: 2020-02-13T11:17:30.223Z: Your project already contains 100 Dataflow-created metric descriptors and Stackdriver will not create new Dataflow custom metrics for this job. Each unique user-defined metric name (independent of the DoFn in which it is defined) produces a new metric descriptor. To delete old / unused metric descriptors see https://developers.google.com/apis-explorer/#p/monitoring/v3/monitoring.projects.metricDescriptors.list and https://developers.google.com/apis-explorer/#p/monitoring/v3/monitoring.projects.metricDescriptors.delete
Feb 13, 2020 11:17:35 AM org.apache.beam.runners.dataflow.util.MonitoringUtil$LoggingHandler process
INFO: 2020-02-13T11:17:33.819Z: Autoscaling: Raised the number of workers to 1 based on the rate of progress in the currently running step(s).
Feb 13, 2020 11:18:10 AM org.apache.beam.runners.dataflow.util.MonitoringUtil$LoggingHandler process
INFO: 2020-02-13T11:18:09.542Z: Workers have started successfully.
Feb 13, 2020 11:18:10 AM org.apache.beam.runners.dataflow.util.MonitoringUtil$LoggingHandler process
INFO: 2020-02-13T11:18:09.566Z: Workers have started successfully.
Feb 13, 2020 11:19:26 AM org.apache.beam.runners.dataflow.util.MonitoringUtil$LoggingHandler process
INFO: 2020-02-13T11:19:24.134Z: Finished operation ReadLines/Read+WordCount.CountWords/ParDo(ExtractWords)+WordCount.CountWords/Count.PerElement/Init/Map+WordCount.CountWords/Count.PerElement/Combine.perKey(Count)/GroupByKey+WordCount.CountWords/Count.PerElement/Combine.perKey(Count)/Combine.GroupedValues/Partial+WordCount.CountWords/Count.PerElement/Combine.perKey(Count)/GroupByKey/Reify+WordCount.CountWords/Count.PerElement/Combine.perKey(Count)/GroupByKey/Write
Feb 13, 2020 11:19:26 AM org.apache.beam.runners.dataflow.util.MonitoringUtil$LoggingHandler process
INFO: 2020-02-13T11:19:24.192Z: Executing operation WordCount.CountWords/Count.PerElement/Combine.perKey(Count)/GroupByKey/Close
Feb 13, 2020 11:19:26 AM org.apache.beam.runners.dataflow.util.MonitoringUtil$LoggingHandler process
INFO: 2020-02-13T11:19:24.241Z: Finished operation WordCount.CountWords/Count.PerElement/Combine.perKey(Count)/GroupByKey/Close
Feb 13, 2020 11:19:26 AM org.apache.beam.runners.dataflow.util.MonitoringUtil$LoggingHandler process
INFO: 2020-02-13T11:19:24.305Z: Executing operation WordCount.CountWords/Count.PerElement/Combine.perKey(Count)/GroupByKey/Read+WordCount.CountWords/Count.PerElement/Combine.perKey(Count)/Combine.GroupedValues+WordCount.CountWords/Count.PerElement/Combine.perKey(Count)/Combine.GroupedValues/Extract+MapElements/Map+WriteCounts/WriteFiles/RewindowIntoGlobal/Window.Assign+WriteCounts/WriteFiles/WriteUnshardedBundlesToTempFiles/WriteUnshardedBundles+WriteCounts/WriteFiles/GatherTempFileResults/View.AsList/ParDo(ToIsmRecordForGlobalWindow)+WriteCounts/WriteFiles/WriteUnshardedBundlesToTempFiles/GroupUnwritten/Reify+WriteCounts/WriteFiles/WriteUnshardedBundlesToTempFiles/GroupUnwritten/Write
Feb 13, 2020 11:19:27 AM org.apache.beam.runners.dataflow.util.MonitoringUtil$LoggingHandler process
SEVERE: 2020-02-13T11:19:26.261Z: java.lang.NoClassDefFoundError: org/apache/beam/model/pipeline/v1/StandardWindowFns$SessionsPayload$Enum
at org.apache.beam.runners.dataflow.worker.repackaged.org.apache.beam.runners.core.construction.WindowingStrategyTranslation.<clinit>(WindowingStrategyTranslation.java:211)
at org.apache.beam.runners.dataflow.worker.GroupAlsoByWindowParDoFnFactory.deserializeWindowingStrategy(GroupAlsoByWindowParDoFnFactory.java:234)
at org.apache.beam.runners.dataflow.worker.GroupAlsoByWindowParDoFnFactory.create(GroupAlsoByWindowParDoFnFactory.java:99)
at org.apache.beam.runners.dataflow.worker.DefaultParDoFnFactory.create(DefaultParDoFnFactory.java:75)
at org.apache.beam.runners.dataflow.worker.IntrinsicMapTaskExecutorFactory.createParDoOperation(IntrinsicMapTaskExecutorFactory.java:264)
at org.apache.beam.runners.dataflow.worker.IntrinsicMapTaskExecutorFactory.access$000(IntrinsicMapTaskExecutorFactory.java:86)
at org.apache.beam.runners.dataflow.worker.IntrinsicMapTaskExecutorFactory$1.typedApply(IntrinsicMapTaskExecutorFactory.java:183)
at org.apache.beam.runners.dataflow.worker.IntrinsicMapTaskExecutorFactory$1.typedApply(IntrinsicMapTaskExecutorFactory.java:165)
at org.apache.beam.runners.dataflow.worker.graph.Networks$TypeSafeNodeFunction.apply(Networks.java:63)
at org.apache.beam.runners.dataflow.worker.graph.Networks$TypeSafeNodeFunction.apply(Networks.java:50)
at org.apache.beam.runners.dataflow.worker.graph.Networks.replaceDirectedNetworkNodes(Networks.java:87)
at org.apache.beam.runners.dataflow.worker.IntrinsicMapTaskExecutorFactory.create(IntrinsicMapTaskExecutorFactory.java:125)
at org.apache.beam.runners.dataflow.worker.BatchDataflowWorker.doWork(BatchDataflowWorker.java:353)
at org.apache.beam.runners.dataflow.worker.BatchDataflowWorker.getAndPerformWork(BatchDataflowWorker.java:306)
at org.apache.beam.runners.dataflow.worker.DataflowBatchWorkerHarness$WorkerThread.doWork(DataflowBatchWorkerHarness.java:140)
at org.apache.beam.runners.dataflow.worker.DataflowBatchWorkerHarness$WorkerThread.call(DataflowBatchWorkerHarness.java:120)
at org.apache.beam.runners.dataflow.worker.DataflowBatchWorkerHarness$WorkerThread.call(DataflowBatchWorkerHarness.java:107)
at java.util.concurrent.FutureTask.run(FutureTask.java:266)
at java.util.concurrent.ThreadPoolExecutor.runWorker(ThreadPoolExecutor.java:1149)
at java.util.concurrent.ThreadPoolExecutor$Worker.run(ThreadPoolExecutor.java:624)
at java.lang.Thread.run(Thread.java:748)
Caused by: java.lang.ClassNotFoundException: org.apache.beam.model.pipeline.v1.StandardWindowFns$SessionsPayload$Enum
at java.net.URLClassLoader.findClass(URLClassLoader.java:381)
at java.lang.ClassLoader.loadClass(ClassLoader.java:424)
at sun.misc.Launcher$AppClassLoader.loadClass(Launcher.java:335)
at java.lang.ClassLoader.loadClass(ClassLoader.java:357)
... 21 more
Feb 13, 2020 11:19:35 AM org.apache.beam.runners.dataflow.util.MonitoringUtil$LoggingHandler process
SEVERE: 2020-02-13T11:19:33.979Z: java.lang.NoClassDefFoundError: Could not initialize class org.apache.beam.runners.dataflow.worker.repackaged.org.apache.beam.runners.core.construction.WindowingStrategyTranslation
at org.apache.beam.runners.dataflow.worker.GroupAlsoByWindowParDoFnFactory.deserializeWindowingStrategy(GroupAlsoByWindowParDoFnFactory.java:234)
at org.apache.beam.runners.dataflow.worker.GroupAlsoByWindowParDoFnFactory.create(GroupAlsoByWindowParDoFnFactory.java:99)
at org.apache.beam.runners.dataflow.worker.DefaultParDoFnFactory.create(DefaultParDoFnFactory.java:75)
at org.apache.beam.runners.dataflow.worker.IntrinsicMapTaskExecutorFactory.createParDoOperation(IntrinsicMapTaskExecutorFactory.java:264)
at org.apache.beam.runners.dataflow.worker.IntrinsicMapTaskExecutorFactory.access$000(IntrinsicMapTaskExecutorFactory.java:86)
at org.apache.beam.runners.dataflow.worker.IntrinsicMapTaskExecutorFactory$1.typedApply(IntrinsicMapTaskExecutorFactory.java:183)
at org.apache.beam.runners.dataflow.worker.IntrinsicMapTaskExecutorFactory$1.typedApply(IntrinsicMapTaskExecutorFactory.java:165)
at org.apache.beam.runners.dataflow.worker.graph.Networks$TypeSafeNodeFunction.apply(Networks.java:63)
at org.apache.beam.runners.dataflow.worker.graph.Networks$TypeSafeNodeFunction.apply(Networks.java:50)
at org.apache.beam.runners.dataflow.worker.graph.Networks.replaceDirectedNetworkNodes(Networks.java:87)
at org.apache.beam.runners.dataflow.worker.IntrinsicMapTaskExecutorFactory.create(IntrinsicMapTaskExecutorFactory.java:125)
at org.apache.beam.runners.dataflow.worker.BatchDataflowWorker.doWork(BatchDataflowWorker.java:353)
at org.apache.beam.runners.dataflow.worker.BatchDataflowWorker.getAndPerformWork(BatchDataflowWorker.java:306)
at org.apache.beam.runners.dataflow.worker.DataflowBatchWorkerHarness$WorkerThread.doWork(DataflowBatchWorkerHarness.java:140)
at org.apache.beam.runners.dataflow.worker.DataflowBatchWorkerHarness$WorkerThread.call(DataflowBatchWorkerHarness.java:120)
at org.apache.beam.runners.dataflow.worker.DataflowBatchWorkerHarness$WorkerThread.call(DataflowBatchWorkerHarness.java:107)
at java.util.concurrent.FutureTask.run(FutureTask.java:266)
at java.util.concurrent.ThreadPoolExecutor.runWorker(ThreadPoolExecutor.java:1149)
at java.util.concurrent.ThreadPoolExecutor$Worker.run(ThreadPoolExecutor.java:624)
at java.lang.Thread.run(Thread.java:748)
Feb 13, 2020 11:19:44 AM org.apache.beam.runners.dataflow.util.MonitoringUtil$LoggingHandler process
SEVERE: 2020-02-13T11:19:43.605Z: java.lang.NoClassDefFoundError: Could not initialize class org.apache.beam.runners.dataflow.worker.repackaged.org.apache.beam.runners.core.construction.WindowingStrategyTranslation
at org.apache.beam.runners.dataflow.worker.GroupAlsoByWindowParDoFnFactory.deserializeWindowingStrategy(GroupAlsoByWindowParDoFnFactory.java:234)
at org.apache.beam.runners.dataflow.worker.GroupAlsoByWindowParDoFnFactory.create(GroupAlsoByWindowParDoFnFactory.java:99)
at org.apache.beam.runners.dataflow.worker.DefaultParDoFnFactory.create(DefaultParDoFnFactory.java:75)
at org.apache.beam.runners.dataflow.worker.IntrinsicMapTaskExecutorFactory.createParDoOperation(IntrinsicMapTaskExecutorFactory.java:264)
at org.apache.beam.runners.dataflow.worker.IntrinsicMapTaskExecutorFactory.access$000(IntrinsicMapTaskExecutorFactory.java:86)
at org.apache.beam.runners.dataflow.worker.IntrinsicMapTaskExecutorFactory$1.typedApply(IntrinsicMapTaskExecutorFactory.java:183)
at org.apache.beam.runners.dataflow.worker.IntrinsicMapTaskExecutorFactory$1.typedApply(IntrinsicMapTaskExecutorFactory.java:165)
at org.apache.beam.runners.dataflow.worker.graph.Networks$TypeSafeNodeFunction.apply(Networks.java:63)
at org.apache.beam.runners.dataflow.worker.graph.Networks$TypeSafeNodeFunction.apply(Networks.java:50)
at org.apache.beam.runners.dataflow.worker.graph.Networks.replaceDirectedNetworkNodes(Networks.java:87)
at org.apache.beam.runners.dataflow.worker.IntrinsicMapTaskExecutorFactory.create(IntrinsicMapTaskExecutorFactory.java:125)
at org.apache.beam.runners.dataflow.worker.BatchDataflowWorker.doWork(BatchDataflowWorker.java:353)
at org.apache.beam.runners.dataflow.worker.BatchDataflowWorker.getAndPerformWork(BatchDataflowWorker.java:306)
at org.apache.beam.runners.dataflow.worker.DataflowBatchWorkerHarness$WorkerThread.doWork(DataflowBatchWorkerHarness.java:140)
at org.apache.beam.runners.dataflow.worker.DataflowBatchWorkerHarness$WorkerThread.call(DataflowBatchWorkerHarness.java:120)
at org.apache.beam.runners.dataflow.worker.DataflowBatchWorkerHarness$WorkerThread.call(DataflowBatchWorkerHarness.java:107)
at java.util.concurrent.FutureTask.run(FutureTask.java:266)
at java.util.concurrent.ThreadPoolExecutor.runWorker(ThreadPoolExecutor.java:1149)
at java.util.concurrent.ThreadPoolExecutor$Worker.run(ThreadPoolExecutor.java:624)
at java.lang.Thread.run(Thread.java:748)
Feb 13, 2020 11:19:50 AM org.apache.beam.runners.dataflow.util.MonitoringUtil$LoggingHandler process
SEVERE: 2020-02-13T11:19:49.892Z: java.lang.NoClassDefFoundError: Could not initialize class org.apache.beam.runners.dataflow.worker.repackaged.org.apache.beam.runners.core.construction.WindowingStrategyTranslation
at org.apache.beam.runners.dataflow.worker.GroupAlsoByWindowParDoFnFactory.deserializeWindowingStrategy(GroupAlsoByWindowParDoFnFactory.java:234)
at org.apache.beam.runners.dataflow.worker.GroupAlsoByWindowParDoFnFactory.create(GroupAlsoByWindowParDoFnFactory.java:99)
at org.apache.beam.runners.dataflow.worker.DefaultParDoFnFactory.create(DefaultParDoFnFactory.java:75)
at org.apache.beam.runners.dataflow.worker.IntrinsicMapTaskExecutorFactory.createParDoOperation(IntrinsicMapTaskExecutorFactory.java:264)
at org.apache.beam.runners.dataflow.worker.IntrinsicMapTaskExecutorFactory.access$000(IntrinsicMapTaskExecutorFactory.java:86)
at org.apache.beam.runners.dataflow.worker.IntrinsicMapTaskExecutorFactory$1.typedApply(IntrinsicMapTaskExecutorFactory.java:183)
at org.apache.beam.runners.dataflow.worker.IntrinsicMapTaskExecutorFactory$1.typedApply(IntrinsicMapTaskExecutorFactory.java:165)
at org.apache.beam.runners.dataflow.worker.graph.Networks$TypeSafeNodeFunction.apply(Networks.java:63)
at org.apache.beam.runners.dataflow.worker.graph.Networks$TypeSafeNodeFunction.apply(Networks.java:50)
at org.apache.beam.runners.dataflow.worker.graph.Networks.replaceDirectedNetworkNodes(Networks.java:87)
at org.apache.beam.runners.dataflow.worker.IntrinsicMapTaskExecutorFactory.create(IntrinsicMapTaskExecutorFactory.java:125)
at org.apache.beam.runners.dataflow.worker.BatchDataflowWorker.doWork(BatchDataflowWorker.java:353)
at org.apache.beam.runners.dataflow.worker.BatchDataflowWorker.getAndPerformWork(BatchDataflowWorker.java:306)
at org.apache.beam.runners.dataflow.worker.DataflowBatchWorkerHarness$WorkerThread.doWork(DataflowBatchWorkerHarness.java:140)
at org.apache.beam.runners.dataflow.worker.DataflowBatchWorkerHarness$WorkerThread.call(DataflowBatchWorkerHarness.java:120)
at org.apache.beam.runners.dataflow.worker.DataflowBatchWorkerHarness$WorkerThread.call(DataflowBatchWorkerHarness.java:107)
at java.util.concurrent.FutureTask.run(FutureTask.java:266)
at java.util.concurrent.ThreadPoolExecutor.runWorker(ThreadPoolExecutor.java:1149)
at java.util.concurrent.ThreadPoolExecutor$Worker.run(ThreadPoolExecutor.java:624)
at java.lang.Thread.run(Thread.java:748)
Feb 13, 2020 11:20:13 AM org.apache.beam.runners.dataflow.util.MonitoringUtil$LoggingHandler process
SEVERE: 2020-02-13T11:20:13.469Z: java.lang.NoClassDefFoundError: Could not initialize class org.apache.beam.runners.dataflow.worker.repackaged.org.apache.beam.runners.core.construction.WindowingStrategyTranslation
at org.apache.beam.runners.dataflow.worker.GroupAlsoByWindowParDoFnFactory.deserializeWindowingStrategy(GroupAlsoByWindowParDoFnFactory.java:234)
at org.apache.beam.runners.dataflow.worker.GroupAlsoByWindowParDoFnFactory.create(GroupAlsoByWindowParDoFnFactory.java:99)
at org.apache.beam.runners.dataflow.worker.DefaultParDoFnFactory.create(DefaultParDoFnFactory.java:75)
at org.apache.beam.runners.dataflow.worker.IntrinsicMapTaskExecutorFactory.createParDoOperation(IntrinsicMapTaskExecutorFactory.java:264)
at org.apache.beam.runners.dataflow.worker.IntrinsicMapTaskExecutorFactory.access$000(IntrinsicMapTaskExecutorFactory.java:86)
at org.apache.beam.runners.dataflow.worker.IntrinsicMapTaskExecutorFactory$1.typedApply(IntrinsicMapTaskExecutorFactory.java:183)
at org.apache.beam.runners.dataflow.worker.IntrinsicMapTaskExecutorFactory$1.typedApply(IntrinsicMapTaskExecutorFactory.java:165)
at org.apache.beam.runners.dataflow.worker.graph.Networks$TypeSafeNodeFunction.apply(Networks.java:63)
at org.apache.beam.runners.dataflow.worker.graph.Networks$TypeSafeNodeFunction.apply(Networks.java:50)
at org.apache.beam.runners.dataflow.worker.graph.Networks.replaceDirectedNetworkNodes(Networks.java:87)
at org.apache.beam.runners.dataflow.worker.IntrinsicMapTaskExecutorFactory.create(IntrinsicMapTaskExecutorFactory.java:125)
at org.apache.beam.runners.dataflow.worker.BatchDataflowWorker.doWork(BatchDataflowWorker.java:353)
at org.apache.beam.runners.dataflow.worker.BatchDataflowWorker.getAndPerformWork(BatchDataflowWorker.java:306)
at org.apache.beam.runners.dataflow.worker.DataflowBatchWorkerHarness$WorkerThread.doWork(DataflowBatchWorkerHarness.java:140)
at org.apache.beam.runners.dataflow.worker.DataflowBatchWorkerHarness$WorkerThread.call(DataflowBatchWorkerHarness.java:120)
at org.apache.beam.runners.dataflow.worker.DataflowBatchWorkerHarness$WorkerThread.call(DataflowBatchWorkerHarness.java:107)
at java.util.concurrent.FutureTask.run(FutureTask.java:266)
at java.util.concurrent.ThreadPoolExecutor.runWorker(ThreadPoolExecutor.java:1149)
at java.util.concurrent.ThreadPoolExecutor$Worker.run(ThreadPoolExecutor.java:624)
at java.lang.Thread.run(Thread.java:748)
Feb 13, 2020 11:20:49 AM org.apache.beam.runners.dataflow.util.MonitoringUtil$LoggingHandler process
SEVERE: 2020-02-13T11:20:49.212Z: java.lang.NoClassDefFoundError: Could not initialize class org.apache.beam.runners.dataflow.worker.repackaged.org.apache.beam.runners.core.construction.WindowingStrategyTranslation
at org.apache.beam.runners.dataflow.worker.GroupAlsoByWindowParDoFnFactory.deserializeWindowingStrategy(GroupAlsoByWindowParDoFnFactory.java:234)
at org.apache.beam.runners.dataflow.worker.GroupAlsoByWindowParDoFnFactory.create(GroupAlsoByWindowParDoFnFactory.java:99)
at org.apache.beam.runners.dataflow.worker.DefaultParDoFnFactory.create(DefaultParDoFnFactory.java:75)
at org.apache.beam.runners.dataflow.worker.IntrinsicMapTaskExecutorFactory.createParDoOperation(IntrinsicMapTaskExecutorFactory.java:264)
at org.apache.beam.runners.dataflow.worker.IntrinsicMapTaskExecutorFactory.access$000(IntrinsicMapTaskExecutorFactory.java:86)
at org.apache.beam.runners.dataflow.worker.IntrinsicMapTaskExecutorFactory$1.typedApply(IntrinsicMapTaskExecutorFactory.java:183)
at org.apache.beam.runners.dataflow.worker.IntrinsicMapTaskExecutorFactory$1.typedApply(IntrinsicMapTaskExecutorFactory.java:165)
at org.apache.beam.runners.dataflow.worker.graph.Networks$TypeSafeNodeFunction.apply(Networks.java:63)
at org.apache.beam.runners.dataflow.worker.graph.Networks$TypeSafeNodeFunction.apply(Networks.java:50)
at org.apache.beam.runners.dataflow.worker.graph.Networks.replaceDirectedNetworkNodes(Networks.java:87)
at org.apache.beam.runners.dataflow.worker.IntrinsicMapTaskExecutorFactory.create(IntrinsicMapTaskExecutorFactory.java:125)
at org.apache.beam.runners.dataflow.worker.BatchDataflowWorker.doWork(BatchDataflowWorker.java:353)
at org.apache.beam.runners.dataflow.worker.BatchDataflowWorker.getAndPerformWork(BatchDataflowWorker.java:306)
at org.apache.beam.runners.dataflow.worker.DataflowBatchWorkerHarness$WorkerThread.doWork(DataflowBatchWorkerHarness.java:140)
at org.apache.beam.runners.dataflow.worker.DataflowBatchWorkerHarness$WorkerThread.call(DataflowBatchWorkerHarness.java:120)
at org.apache.beam.runners.dataflow.worker.DataflowBatchWorkerHarness$WorkerThread.call(DataflowBatchWorkerHarness.java:107)
at java.util.concurrent.FutureTask.run(FutureTask.java:266)
at java.util.concurrent.ThreadPoolExecutor.runWorker(ThreadPoolExecutor.java:1149)
at java.util.concurrent.ThreadPoolExecutor$Worker.run(ThreadPoolExecutor.java:624)
at java.lang.Thread.run(Thread.java:748)
Feb 13, 2020 11:20:50 AM org.apache.beam.runners.dataflow.util.MonitoringUtil$LoggingHandler process
INFO: 2020-02-13T11:20:49.889Z: Finished operation WordCount.CountWords/Count.PerElement/Combine.perKey(Count)/GroupByKey/Read+WordCount.CountWords/Count.PerElement/Combine.perKey(Count)/Combine.GroupedValues+WordCount.CountWords/Count.PerElement/Combine.perKey(Count)/Combine.GroupedValues/Extract+MapElements/Map+WriteCounts/WriteFiles/RewindowIntoGlobal/Window.Assign+WriteCounts/WriteFiles/WriteUnshardedBundlesToTempFiles/WriteUnshardedBundles+WriteCounts/WriteFiles/GatherTempFileResults/View.AsList/ParDo(ToIsmRecordForGlobalWindow)+WriteCounts/WriteFiles/WriteUnshardedBundlesToTempFiles/GroupUnwritten/Reify+WriteCounts/WriteFiles/WriteUnshardedBundlesToTempFiles/GroupUnwritten/Write
Feb 13, 2020 11:20:50 AM org.apache.beam.runners.dataflow.util.MonitoringUtil$LoggingHandler process
SEVERE: 2020-02-13T11:20:49.993Z: Workflow failed. Causes: S05:WordCount.CountWords/Count.PerElement/Combine.perKey(Count)/GroupByKey/Read+WordCount.CountWords/Count.PerElement/Combine.perKey(Count)/Combine.GroupedValues+WordCount.CountWords/Count.PerElement/Combine.perKey(Count)/Combine.GroupedValues/Extract+MapElements/Map+WriteCounts/WriteFiles/RewindowIntoGlobal/Window.Assign+WriteCounts/WriteFiles/WriteUnshardedBundlesToTempFiles/WriteUnshardedBundles+WriteCounts/WriteFiles/GatherTempFileResults/View.AsList/ParDo(ToIsmRecordForGlobalWindow)+WriteCounts/WriteFiles/WriteUnshardedBundlesToTempFiles/GroupUnwritten/Reify+WriteCounts/WriteFiles/WriteUnshardedBundlesToTempFiles/GroupUnwritten/Write failed., The job failed because a work item has failed 4 times. Look in previous log entries for the cause of each one of the 4 failures. For more information, see https://cloud.google.com/dataflow/docs/guides/common-errors. The work item was attempted on these workers:
wordcount-jenkins-0213111-02130316-o026-harness-6bq5
Root cause: Work item failed.,
wordcount-jenkins-0213111-02130316-o026-harness-6bq5
Root cause: Work item failed.,
wordcount-jenkins-0213111-02130316-o026-harness-6bq5
Root cause: Work item failed.,
wordcount-jenkins-0213111-02130316-o026-harness-6bq5
Root cause: Work item failed.
Feb 13, 2020 11:20:50 AM org.apache.beam.runners.dataflow.util.MonitoringUtil$LoggingHandler process
INFO: 2020-02-13T11:20:50.120Z: Cleaning up.
Feb 13, 2020 11:20:50 AM org.apache.beam.runners.dataflow.util.MonitoringUtil$LoggingHandler process
INFO: 2020-02-13T11:20:50.232Z: Stopping worker pool...
Feb 13, 2020 11:22:10 AM org.apache.beam.runners.dataflow.util.MonitoringUtil$LoggingHandler process
INFO: 2020-02-13T11:22:10.026Z: Autoscaling: Resized worker pool from 1 to 0.
Feb 13, 2020 11:22:10 AM org.apache.beam.runners.dataflow.util.MonitoringUtil$LoggingHandler process
INFO: 2020-02-13T11:22:10.068Z: Worker pool stopped.
Feb 13, 2020 11:22:15 AM org.apache.beam.runners.dataflow.DataflowPipelineJob logTerminalState
INFO: Job 2020-02-13_03_16_56-11564206099719318397 failed with status FAILED.
gsutil cat gs://temp-storage-for-release-validation-tests/nightly-snapshot-validation/count* | grep Montague:
CommandException: No URLs matched: gs://temp-storage-for-release-validation-tests/nightly-snapshot-validation/count*
CommandException: No URLs matched: gs://temp-storage-for-release-validation-tests/nightly-snapshot-validation/count*
[ERROR] Failed command
> Task :runners:google-cloud-dataflow-java:runQuickstartJavaDataflow FAILED
FAILURE: Build completed with 2 failures.
1: Task failed with an exception.
-----------
* What went wrong:
Execution failed for task ':runners:google-cloud-dataflow-java:runMobileGamingJavaDataflow'.
> Process 'command '/usr/lib/jvm/java-8-openjdk-amd64/bin/java'' finished with non-zero exit value 1
* Try:
Run with --stacktrace option to get the stack trace. Run with --info or --debug option to get more log output. Run with --scan to get full insights.
==============================================================================
2: Task failed with an exception.
-----------
* What went wrong:
Execution failed for task ':runners:google-cloud-dataflow-java:runQuickstartJavaDataflow'.
> Process 'command '/usr/lib/jvm/java-8-openjdk-amd64/bin/java'' finished with non-zero exit value 1
* Try:
Run with --stacktrace option to get the stack trace. Run with --info or --debug option to get more log output. Run with --scan to get full insights.
==============================================================================
* Get more help at https://help.gradle.org
Deprecated Gradle features were used in this build, making it incompatible with Gradle 6.0.
Use '--warning-mode all' to show the individual deprecation warnings.
See https://docs.gradle.org/5.2.1/userguide/command_line_interface.html#sec:command_line_warnings
BUILD FAILED in 21m 59s
8 actionable tasks: 8 executed
Publishing build scan...
https://gradle.com/s/cibwuhvnt5jys
Build step 'Invoke Gradle script' changed build result to FAILURE
Build step 'Invoke Gradle script' marked build as failure
---------------------------------------------------------------------
To unsubscribe, e-mail: builds-unsubscribe@beam.apache.org
For additional commands, e-mail: builds-help@beam.apache.org
Jenkins build is back to normal : beam_PostRelease_NightlySnapshot
#892
Posted by Apache Jenkins Server <je...@builds.apache.org>.
See <https://builds.apache.org/job/beam_PostRelease_NightlySnapshot/892/display/redirect?page=changes>
---------------------------------------------------------------------
To unsubscribe, e-mail: builds-unsubscribe@beam.apache.org
For additional commands, e-mail: builds-help@beam.apache.org
Build failed in Jenkins: beam_PostRelease_NightlySnapshot #891
Posted by Apache Jenkins Server <je...@builds.apache.org>.
See <https://builds.apache.org/job/beam_PostRelease_NightlySnapshot/891/display/redirect?page=changes>
Changes:
[iemejia] [BEAM-9281] Update commons-csv to version 1.8
[ankurgoenka] [BEAM-9290] Support runner_harness_container_image in released python
[suztomo] beam-linkage-check.sh
[suztomo] copyright
[iemejia] Remove unused ReduceFnRunnerHelper class
[iemejia] Do not set options.filesToStage in case of spark local execution in
[iemejia] Do not set options.filesToStage in case of spark local execution in
[github] [BEAM-6522] [BEAM-7455] Unskip Avro IO tests that are now passing.
[github] [BEAM-5605] Convert all BoundedSources to SplittableDoFns when using
[github] [BEAM-8758] Google-cloud-spanner upgrade to 1.49.1 (#10765)
[github] Ensuring appropriate write_disposition and create_disposition for jobs
[github] [BEAM-3545] Return metrics as MonitoringInfos (#10777)
[github] Modify the TestStreamFileRecord to use TestStreamPayload events.
[iemejia] [BEAM-9280] Update commons-compress to version 1.20
------------------------------------------
[...truncated 3.16 MB...]
[INFO] Downloading from central: https://repo.maven.apache.org/maven2/org/codehaus/plexus/plexus-component-annotations/1.7.1/plexus-component-annotations-1.7.1.jar
[INFO] Downloaded from central: https://repo.maven.apache.org/maven2/net/sourceforge/jchardet/jchardet/1.0/jchardet-1.0.jar (27 kB at 502 kB/s)
[INFO] Downloading from central: https://repo.maven.apache.org/maven2/jdom/jdom/1.0/jdom-1.0.jar
[INFO] Downloaded from central: https://repo.maven.apache.org/maven2/org/codehaus/plexus/plexus-component-annotations/1.7.1/plexus-component-annotations-1.7.1.jar (4.3 kB at 79 kB/s)
[INFO] Downloading from central: https://repo.maven.apache.org/maven2/org/apache/maven/maven-artifact/3.0/maven-artifact-3.0.jar
[INFO] Downloaded from central: https://repo.maven.apache.org/maven2/org/apache/maven/maven-artifact/3.0/maven-artifact-3.0.jar (52 kB at 641 kB/s)
[INFO] Downloading from central: https://repo.maven.apache.org/maven2/org/apache/maven/maven-settings-builder/3.0/maven-settings-builder-3.0.jar
[INFO] Downloaded from central: https://repo.maven.apache.org/maven2/org/apache/maven/archetype/archetype-common/3.1.2/archetype-common-3.1.2.jar (185 kB at 2.0 MB/s)
[INFO] Downloading from central: https://repo.maven.apache.org/maven2/commons-io/commons-io/2.2/commons-io-2.2.jar
[INFO] Downloaded from central: https://repo.maven.apache.org/maven2/jdom/jdom/1.0/jdom-1.0.jar (153 kB at 1.5 MB/s)
[INFO] Downloading from central: https://repo.maven.apache.org/maven2/org/codehaus/plexus/plexus-velocity/1.1.8/plexus-velocity-1.1.8.jar
[INFO] Downloaded from central: https://repo.maven.apache.org/maven2/org/apache/maven/maven-settings-builder/3.0/maven-settings-builder-3.0.jar (38 kB at 353 kB/s)
[INFO] Downloading from central: https://repo.maven.apache.org/maven2/org/apache/velocity/velocity/1.7/velocity-1.7.jar
[INFO] Downloaded from central: https://repo.maven.apache.org/maven2/org/codehaus/plexus/plexus-velocity/1.1.8/plexus-velocity-1.1.8.jar (7.9 kB at 65 kB/s)
[INFO] Downloading from central: https://repo.maven.apache.org/maven2/commons-lang/commons-lang/2.4/commons-lang-2.4.jar
[INFO] Downloaded from central: https://repo.maven.apache.org/maven2/org/apache/ivy/ivy/2.4.0/ivy-2.4.0.jar (1.3 MB at 9.9 MB/s)
[INFO] Downloading from central: https://repo.maven.apache.org/maven2/org/apache/maven/wagon/wagon-provider-api/3.3.3/wagon-provider-api-3.3.3.jar
[INFO] Downloaded from central: https://repo.maven.apache.org/maven2/commons-io/commons-io/2.2/commons-io-2.2.jar (174 kB at 1.3 MB/s)
[INFO] Downloading from central: https://repo.maven.apache.org/maven2/org/codehaus/plexus/plexus-utils/3.2.0/plexus-utils-3.2.0.jar
[INFO] Downloaded from central: https://repo.maven.apache.org/maven2/org/apache/maven/wagon/wagon-provider-api/3.3.3/wagon-provider-api-3.3.3.jar (56 kB at 361 kB/s)
[INFO] Downloading from central: https://repo.maven.apache.org/maven2/org/codehaus/plexus/plexus-interactivity-api/1.0-alpha-6/plexus-interactivity-api-1.0-alpha-6.jar
[INFO] Downloaded from central: https://repo.maven.apache.org/maven2/org/apache/velocity/velocity/1.7/velocity-1.7.jar (450 kB at 2.8 MB/s)
[INFO] Downloading from central: https://repo.maven.apache.org/maven2/org/apache/maven/maven-plugin-api/3.0/maven-plugin-api-3.0.jar
[INFO] Downloaded from central: https://repo.maven.apache.org/maven2/commons-lang/commons-lang/2.4/commons-lang-2.4.jar (262 kB at 1.5 MB/s)
[INFO] Downloading from central: https://repo.maven.apache.org/maven2/org/sonatype/sisu/sisu-inject-plexus/1.4.2/sisu-inject-plexus-1.4.2.jar
[INFO] Downloaded from central: https://repo.maven.apache.org/maven2/org/codehaus/plexus/plexus-utils/3.2.0/plexus-utils-3.2.0.jar (263 kB at 1.5 MB/s)
[INFO] Downloading from central: https://repo.maven.apache.org/maven2/org/sonatype/sisu/sisu-inject-bean/1.4.2/sisu-inject-bean-1.4.2.jar
[INFO] Downloaded from central: https://repo.maven.apache.org/maven2/org/codehaus/plexus/plexus-interactivity-api/1.0-alpha-6/plexus-interactivity-api-1.0-alpha-6.jar (12 kB at 66 kB/s)
[INFO] Downloading from central: https://repo.maven.apache.org/maven2/org/sonatype/sisu/sisu-guice/2.1.7/sisu-guice-2.1.7-noaop.jar
[INFO] Downloaded from central: https://repo.maven.apache.org/maven2/org/apache/maven/maven-plugin-api/3.0/maven-plugin-api-3.0.jar (49 kB at 262 kB/s)
[INFO] Downloading from central: https://repo.maven.apache.org/maven2/org/apache/maven/maven-core/3.0/maven-core-3.0.jar
[INFO] Downloaded from central: https://repo.maven.apache.org/maven2/org/sonatype/sisu/sisu-inject-bean/1.4.2/sisu-inject-bean-1.4.2.jar (153 kB at 729 kB/s)
[INFO] Downloading from central: https://repo.maven.apache.org/maven2/org/apache/maven/maven-repository-metadata/3.0/maven-repository-metadata-3.0.jar
[INFO] Downloaded from central: https://repo.maven.apache.org/maven2/org/sonatype/sisu/sisu-inject-plexus/1.4.2/sisu-inject-plexus-1.4.2.jar (202 kB at 905 kB/s)
[INFO] Downloading from central: https://repo.maven.apache.org/maven2/org/apache/maven/maven-model-builder/3.0/maven-model-builder-3.0.jar
[INFO] Downloaded from central: https://repo.maven.apache.org/maven2/org/apache/maven/maven-repository-metadata/3.0/maven-repository-metadata-3.0.jar (30 kB at 127 kB/s)
[INFO] Downloading from central: https://repo.maven.apache.org/maven2/org/apache/maven/maven-aether-provider/3.0/maven-aether-provider-3.0.jar
[INFO] Downloaded from central: https://repo.maven.apache.org/maven2/org/apache/maven/maven-core/3.0/maven-core-3.0.jar (527 kB at 2.2 MB/s)
[INFO] Downloading from central: https://repo.maven.apache.org/maven2/org/sonatype/aether/aether-impl/1.7/aether-impl-1.7.jar
[INFO] Downloaded from central: https://repo.maven.apache.org/maven2/org/sonatype/sisu/sisu-guice/2.1.7/sisu-guice-2.1.7-noaop.jar (472 kB at 1.9 MB/s)
[INFO] Downloading from central: https://repo.maven.apache.org/maven2/org/sonatype/aether/aether-spi/1.7/aether-spi-1.7.jar
[INFO] Downloaded from central: https://repo.maven.apache.org/maven2/org/apache/maven/maven-aether-provider/3.0/maven-aether-provider-3.0.jar (51 kB at 197 kB/s)
[INFO] Downloading from central: https://repo.maven.apache.org/maven2/org/sonatype/aether/aether-api/1.7/aether-api-1.7.jar
[INFO] Downloaded from central: https://repo.maven.apache.org/maven2/org/apache/maven/maven-model-builder/3.0/maven-model-builder-3.0.jar (148 kB at 565 kB/s)
[INFO] Downloading from central: https://repo.maven.apache.org/maven2/org/sonatype/aether/aether-util/1.7/aether-util-1.7.jar
[INFO] Downloaded from central: https://repo.maven.apache.org/maven2/org/codehaus/groovy/groovy/2.4.16/groovy-2.4.16.jar (4.7 MB at 18 MB/s)
[INFO] Downloading from central: https://repo.maven.apache.org/maven2/org/codehaus/plexus/plexus-interpolation/1.14/plexus-interpolation-1.14.jar
[INFO] Downloaded from central: https://repo.maven.apache.org/maven2/org/sonatype/aether/aether-spi/1.7/aether-spi-1.7.jar (14 kB at 50 kB/s)
[INFO] Downloading from central: https://repo.maven.apache.org/maven2/org/codehaus/plexus/plexus-classworlds/2.2.3/plexus-classworlds-2.2.3.jar
[INFO] Downloaded from central: https://repo.maven.apache.org/maven2/org/sonatype/aether/aether-impl/1.7/aether-impl-1.7.jar (106 kB at 392 kB/s)
[INFO] Downloading from central: https://repo.maven.apache.org/maven2/org/sonatype/plexus/plexus-sec-dispatcher/1.3/plexus-sec-dispatcher-1.3.jar
[INFO] Downloaded from central: https://repo.maven.apache.org/maven2/org/sonatype/aether/aether-util/1.7/aether-util-1.7.jar (108 kB at 374 kB/s)
[INFO] Downloading from central: https://repo.maven.apache.org/maven2/org/sonatype/plexus/plexus-cipher/1.4/plexus-cipher-1.4.jar
[INFO] Downloaded from central: https://repo.maven.apache.org/maven2/org/sonatype/aether/aether-api/1.7/aether-api-1.7.jar (74 kB at 256 kB/s)
[INFO] Downloading from central: https://repo.maven.apache.org/maven2/org/apache/maven/maven-model/3.0/maven-model-3.0.jar
[INFO] Downloaded from central: https://repo.maven.apache.org/maven2/org/codehaus/plexus/plexus-interpolation/1.14/plexus-interpolation-1.14.jar (61 kB at 209 kB/s)
[INFO] Downloading from central: https://repo.maven.apache.org/maven2/org/apache/maven/maven-settings/3.0/maven-settings-3.0.jar
[INFO] Downloaded from central: https://repo.maven.apache.org/maven2/org/codehaus/plexus/plexus-classworlds/2.2.3/plexus-classworlds-2.2.3.jar (46 kB at 156 kB/s)
[INFO] Downloading from central: https://repo.maven.apache.org/maven2/org/apache/maven/shared/maven-invoker/3.0.1/maven-invoker-3.0.1.jar
[INFO] Downloaded from central: https://repo.maven.apache.org/maven2/org/sonatype/plexus/plexus-sec-dispatcher/1.3/plexus-sec-dispatcher-1.3.jar (29 kB at 96 kB/s)
[INFO] Downloading from central: https://repo.maven.apache.org/maven2/org/apache/maven/shared/maven-shared-utils/3.2.1/maven-shared-utils-3.2.1.jar
[INFO] Downloaded from central: https://repo.maven.apache.org/maven2/org/sonatype/plexus/plexus-cipher/1.4/plexus-cipher-1.4.jar (13 kB at 43 kB/s)
[INFO] Downloading from central: https://repo.maven.apache.org/maven2/org/apache/maven/shared/maven-artifact-transfer/0.11.0/maven-artifact-transfer-0.11.0.jar
[INFO] Downloaded from central: https://repo.maven.apache.org/maven2/org/apache/maven/maven-model/3.0/maven-model-3.0.jar (165 kB at 518 kB/s)
[INFO] Downloading from central: https://repo.maven.apache.org/maven2/org/apache/maven/shared/maven-common-artifact-filters/3.0.1/maven-common-artifact-filters-3.0.1.jar
[INFO] Downloaded from central: https://repo.maven.apache.org/maven2/org/apache/maven/maven-settings/3.0/maven-settings-3.0.jar (47 kB at 146 kB/s)
[INFO] Downloading from central: https://repo.maven.apache.org/maven2/commons-codec/commons-codec/1.11/commons-codec-1.11.jar
[INFO] Downloaded from central: https://repo.maven.apache.org/maven2/org/apache/maven/shared/maven-invoker/3.0.1/maven-invoker-3.0.1.jar (33 kB at 103 kB/s)
[INFO] Downloading from central: https://repo.maven.apache.org/maven2/org/slf4j/slf4j-api/1.7.5/slf4j-api-1.7.5.jar
[INFO] Downloaded from central: https://repo.maven.apache.org/maven2/org/apache/maven/shared/maven-shared-utils/3.2.1/maven-shared-utils-3.2.1.jar (167 kB at 499 kB/s)
[INFO] Downloading from central: https://repo.maven.apache.org/maven2/commons-collections/commons-collections/3.2.1/commons-collections-3.2.1.jar
[INFO] Downloaded from central: https://repo.maven.apache.org/maven2/org/apache/maven/shared/maven-artifact-transfer/0.11.0/maven-artifact-transfer-0.11.0.jar (128 kB at 376 kB/s)
[INFO] Downloading from central: https://repo.maven.apache.org/maven2/org/apache/maven/shared/maven-script-interpreter/1.0/maven-script-interpreter-1.0.jar
[INFO] Downloaded from central: https://repo.maven.apache.org/maven2/org/slf4j/slf4j-api/1.7.5/slf4j-api-1.7.5.jar (26 kB at 76 kB/s)
[INFO] Downloading from central: https://repo.maven.apache.org/maven2/org/beanshell/bsh/2.0b4/bsh-2.0b4.jar
[INFO] Downloaded from central: https://repo.maven.apache.org/maven2/org/apache/maven/shared/maven-common-artifact-filters/3.0.1/maven-common-artifact-filters-3.0.1.jar (61 kB at 178 kB/s)
[INFO] Downloading from central: https://repo.maven.apache.org/maven2/org/apache/ant/ant/1.8.1/ant-1.8.1.jar
[INFO] Downloaded from central: https://repo.maven.apache.org/maven2/commons-codec/commons-codec/1.11/commons-codec-1.11.jar (335 kB at 960 kB/s)
[INFO] Downloaded from central: https://repo.maven.apache.org/maven2/org/apache/maven/shared/maven-script-interpreter/1.0/maven-script-interpreter-1.0.jar (21 kB at 57 kB/s)
[INFO] Downloaded from central: https://repo.maven.apache.org/maven2/org/beanshell/bsh/2.0b4/bsh-2.0b4.jar (282 kB at 753 kB/s)
[INFO] Downloaded from central: https://repo.maven.apache.org/maven2/commons-collections/commons-collections/3.2.1/commons-collections-3.2.1.jar (575 kB at 1.5 MB/s)
[INFO] Downloaded from central: https://repo.maven.apache.org/maven2/org/apache/ant/ant/1.8.1/ant-1.8.1.jar (1.5 MB at 3.1 MB/s)
[INFO] Generating project in Batch mode
[INFO] Archetype repository not defined. Using the one from [org.apache.beam:beam-sdks-java-maven-archetypes-examples:2.19.0] found in catalog remote
[INFO] Downloading from test.release: https://repository.apache.org/content/repositories/snapshots/org/apache/beam/beam-sdks-java-maven-archetypes-examples/2.20.0-SNAPSHOT/maven-metadata.xml
[INFO] Downloaded from test.release: https://repository.apache.org/content/repositories/snapshots/org/apache/beam/beam-sdks-java-maven-archetypes-examples/2.20.0-SNAPSHOT/maven-metadata.xml (1.7 kB at 5.0 kB/s)
[INFO] Downloading from test.release: https://repository.apache.org/content/repositories/snapshots/org/apache/beam/beam-sdks-java-maven-archetypes-examples/2.20.0-SNAPSHOT/beam-sdks-java-maven-archetypes-examples-2.20.0-20200214.075628-29.pom
[INFO] Downloaded from test.release: https://repository.apache.org/content/repositories/snapshots/org/apache/beam/beam-sdks-java-maven-archetypes-examples/2.20.0-SNAPSHOT/beam-sdks-java-maven-archetypes-examples-2.20.0-20200214.075628-29.pom (4.0 kB at 13 kB/s)
[INFO] Downloading from test.release: https://repository.apache.org/content/repositories/snapshots/org/apache/beam/beam-sdks-java-maven-archetypes-examples/2.20.0-SNAPSHOT/beam-sdks-java-maven-archetypes-examples-2.20.0-20200214.075628-29.jar
[INFO] Downloaded from test.release: https://repository.apache.org/content/repositories/snapshots/org/apache/beam/beam-sdks-java-maven-archetypes-examples/2.20.0-SNAPSHOT/beam-sdks-java-maven-archetypes-examples-2.20.0-20200214.075628-29.jar (222 kB at 572 kB/s)
[INFO] ----------------------------------------------------------------------------
[INFO] Using following parameters for creating project from Archetype: beam-sdks-java-maven-archetypes-examples:2.20.0-SNAPSHOT
[INFO] ----------------------------------------------------------------------------
[INFO] Parameter: groupId, Value: org.example
[INFO] Parameter: artifactId, Value: word-count-beam
[INFO] Parameter: version, Value: 0.1
[INFO] Parameter: package, Value: org.apache.beam.examples
[INFO] Parameter: packageInPathFormat, Value: org/apache/beam/examples
[INFO] Parameter: package, Value: org.apache.beam.examples
[INFO] Parameter: version, Value: 0.1
[INFO] Parameter: groupId, Value: org.example
[INFO] Parameter: targetPlatform, Value: 1.8
[INFO] Parameter: artifactId, Value: word-count-beam
[INFO] Project created from Archetype in dir: /tmp/groovy-generated-7816451987622850007-tmpdir/word-count-beam
[INFO] ------------------------------------------------------------------------
[INFO] BUILD SUCCESS
[INFO] ------------------------------------------------------------------------
[INFO] Total time: 8.070 s
[INFO] Finished at: 2020-02-14T11:14:40Z
[INFO] ------------------------------------------------------------------------
Verified [INFO] BUILD SUCCESS
cd word-count-beam
ls
pom.xml
src
Verified pom.xml
Verified src
ls src/main/java/org/apache/beam/examples/
common
complete
DebuggingWordCount.java
MinimalWordCount.java
subprocess
WindowedWordCount.java
WordCount.java
Verified WordCount.java
ls src/main/java/org/apache/beam/examples/complete/game/
GameStats.java
HourlyTeamScore.java
injector
LeaderBoard.java
StatefulTeamScore.java
UserScore.java
utils
Verified UserScore.java
**************************************
* Test: Runs the WordCount Code with Direct runner
**************************************
mvn compile exec:java -q -Dexec.mainClass=org.apache.beam.examples.WordCount -Dexec.args="--inputFile=pom.xml --output=counts" -Pdirect-runner
Using maven /home/jenkins/tools/maven/apache-maven-3.5.4
> Task :runners:google-cloud-dataflow-java:runMobileGamingJavaDataflow
Feb 14, 2020 11:15:11 AM org.apache.beam.runners.dataflow.util.MonitoringUtil$LoggingHandler process
INFO: 2020-02-14T11:15:09.583Z: Autoscaling: Resized worker pool from 1 to 0.
Feb 14, 2020 11:15:11 AM org.apache.beam.runners.dataflow.util.MonitoringUtil$LoggingHandler process
INFO: 2020-02-14T11:15:09.626Z: Worker pool stopped.
Feb 14, 2020 11:15:14 AM org.apache.beam.runners.dataflow.DataflowPipelineJob logTerminalState
INFO: Job 2020-02-14_03_09_28-1246423480506749532 failed with status FAILED.
gsutil cat gs://temp-storage-for-release-validation-tests/nightly-snapshot-validation/java-userscore-result-dataflow-runner.txt* | grep user19_BananaWallaby
CommandException: No URLs matched: gs://temp-storage-for-release-validation-tests/nightly-snapshot-validation/java-userscore-result-dataflow-runner.txt*
CommandException: No URLs matched: gs://temp-storage-for-release-validation-tests/nightly-snapshot-validation/java-userscore-result-dataflow-runner.txt*
[ERROR] Failed command
> Task :runners:google-cloud-dataflow-java:runMobileGamingJavaDataflow FAILED
> Task :runners:direct-java:runQuickstartJavaDirect
Feb 14, 2020 11:16:16 AM org.apache.beam.sdk.io.FileBasedSource getEstimatedSizeBytes
INFO: Filepattern pom.xml matched 1 files with total size 17779
Feb 14, 2020 11:16:16 AM org.apache.beam.sdk.io.FileBasedSource split
INFO: Splitting filepattern pom.xml into bundles of size 1111 took 1 ms and produced 1 files and 16 bundles
Feb 14, 2020 11:16:21 AM org.apache.beam.sdk.io.WriteFiles$WriteShardsIntoTempFilesFn processElement
INFO: Opening writer 0cf6079b-a0b2-4e4a-aeeb-315467471b7d for window org.apache.beam.sdk.transforms.windowing.GlobalWindow@56c60c16 pane PaneInfo{isFirst=true, isLast=true, timing=ON_TIME, index=0, onTimeIndex=0} destination null
Feb 14, 2020 11:16:21 AM org.apache.beam.sdk.io.WriteFiles$WriteShardsIntoTempFilesFn processElement
INFO: Opening writer fcdf0d0d-a8de-445f-9ae3-6d2f28716bcf for window org.apache.beam.sdk.transforms.windowing.GlobalWindow@56c60c16 pane PaneInfo{isFirst=true, isLast=true, timing=ON_TIME, index=0, onTimeIndex=0} destination null
Feb 14, 2020 11:16:21 AM org.apache.beam.sdk.io.WriteFiles$WriteShardsIntoTempFilesFn processElement
INFO: Opening writer 20ba7162-2410-4bff-9206-f8fe5ee88ffa for window org.apache.beam.sdk.transforms.windowing.GlobalWindow@56c60c16 pane PaneInfo{isFirst=true, isLast=true, timing=ON_TIME, index=0, onTimeIndex=0} destination null
Feb 14, 2020 11:16:21 AM org.apache.beam.sdk.io.WriteFiles$WriteShardsIntoTempFilesFn processElement
INFO: Opening writer 42e70f69-4adb-4c78-a818-dd7a7f706f6c for window org.apache.beam.sdk.transforms.windowing.GlobalWindow@56c60c16 pane PaneInfo{isFirst=true, isLast=true, timing=ON_TIME, index=0, onTimeIndex=0} destination null
Feb 14, 2020 11:16:21 AM org.apache.beam.sdk.io.WriteFiles$WriteShardsIntoTempFilesFn processElement
INFO: Opening writer 5eb75381-d876-4266-a9bd-9dfce46f242d for window org.apache.beam.sdk.transforms.windowing.GlobalWindow@56c60c16 pane PaneInfo{isFirst=true, isLast=true, timing=ON_TIME, index=0, onTimeIndex=0} destination null
Feb 14, 2020 11:16:21 AM org.apache.beam.sdk.io.FileBasedSink$Writer close
INFO: Successfully wrote temporary file /tmp/groovy-generated-7816451987622850007-tmpdir/word-count-beam/.temp-beam-a39082c3-a288-44af-965a-c1dcbdf0aafc/0cf6079b-a0b2-4e4a-aeeb-315467471b7d
Feb 14, 2020 11:16:21 AM org.apache.beam.sdk.io.FileBasedSink$Writer close
INFO: Successfully wrote temporary file /tmp/groovy-generated-7816451987622850007-tmpdir/word-count-beam/.temp-beam-a39082c3-a288-44af-965a-c1dcbdf0aafc/20ba7162-2410-4bff-9206-f8fe5ee88ffa
Feb 14, 2020 11:16:21 AM org.apache.beam.sdk.io.FileBasedSink$Writer close
INFO: Successfully wrote temporary file /tmp/groovy-generated-7816451987622850007-tmpdir/word-count-beam/.temp-beam-a39082c3-a288-44af-965a-c1dcbdf0aafc/5eb75381-d876-4266-a9bd-9dfce46f242d
Feb 14, 2020 11:16:21 AM org.apache.beam.sdk.io.FileBasedSink$Writer close
INFO: Successfully wrote temporary file /tmp/groovy-generated-7816451987622850007-tmpdir/word-count-beam/.temp-beam-a39082c3-a288-44af-965a-c1dcbdf0aafc/42e70f69-4adb-4c78-a818-dd7a7f706f6c
Feb 14, 2020 11:16:21 AM org.apache.beam.sdk.io.FileBasedSink$Writer close
INFO: Successfully wrote temporary file /tmp/groovy-generated-7816451987622850007-tmpdir/word-count-beam/.temp-beam-a39082c3-a288-44af-965a-c1dcbdf0aafc/fcdf0d0d-a8de-445f-9ae3-6d2f28716bcf
Feb 14, 2020 11:16:21 AM org.apache.beam.sdk.io.WriteFiles$FinalizeTempFileBundles$FinalizeFn process
INFO: Finalizing 5 file results
Feb 14, 2020 11:16:21 AM org.apache.beam.sdk.io.FileBasedSink$WriteOperation createMissingEmptyShards
INFO: Finalizing for destination null num shards 5.
Feb 14, 2020 11:16:21 AM org.apache.beam.sdk.io.FileBasedSink$WriteOperation moveToOutputFiles
INFO: Will copy temporary file FileResult{tempFilename=/tmp/groovy-generated-7816451987622850007-tmpdir/word-count-beam/.temp-beam-a39082c3-a288-44af-965a-c1dcbdf0aafc/0cf6079b-a0b2-4e4a-aeeb-315467471b7d, shard=4, window=org.apache.beam.sdk.transforms.windowing.GlobalWindow@56c60c16, paneInfo=PaneInfo{isFirst=true, isLast=true, timing=ON_TIME, index=0, onTimeIndex=0}} to final location /tmp/groovy-generated-7816451987622850007-tmpdir/word-count-beam/counts-00004-of-00005
Feb 14, 2020 11:16:21 AM org.apache.beam.sdk.io.FileBasedSink$WriteOperation moveToOutputFiles
INFO: Will copy temporary file FileResult{tempFilename=/tmp/groovy-generated-7816451987622850007-tmpdir/word-count-beam/.temp-beam-a39082c3-a288-44af-965a-c1dcbdf0aafc/5eb75381-d876-4266-a9bd-9dfce46f242d, shard=3, window=org.apache.beam.sdk.transforms.windowing.GlobalWindow@56c60c16, paneInfo=PaneInfo{isFirst=true, isLast=true, timing=ON_TIME, index=0, onTimeIndex=0}} to final location /tmp/groovy-generated-7816451987622850007-tmpdir/word-count-beam/counts-00003-of-00005
Feb 14, 2020 11:16:21 AM org.apache.beam.sdk.io.FileBasedSink$WriteOperation moveToOutputFiles
INFO: Will copy temporary file FileResult{tempFilename=/tmp/groovy-generated-7816451987622850007-tmpdir/word-count-beam/.temp-beam-a39082c3-a288-44af-965a-c1dcbdf0aafc/fcdf0d0d-a8de-445f-9ae3-6d2f28716bcf, shard=1, window=org.apache.beam.sdk.transforms.windowing.GlobalWindow@56c60c16, paneInfo=PaneInfo{isFirst=true, isLast=true, timing=ON_TIME, index=0, onTimeIndex=0}} to final location /tmp/groovy-generated-7816451987622850007-tmpdir/word-count-beam/counts-00001-of-00005
Feb 14, 2020 11:16:21 AM org.apache.beam.sdk.io.FileBasedSink$WriteOperation moveToOutputFiles
INFO: Will copy temporary file FileResult{tempFilename=/tmp/groovy-generated-7816451987622850007-tmpdir/word-count-beam/.temp-beam-a39082c3-a288-44af-965a-c1dcbdf0aafc/42e70f69-4adb-4c78-a818-dd7a7f706f6c, shard=0, window=org.apache.beam.sdk.transforms.windowing.GlobalWindow@56c60c16, paneInfo=PaneInfo{isFirst=true, isLast=true, timing=ON_TIME, index=0, onTimeIndex=0}} to final location /tmp/groovy-generated-7816451987622850007-tmpdir/word-count-beam/counts-00000-of-00005
Feb 14, 2020 11:16:21 AM org.apache.beam.sdk.io.FileBasedSink$WriteOperation moveToOutputFiles
INFO: Will copy temporary file FileResult{tempFilename=/tmp/groovy-generated-7816451987622850007-tmpdir/word-count-beam/.temp-beam-a39082c3-a288-44af-965a-c1dcbdf0aafc/20ba7162-2410-4bff-9206-f8fe5ee88ffa, shard=2, window=org.apache.beam.sdk.transforms.windowing.GlobalWindow@56c60c16, paneInfo=PaneInfo{isFirst=true, isLast=true, timing=ON_TIME, index=0, onTimeIndex=0}} to final location /tmp/groovy-generated-7816451987622850007-tmpdir/word-count-beam/counts-00002-of-00005
Feb 14, 2020 11:16:21 AM org.apache.beam.sdk.io.FileBasedSink$WriteOperation removeTemporaryFiles
INFO: Will remove known temporary file /tmp/groovy-generated-7816451987622850007-tmpdir/word-count-beam/.temp-beam-a39082c3-a288-44af-965a-c1dcbdf0aafc/fcdf0d0d-a8de-445f-9ae3-6d2f28716bcf
Feb 14, 2020 11:16:21 AM org.apache.beam.sdk.io.FileBasedSink$WriteOperation removeTemporaryFiles
INFO: Will remove known temporary file /tmp/groovy-generated-7816451987622850007-tmpdir/word-count-beam/.temp-beam-a39082c3-a288-44af-965a-c1dcbdf0aafc/42e70f69-4adb-4c78-a818-dd7a7f706f6c
Feb 14, 2020 11:16:21 AM org.apache.beam.sdk.io.FileBasedSink$WriteOperation removeTemporaryFiles
INFO: Will remove known temporary file /tmp/groovy-generated-7816451987622850007-tmpdir/word-count-beam/.temp-beam-a39082c3-a288-44af-965a-c1dcbdf0aafc/20ba7162-2410-4bff-9206-f8fe5ee88ffa
Feb 14, 2020 11:16:21 AM org.apache.beam.sdk.io.FileBasedSink$WriteOperation removeTemporaryFiles
INFO: Will remove known temporary file /tmp/groovy-generated-7816451987622850007-tmpdir/word-count-beam/.temp-beam-a39082c3-a288-44af-965a-c1dcbdf0aafc/0cf6079b-a0b2-4e4a-aeeb-315467471b7d
Feb 14, 2020 11:16:21 AM org.apache.beam.sdk.io.FileBasedSink$WriteOperation removeTemporaryFiles
INFO: Will remove known temporary file /tmp/groovy-generated-7816451987622850007-tmpdir/word-count-beam/.temp-beam-a39082c3-a288-44af-965a-c1dcbdf0aafc/5eb75381-d876-4266-a9bd-9dfce46f242d
Feb 14, 2020 11:16:22 AM org.apache.beam.sdk.io.FileBasedSink$WriteOperation removeTemporaryFiles
WARNING: Failed to match temporary files under: [/tmp/groovy-generated-7816451987622850007-tmpdir/word-count-beam/.temp-beam-a39082c3-a288-44af-965a-c1dcbdf0aafc/].
grep Foundation counts*
counts-00000-of-00005:Foundation: 1
Verified Foundation: 1
[SUCCESS]
FAILURE: Build completed with 2 failures.
1: Task failed with an exception.
-----------
* What went wrong:
Execution failed for task ':runners:google-cloud-dataflow-java:runQuickstartJavaDataflow'.
> Process 'command '/usr/lib/jvm/java-8-openjdk-amd64/bin/java'' finished with non-zero exit value 1
* Try:
Run with --stacktrace option to get the stack trace. Run with --info or --debug option to get more log output. Run with --scan to get full insights.
==============================================================================
2: Task failed with an exception.
-----------
* What went wrong:
Execution failed for task ':runners:google-cloud-dataflow-java:runMobileGamingJavaDataflow'.
> Process 'command '/usr/lib/jvm/java-8-openjdk-amd64/bin/java'' finished with non-zero exit value 1
* Try:
Run with --stacktrace option to get the stack trace. Run with --info or --debug option to get more log output. Run with --scan to get full insights.
==============================================================================
* Get more help at https://help.gradle.org
Deprecated Gradle features were used in this build, making it incompatible with Gradle 6.0.
Use '--warning-mode all' to show the individual deprecation warnings.
See https://docs.gradle.org/5.2.1/userguide/command_line_interface.html#sec:command_line_warnings
BUILD FAILED in 16m 1s
8 actionable tasks: 7 executed, 1 from cache
Publishing build scan...
https://gradle.com/s/f4lrsyzlrcj44
Build step 'Invoke Gradle script' changed build result to FAILURE
Build step 'Invoke Gradle script' marked build as failure
---------------------------------------------------------------------
To unsubscribe, e-mail: builds-unsubscribe@beam.apache.org
For additional commands, e-mail: builds-help@beam.apache.org