You are viewing a plain text version of this content. The canonical link for it is here.
Posted to notifications@jclouds.apache.org by je...@cloudbees.com on 2014/08/21 18:39:46 UTC
Build failed in Jenkins: jclouds-labs-openstack #433
See <https://jclouds.ci.cloudbees.com/job/jclouds-labs-openstack/433/changes>
Changes:
[Jeremy Daggett] JCLOUDS-630: Map Payload ContentMetadata expires to Swift X-Delete-At header for object expiration.
------------------------------------------
[...truncated 3967 lines...]
[INFO] Exclude: **/test
[INFO] Exclude: **/test.pub
[INFO] Exclude: **/target/**
[INFO] Exclude: **/test-output/**
[INFO] Exclude: **/bin/**
[INFO] Exclude: **/.settings/**
[INFO] Exclude: **/.classpath
[INFO] Exclude: **/.dir-locals.el
[INFO] Exclude: **/.project
[INFO] Exclude: **/.idea/**
[INFO] Exclude: **/*.iml
[INFO] Exclude: **/*.eml
[INFO] Exclude: **/*.ipr
[INFO] Exclude: **/*.iws
[INFO] Exclude: **/*.DS_STORE
[INFO] Exclude: **/TAGS
[INFO] Exclude: **/.metadata/**
[INFO] Exclude: **/atlassian-ide-plugin.xml
[INFO] Exclude: **/.DS_Store
[INFO] Exclude: .mailmap
[INFO] Exclude: .git/**
[INFO] Exclude: **/.gitignore
[INFO] Exclude: **/.gitattributes
[INFO] Exclude: .repository/**
[INFO] Exclude: gc.log
[INFO] 74 resources included (use -debug for more details)
Warning: org.apache.xerces.jaxp.SAXParserImpl$JAXPSAXParser: Property 'http://www.oracle.com/xml/jaxp/properties/entityExpansionLimit' is not recognized.
Compiler warnings:
WARNING: 'org.apache.xerces.jaxp.SAXParserImpl: Property 'http://javax.xml.XMLConstants/property/accessExternalDTD' is not recognized.'
Warning: org.apache.xerces.parsers.SAXParser: Feature 'http://javax.xml.XMLConstants/feature/secure-processing' is not recognized.
Warning: org.apache.xerces.parsers.SAXParser: Property 'http://javax.xml.XMLConstants/property/accessExternalDTD' is not recognized.
Warning: org.apache.xerces.parsers.SAXParser: Property 'http://www.oracle.com/xml/jaxp/properties/entityExpansionLimit' is not recognized.
[INFO] Rat check: Summary of files. Unapproved: 0 unknown: 0 generated: 0 approved: 74 licence.
[INFO]
[INFO] --- maven-jar-plugin:2.4:test-jar (default) @ openstack-swift ---
[INFO] Building jar: <https://jclouds.ci.cloudbees.com/job/jclouds-labs-openstack/ws/openstack-swift/target/openstack-swift-2.0.0-SNAPSHOT-tests.jar>
[INFO]
[INFO] --- maven-javadoc-plugin:2.9:jar (javadoc) @ openstack-swift ---
[INFO]
41 warnings
[WARNING] Javadoc Warnings
[WARNING] <https://jclouds.ci.cloudbees.com/job/jclouds-labs-openstack/ws/openstack-swift/src/main/java/org/jclouds/openstack/swift/v1/features/AccountApi.java>:61: warning - Tag @see:illegal character: "123" in "{@link Account}"
[WARNING] <https://jclouds.ci.cloudbees.com/job/jclouds-labs-openstack/ws/openstack-swift/src/main/java/org/jclouds/openstack/swift/v1/features/AccountApi.java>:61: warning - Tag @see:illegal character: "64" in "{@link Account}"
[WARNING] <https://jclouds.ci.cloudbees.com/job/jclouds-labs-openstack/ws/openstack-swift/src/main/java/org/jclouds/openstack/swift/v1/CopyObjectException.java>:27: warning - Tag @see:illegal character: "123" in "{@link SwiftErrorHandler#handleError(HttpCommand, HttpResponse)}"
[WARNING] <https://jclouds.ci.cloudbees.com/job/jclouds-labs-openstack/ws/openstack-swift/src/main/java/org/jclouds/openstack/swift/v1/CopyObjectException.java>:27: warning - Tag @see:illegal character: "64" in "{@link SwiftErrorHandler#handleError(HttpCommand, HttpResponse)}"
[WARNING] <https://jclouds.ci.cloudbees.com/job/jclouds-labs-openstack/ws/openstack-swift/src/main/java/org/jclouds/openstack/swift/v1/features/AccountApi.java>:61: warning - Tag @see: reference not found: {@link Account}
[WARNING] <https://jclouds.ci.cloudbees.com/job/jclouds-labs-openstack/ws/openstack-swift/src/main/java/org/jclouds/openstack/swift/v1/features/StaticLargeObjectApi.java>:75: warning - Tag @link: reference not found: SwiftObject#getName()
[WARNING] <https://jclouds.ci.cloudbees.com/job/jclouds-labs-openstack/ws/openstack-swift/src/main/java/org/jclouds/openstack/swift/v1/features/StaticLargeObjectApi.java>:75: warning - Tag @link: reference not found: SwiftObject#getMetadata()
[WARNING] <https://jclouds.ci.cloudbees.com/job/jclouds-labs-openstack/ws/openstack-swift/src/main/java/org/jclouds/openstack/swift/v1/features/StaticLargeObjectApi.java>:75: warning - Tag @link: reference not found: SwiftObject#getEtag()
[WARNING] <https://jclouds.ci.cloudbees.com/job/jclouds-labs-openstack/ws/openstack-swift/src/main/java/org/jclouds/openstack/swift/v1/features/StaticLargeObjectApi.java>:90: warning - Tag @link: reference not found: SwiftObject#getName()
[WARNING] <https://jclouds.ci.cloudbees.com/job/jclouds-labs-openstack/ws/openstack-swift/src/main/java/org/jclouds/openstack/swift/v1/CopyObjectException.java>:27: warning - Tag @see: reference not found: {@link SwiftErrorHandler#handleError(HttpCommand, HttpResponse)}
[WARNING] <https://jclouds.ci.cloudbees.com/job/jclouds-labs-openstack/ws/openstack-swift/src/main/java/org/jclouds/openstack/swift/v1/SwiftApi.java>:95: warning - Tag @link: can't find getObjectApiForContainer(String) in org.jclouds.openstack.swift.v1.SwiftApi
[WARNING] <https://jclouds.ci.cloudbees.com/job/jclouds-labs-openstack/ws/openstack-swift/src/main/java/org/jclouds/openstack/swift/v1/SwiftApi.java>:103: warning - Tag @link: can't find getStaticLargeObjectApiForContainer(String) in org.jclouds.openstack.swift.v1.SwiftApi
[WARNING] <https://jclouds.ci.cloudbees.com/job/jclouds-labs-openstack/ws/openstack-swift/src/main/java/org/jclouds/openstack/swift/v1/SwiftApiMetadata.java>:44: warning - Tag @link: reference not found: ApiMetadata
[WARNING] <https://jclouds.ci.cloudbees.com/job/jclouds-labs-openstack/ws/openstack-swift/src/main/java/org/jclouds/openstack/swift/v1/domain/Account.java>:80: warning - Tag @link:illegal character: "38" in "Optional<String>"
[WARNING] <https://jclouds.ci.cloudbees.com/job/jclouds-labs-openstack/ws/openstack-swift/src/main/java/org/jclouds/openstack/swift/v1/domain/Account.java>:80: warning - Tag @link:illegal character: "59" in "Optional<String>"
[WARNING] <https://jclouds.ci.cloudbees.com/job/jclouds-labs-openstack/ws/openstack-swift/src/main/java/org/jclouds/openstack/swift/v1/domain/Account.java>:80: warning - Tag @link:illegal character: "38" in "Optional<String>"
[WARNING] <https://jclouds.ci.cloudbees.com/job/jclouds-labs-openstack/ws/openstack-swift/src/main/java/org/jclouds/openstack/swift/v1/domain/Account.java>:80: warning - Tag @link:illegal character: "59" in "Optional<String>"
[WARNING] <https://jclouds.ci.cloudbees.com/job/jclouds-labs-openstack/ws/openstack-swift/src/main/java/org/jclouds/openstack/swift/v1/domain/Account.java>:80: warning - Tag @link: reference not found: Optional<String>
[WARNING] <https://jclouds.ci.cloudbees.com/job/jclouds-labs-openstack/ws/openstack-swift/src/main/java/org/jclouds/openstack/swift/v1/domain/Container.java>:87: warning - Tag @link: reference not found: ContainerApi#get(String) Get Container
[WARNING] <https://jclouds.ci.cloudbees.com/job/jclouds-labs-openstack/ws/openstack-swift/src/main/java/org/jclouds/openstack/swift/v1/domain/Container.java>:87: warning - Tag @link: reference not found: ContainerApi#get(String) Get Container
[WARNING] <https://jclouds.ci.cloudbees.com/job/jclouds-labs-openstack/ws/openstack-swift/src/main/java/org/jclouds/openstack/swift/v1/domain/SwiftObject.java>:42: warning - Tag @see: reference not found: ObjectApi
[WARNING] <https://jclouds.ci.cloudbees.com/job/jclouds-labs-openstack/ws/openstack-swift/src/main/java/org/jclouds/openstack/swift/v1/domain/SwiftObject.java>:115: warning - Tag @link: reference not found: ObjectApi#head(String) GetObjectMetadata
[WARNING] <https://jclouds.ci.cloudbees.com/job/jclouds-labs-openstack/ws/openstack-swift/src/main/java/org/jclouds/openstack/swift/v1/domain/SwiftObject.java>:115: warning - Tag @link: reference not found: ObjectApi#get(String) GetObject
[WARNING] <https://jclouds.ci.cloudbees.com/job/jclouds-labs-openstack/ws/openstack-swift/src/main/java/org/jclouds/openstack/swift/v1/domain/SwiftObject.java>:126: warning - Tag @link: reference not found: ObjectApi#get(String) GetObject
[WARNING] <https://jclouds.ci.cloudbees.com/job/jclouds-labs-openstack/ws/openstack-swift/src/main/java/org/jclouds/openstack/swift/v1/functions/EntriesWithoutMetaPrefix.java>:34: warning - Tag @return cannot be used in class documentation. It can only be used in the following types of documentation: method.
[WARNING] <https://jclouds.ci.cloudbees.com/job/jclouds-labs-openstack/ws/openstack-swift/src/main/java/org/jclouds/openstack/swift/v1/options/CreateContainerOptions.java>:36: warning - Tag @link: reference not found: Container
[WARNING] <https://jclouds.ci.cloudbees.com/job/jclouds-labs-openstack/ws/openstack-swift/src/main/java/org/jclouds/openstack/swift/v1/options/CreateContainerOptions.java>:36: warning - Tag @see: reference not found: ContainerApi#create(String, CreateContainerOptions)
[WARNING] <https://jclouds.ci.cloudbees.com/job/jclouds-labs-openstack/ws/openstack-swift/src/main/java/org/jclouds/openstack/swift/v1/options/ListContainerOptions.java>:29: warning - Tag @see: reference not found: ContainerApi#list(ListContainerOptions)
[WARNING] <https://jclouds.ci.cloudbees.com/job/jclouds-labs-openstack/ws/openstack-swift/src/main/java/org/jclouds/openstack/swift/v1/options/UpdateContainerOptions.java>:36: warning - Tag @link: reference not found: Container
[WARNING] <https://jclouds.ci.cloudbees.com/job/jclouds-labs-openstack/ws/openstack-swift/src/main/java/org/jclouds/openstack/swift/v1/SwiftApiMetadata.java>:44: warning - Tag @link: reference not found: ApiMetadata
[WARNING] <https://jclouds.ci.cloudbees.com/job/jclouds-labs-openstack/ws/openstack-swift/src/main/java/org/jclouds/openstack/swift/v1/options/CreateContainerOptions.java>:36: warning - Tag @link: reference not found: Container
[WARNING] <https://jclouds.ci.cloudbees.com/job/jclouds-labs-openstack/ws/openstack-swift/src/main/java/org/jclouds/openstack/swift/v1/options/UpdateContainerOptions.java>:36: warning - Tag @link: reference not found: Container
[WARNING] <https://jclouds.ci.cloudbees.com/job/jclouds-labs-openstack/ws/openstack-swift/src/main/java/org/jclouds/openstack/swift/v1/SwiftApiMetadata.java>:44: warning - Tag @link: reference not found: ApiMetadata
[WARNING] <https://jclouds.ci.cloudbees.com/job/jclouds-labs-openstack/ws/openstack-swift/src/main/java/org/jclouds/openstack/swift/v1/options/CreateContainerOptions.java>:36: warning - Tag @link: reference not found: Container
[WARNING] <https://jclouds.ci.cloudbees.com/job/jclouds-labs-openstack/ws/openstack-swift/src/main/java/org/jclouds/openstack/swift/v1/options/UpdateContainerOptions.java>:36: warning - Tag @link: reference not found: Container
[WARNING] <https://jclouds.ci.cloudbees.com/job/jclouds-labs-openstack/ws/openstack-swift/src/main/java/org/jclouds/openstack/swift/v1/options/CreateContainerOptions.java>:36: warning - Tag @link: reference not found: Container
[WARNING] <https://jclouds.ci.cloudbees.com/job/jclouds-labs-openstack/ws/openstack-swift/src/main/java/org/jclouds/openstack/swift/v1/options/UpdateContainerOptions.java>:36: warning - Tag @link: reference not found: Container
[WARNING] <https://jclouds.ci.cloudbees.com/job/jclouds-labs-openstack/ws/openstack-swift/src/main/java/org/jclouds/openstack/swift/v1/options/CreateContainerOptions.java>:36: warning - Tag @link: reference not found: Container
[WARNING] <https://jclouds.ci.cloudbees.com/job/jclouds-labs-openstack/ws/openstack-swift/src/main/java/org/jclouds/openstack/swift/v1/domain/Container.java>:87: warning - Tag @link: reference not found: ContainerApi#get(String) Get Container
[WARNING] <https://jclouds.ci.cloudbees.com/job/jclouds-labs-openstack/ws/openstack-swift/src/main/java/org/jclouds/openstack/swift/v1/SwiftApiMetadata.java>:44: warning - Tag @link: reference not found: ApiMetadata
[WARNING] <https://jclouds.ci.cloudbees.com/job/jclouds-labs-openstack/ws/openstack-swift/src/main/java/org/jclouds/openstack/swift/v1/options/UpdateContainerOptions.java>:36: warning - Tag @link: reference not found: Container
[INFO] Building jar: <https://jclouds.ci.cloudbees.com/job/jclouds-labs-openstack/ws/openstack-swift/target/openstack-swift-2.0.0-SNAPSHOT-javadoc.jar>
[INFO]
[INFO] --- maven-source-plugin:2.2:jar-no-fork (attach-sources) @ openstack-swift ---
[INFO] Building jar: <https://jclouds.ci.cloudbees.com/job/jclouds-labs-openstack/ws/openstack-swift/target/openstack-swift-2.0.0-SNAPSHOT-sources.jar>
[INFO]
[INFO] --- maven-surefire-plugin:2.17:test (integration) @ openstack-swift ---
[JENKINS] Recording test results
[INFO]
[INFO] --- maven-duplicate-finder-plugin:1.0.5:check (default) @ openstack-swift ---
[INFO] Checking compile classpath
[INFO] Checking runtime classpath
[INFO] Checking test classpath
[INFO]
[INFO] --- maven-install-plugin:2.4:install (default-install) @ openstack-swift ---
[INFO] Installing <https://jclouds.ci.cloudbees.com/job/jclouds-labs-openstack/ws/openstack-swift/target/openstack-swift-2.0.0-SNAPSHOT.jar> to <https://jclouds.ci.cloudbees.com/job/jclouds-labs-openstack/ws/.repository/org/apache/jclouds/labs/openstack-swift/2.0.0-SNAPSHOT/openstack-swift-2.0.0-SNAPSHOT.jar>
[INFO] Installing <https://jclouds.ci.cloudbees.com/job/jclouds-labs-openstack/ws/openstack-swift/pom.xml> to <https://jclouds.ci.cloudbees.com/job/jclouds-labs-openstack/ws/.repository/org/apache/jclouds/labs/openstack-swift/2.0.0-SNAPSHOT/openstack-swift-2.0.0-SNAPSHOT.pom>
[INFO] Installing <https://jclouds.ci.cloudbees.com/job/jclouds-labs-openstack/ws/openstack-swift/target/openstack-swift-2.0.0-SNAPSHOT-tests.jar> to <https://jclouds.ci.cloudbees.com/job/jclouds-labs-openstack/ws/.repository/org/apache/jclouds/labs/openstack-swift/2.0.0-SNAPSHOT/openstack-swift-2.0.0-SNAPSHOT-tests.jar>
[INFO] Installing <https://jclouds.ci.cloudbees.com/job/jclouds-labs-openstack/ws/openstack-swift/target/openstack-swift-2.0.0-SNAPSHOT-javadoc.jar> to <https://jclouds.ci.cloudbees.com/job/jclouds-labs-openstack/ws/.repository/org/apache/jclouds/labs/openstack-swift/2.0.0-SNAPSHOT/openstack-swift-2.0.0-SNAPSHOT-javadoc.jar>
[INFO] Installing <https://jclouds.ci.cloudbees.com/job/jclouds-labs-openstack/ws/openstack-swift/target/openstack-swift-2.0.0-SNAPSHOT-sources.jar> to <https://jclouds.ci.cloudbees.com/job/jclouds-labs-openstack/ws/.repository/org/apache/jclouds/labs/openstack-swift/2.0.0-SNAPSHOT/openstack-swift-2.0.0-SNAPSHOT-sources.jar>
[INFO]
[INFO] --- maven-bundle-plugin:2.3.7:install (default-install) @ openstack-swift ---
[INFO] Local OBR update disabled (enable with -DobrRepository)
[INFO]
[INFO] --- maven-deploy-plugin:2.7:deploy (default-deploy) @ openstack-swift ---
Downloading: https://repository.apache.org/content/repositories/snapshots/org/apache/jclouds/labs/openstack-swift/2.0.0-SNAPSHOT/maven-metadata.xml
Downloaded: https://repository.apache.org/content/repositories/snapshots/org/apache/jclouds/labs/openstack-swift/2.0.0-SNAPSHOT/maven-metadata.xml (2 KB at 0.7 KB/sec)
Uploading: https://repository.apache.org/content/repositories/snapshots/org/apache/jclouds/labs/openstack-swift/2.0.0-SNAPSHOT/openstack-swift-2.0.0-20140821.163417-18.jar
Uploaded: https://repository.apache.org/content/repositories/snapshots/org/apache/jclouds/labs/openstack-swift/2.0.0-SNAPSHOT/openstack-swift-2.0.0-20140821.163417-18.jar (129 KB at 13.9 KB/sec)
Uploading: https://repository.apache.org/content/repositories/snapshots/org/apache/jclouds/labs/openstack-swift/2.0.0-SNAPSHOT/openstack-swift-2.0.0-20140821.163417-18.pom
Uploaded: https://repository.apache.org/content/repositories/snapshots/org/apache/jclouds/labs/openstack-swift/2.0.0-SNAPSHOT/openstack-swift-2.0.0-20140821.163417-18.pom (7 KB at 1.2 KB/sec)
Downloading: https://repository.apache.org/content/repositories/snapshots/org/apache/jclouds/labs/openstack-swift/maven-metadata.xml
Downloaded: https://repository.apache.org/content/repositories/snapshots/org/apache/jclouds/labs/openstack-swift/maven-metadata.xml (559 B at 0.1 KB/sec)
Uploading: https://repository.apache.org/content/repositories/snapshots/org/apache/jclouds/labs/openstack-swift/2.0.0-SNAPSHOT/maven-metadata.xml
Uploaded: https://repository.apache.org/content/repositories/snapshots/org/apache/jclouds/labs/openstack-swift/2.0.0-SNAPSHOT/maven-metadata.xml (2 KB at 0.0 KB/sec)
Uploading: https://repository.apache.org/content/repositories/snapshots/org/apache/jclouds/labs/openstack-swift/maven-metadata.xml
Uploaded: https://repository.apache.org/content/repositories/snapshots/org/apache/jclouds/labs/openstack-swift/maven-metadata.xml (559 B at 0.0 KB/sec)
Uploading: https://repository.apache.org/content/repositories/snapshots/org/apache/jclouds/labs/openstack-swift/2.0.0-SNAPSHOT/openstack-swift-2.0.0-20140821.163417-18-tests.jar
Uploaded: https://repository.apache.org/content/repositories/snapshots/org/apache/jclouds/labs/openstack-swift/2.0.0-SNAPSHOT/openstack-swift-2.0.0-20140821.163417-18-tests.jar (79 KB at 0.7 KB/sec)
Uploading: https://repository.apache.org/content/repositories/snapshots/org/apache/jclouds/labs/openstack-swift/2.0.0-SNAPSHOT/maven-metadata.xml
[INFO] ------------------------------------------------------------------------
[INFO] Reactor Summary:
[INFO]
[INFO] jclouds openstack-glance api ...................... SUCCESS [6:13.881s]
[INFO] jclouds openstack-neutron api ..................... SUCCESS [6:13.828s]
[INFO] jclouds openstack-swift api ....................... FAILURE [7:45.801s]
[INFO] jclouds openstack-marconi api ..................... SKIPPED
[INFO] jclouds Rackspace Auto Scale API .................. SKIPPED
[INFO] jclouds Rackspace Auto Scale UK Provider .......... SKIPPED
[INFO] jclouds Rackspace Auto Scale US Provider .......... SKIPPED
[INFO] jclouds Rackspace Cloud Queues US provider ........ SKIPPED
[INFO] jclouds Rackspace Cloud Queues UK provider ........ SKIPPED
[INFO] jclouds rackspace-cloudbigdata api ................ SKIPPED
[INFO] jclouds rackspace-cloudbigdata api provider ....... SKIPPED
[INFO] jclouds rackspace-cloudfiles api .................. SKIPPED
[INFO] jclouds Rackspace Cloud Files UK provider ......... SKIPPED
[INFO] jclouds Rackspace Cloud Files US provider ......... SKIPPED
[INFO] Apache jclouds labs openstack ..................... SKIPPED
[INFO] ------------------------------------------------------------------------
[INFO] BUILD FAILURE
[INFO] ------------------------------------------------------------------------
[INFO] Total time: 20:31.604s
[INFO] Finished at: Thu Aug 21 12:39:23 EDT 2014
[INFO] Final Memory: 35M/147M
[INFO] ------------------------------------------------------------------------
Waiting for Jenkins to finish collecting data
[ERROR] Failed to execute goal org.apache.maven.plugins:maven-deploy-plugin:2.7:deploy (default-deploy) on project openstack-swift: Failed to deploy metadata: Could not transfer metadata org.apache.jclouds.labs:openstack-swift:2.0.0-SNAPSHOT/maven-metadata.xml from/to apache.snapshots.https (https://repository.apache.org/content/repositories/snapshots): Failed to transfer file: https://repository.apache.org/content/repositories/snapshots/org/apache/jclouds/labs/openstack-swift/2.0.0-SNAPSHOT/maven-metadata.xml. Return code is: 502 -> [Help 1]
org.apache.maven.lifecycle.LifecycleExecutionException: Failed to execute goal org.apache.maven.plugins:maven-deploy-plugin:2.7:deploy (default-deploy) on project openstack-swift: Failed to deploy metadata: Could not transfer metadata org.apache.jclouds.labs:openstack-swift:2.0.0-SNAPSHOT/maven-metadata.xml from/to apache.snapshots.https (https://repository.apache.org/content/repositories/snapshots): Failed to transfer file: https://repository.apache.org/content/repositories/snapshots/org/apache/jclouds/labs/openstack-swift/2.0.0-SNAPSHOT/maven-metadata.xml. Return code is: 502
at org.apache.maven.lifecycle.internal.MojoExecutor.execute(MojoExecutor.java:217)
at org.apache.maven.lifecycle.internal.MojoExecutor.execute(MojoExecutor.java:153)
at org.apache.maven.lifecycle.internal.MojoExecutor.execute(MojoExecutor.java:145)
at org.apache.maven.lifecycle.internal.LifecycleModuleBuilder.buildProject(LifecycleModuleBuilder.java:84)
at org.apache.maven.lifecycle.internal.LifecycleModuleBuilder.buildProject(LifecycleModuleBuilder.java:59)
at org.apache.maven.lifecycle.internal.LifecycleStarter.singleThreadedBuild(LifecycleStarter.java:183)
at org.apache.maven.lifecycle.internal.LifecycleStarter.execute(LifecycleStarter.java:161)
at org.apache.maven.DefaultMaven.doExecute(DefaultMaven.java:319)
at org.apache.maven.DefaultMaven.execute(DefaultMaven.java:156)
at org.jvnet.hudson.maven3.launcher.Maven3Launcher.main(Maven3Launcher.java:117)
at sun.reflect.NativeMethodAccessorImpl.invoke0(Native Method)
at sun.reflect.NativeMethodAccessorImpl.invoke(NativeMethodAccessorImpl.java:57)
at sun.reflect.DelegatingMethodAccessorImpl.invoke(DelegatingMethodAccessorImpl.java:43)
at java.lang.reflect.Method.invoke(Method.java:606)
at org.codehaus.plexus.classworlds.launcher.Launcher.launchStandard(Launcher.java:329)
at org.codehaus.plexus.classworlds.launcher.Launcher.launch(Launcher.java:239)
at org.jvnet.hudson.maven3.agent.Maven3Main.launch(Maven3Main.java:178)
at sun.reflect.NativeMethodAccessorImpl.invoke0(Native Method)
at sun.reflect.NativeMethodAccessorImpl.invoke(NativeMethodAccessorImpl.java:57)
at sun.reflect.DelegatingMethodAccessorImpl.invoke(DelegatingMethodAccessorImpl.java:43)
at java.lang.reflect.Method.invoke(Method.java:606)
at hudson.maven.Maven3Builder.call(Maven3Builder.java:134)
at hudson.maven.Maven3Builder.call(Maven3Builder.java:69)
at hudson.remoting.UserRequest.perform(UserRequest.java:118)
at hudson.remoting.UserRequest.perform(UserRequest.java:48)
at hudson.remoting.Request$2.run(Request.java:328)
at hudson.remoting.InterceptingExecutorService$1.call(InterceptingExecutorService.java:72)
at java.util.concurrent.FutureTask.run(FutureTask.java:262)
at java.util.concurrent.ThreadPoolExecutor.runWorker(ThreadPoolExecutor.java:1145)
at java.util.concurrent.ThreadPoolExecutor$Worker.run(ThreadPoolExecutor.java:615)
at java.lang.Thread.run(Thread.java:744)
Caused by: org.apache.maven.plugin.MojoExecutionException: Failed to deploy metadata: Could not transfer metadata org.apache.jclouds.labs:openstack-swift:2.0.0-SNAPSHOT/maven-metadata.xml from/to apache.snapshots.https (https://repository.apache.org/content/repositories/snapshots): Failed to transfer file: https://repository.apache.org/content/repositories/snapshots/org/apache/jclouds/labs/openstack-swift/2.0.0-SNAPSHOT/maven-metadata.xml. Return code is: 502
at org.apache.maven.plugin.deploy.DeployMojo.execute(DeployMojo.java:193)
at org.apache.maven.plugin.DefaultBuildPluginManager.executeMojo(DefaultBuildPluginManager.java:101)
at org.apache.maven.lifecycle.internal.MojoExecutor.execute(MojoExecutor.java:209)
... 30 more
Caused by: org.apache.maven.artifact.deployer.ArtifactDeploymentException: Failed to deploy metadata: Could not transfer metadata org.apache.jclouds.labs:openstack-swift:2.0.0-SNAPSHOT/maven-metadata.xml from/to apache.snapshots.https (https://repository.apache.org/content/repositories/snapshots): Failed to transfer file: https://repository.apache.org/content/repositories/snapshots/org/apache/jclouds/labs/openstack-swift/2.0.0-SNAPSHOT/maven-metadata.xml. Return code is: 502
at org.apache.maven.artifact.deployer.DefaultArtifactDeployer.deploy(DefaultArtifactDeployer.java:141)
at org.apache.maven.plugin.deploy.AbstractDeployMojo.deploy(AbstractDeployMojo.java:167)
at org.apache.maven.plugin.deploy.DeployMojo.execute(DeployMojo.java:188)
... 32 more
Caused by: org.sonatype.aether.deployment.DeploymentException: Failed to deploy metadata: Could not transfer metadata org.apache.jclouds.labs:openstack-swift:2.0.0-SNAPSHOT/maven-metadata.xml from/to apache.snapshots.https (https://repository.apache.org/content/repositories/snapshots): Failed to transfer file: https://repository.apache.org/content/repositories/snapshots/org/apache/jclouds/labs/openstack-swift/2.0.0-SNAPSHOT/maven-metadata.xml. Return code is: 502
at org.sonatype.aether.impl.internal.DefaultDeployer.deploy(DefaultDeployer.java:315)
at org.sonatype.aether.impl.internal.DefaultDeployer.deploy(DefaultDeployer.java:215)
at org.sonatype.aether.impl.internal.DefaultRepositorySystem.deploy(DefaultRepositorySystem.java:480)
at org.apache.maven.artifact.deployer.DefaultArtifactDeployer.deploy(DefaultArtifactDeployer.java:137)
... 34 more
Caused by: org.sonatype.aether.transfer.MetadataTransferException: Could not transfer metadata org.apache.jclouds.labs:openstack-swift:2.0.0-SNAPSHOT/maven-metadata.xml from/to apache.snapshots.https (https://repository.apache.org/content/repositories/snapshots): Failed to transfer file: https://repository.apache.org/content/repositories/snapshots/org/apache/jclouds/labs/openstack-swift/2.0.0-SNAPSHOT/maven-metadata.xml. Return code is: 502
at org.sonatype.aether.connector.wagon.WagonRepositoryConnector$3.wrap(WagonRepositoryConnector.java:932)
at org.sonatype.aether.connector.wagon.WagonRepositoryConnector$3.wrap(WagonRepositoryConnector.java:923)
at org.sonatype.aether.connector.wagon.WagonRepositoryConnector$PutTask.flush(WagonRepositoryConnector.java:864)
at org.sonatype.aether.connector.wagon.WagonRepositoryConnector.put(WagonRepositoryConnector.java:475)
at org.sonatype.aether.impl.internal.DefaultDeployer.deploy(DefaultDeployer.java:309)
... 37 more
Caused by: org.apache.maven.wagon.TransferFailedException: Failed to transfer file: https://repository.apache.org/content/repositories/snapshots/org/apache/jclouds/labs/openstack-swift/2.0.0-SNAPSHOT/maven-metadata.xml. Return code is: 502
at org.apache.maven.wagon.providers.http.LightweightHttpWagon.finishPutTransfer(LightweightHttpWagon.java:205)
at org.apache.maven.wagon.AbstractWagon.putTransfer(AbstractWagon.java:413)
at org.apache.maven.wagon.AbstractWagon.transfer(AbstractWagon.java:392)
at org.apache.maven.wagon.AbstractWagon.putTransfer(AbstractWagon.java:365)
at org.apache.maven.wagon.StreamWagon.put(StreamWagon.java:163)
at org.sonatype.aether.connector.wagon.WagonRepositoryConnector$PutTask.run(WagonRepositoryConnector.java:825)
at org.sonatype.aether.connector.wagon.WagonRepositoryConnector.put(WagonRepositoryConnector.java:474)
... 38 more
[ERROR]
[ERROR] Re-run Maven using the -X switch to enable full debug logging.
[ERROR]
[ERROR] For more information about the errors and possible solutions, please read the following articles:
[ERROR] [Help 1] http://cwiki.apache.org/confluence/display/MAVEN/MojoExecutionException
[ERROR]
[ERROR] After correcting the problems, you can resume the build with the command
[ERROR] mvn <goals> -rf :openstack-swift
[JENKINS] Archiving <https://jclouds.ci.cloudbees.com/job/jclouds-labs-openstack/ws/rackspace-cloudqueues-us/pom.xml> to org.apache.jclouds.labs/rackspace-cloudqueues-us/2.0.0-SNAPSHOT/rackspace-cloudqueues-us-2.0.0-SNAPSHOT.pom
[JENKINS] Archiving <https://jclouds.ci.cloudbees.com/job/jclouds-labs-openstack/ws/rackspace-autoscale-uk/pom.xml> to org.apache.jclouds.labs/rackspace-autoscale-uk/2.0.0-SNAPSHOT/rackspace-autoscale-uk-2.0.0-SNAPSHOT.pom
[JENKINS] Archiving <https://jclouds.ci.cloudbees.com/job/jclouds-labs-openstack/ws/rackspace-cloudbigdata/pom.xml> to org.apache.jclouds.labs/rackspace-cloudbigdata/2.0.0-SNAPSHOT/rackspace-cloudbigdata-2.0.0-SNAPSHOT.pom
[JENKINS] Archiving <https://jclouds.ci.cloudbees.com/job/jclouds-labs-openstack/ws/rackspace-cloudbigdata-us/pom.xml> to org.apache.jclouds.labs/rackspace-cloudbigdata-us/2.0.0-SNAPSHOT/rackspace-cloudbigdata-us-2.0.0-SNAPSHOT.pom
[JENKINS] Archiving <https://jclouds.ci.cloudbees.com/job/jclouds-labs-openstack/ws/pom.xml> to org.apache.jclouds.labs/jclouds-labs-openstack/2.0.0-SNAPSHOT/jclouds-labs-openstack-2.0.0-SNAPSHOT.pom
[JENKINS] Archiving <https://jclouds.ci.cloudbees.com/job/jclouds-labs-openstack/ws/rackspace-autoscale-us/pom.xml> to org.apache.jclouds.labs/rackspace-autoscale-us/2.0.0-SNAPSHOT/rackspace-autoscale-us-2.0.0-SNAPSHOT.pom
[JENKINS] Archiving <https://jclouds.ci.cloudbees.com/job/jclouds-labs-openstack/ws/rackspace-autoscale/pom.xml> to org.apache.jclouds.labs/rackspace-autoscale/2.0.0-SNAPSHOT/rackspace-autoscale-2.0.0-SNAPSHOT.pom
[JENKINS] Archiving <https://jclouds.ci.cloudbees.com/job/jclouds-labs-openstack/ws/openstack-swift/pom.xml> to org.apache.jclouds.labs/openstack-swift/2.0.0-SNAPSHOT/openstack-swift-2.0.0-SNAPSHOT.pom
[JENKINS] Archiving <https://jclouds.ci.cloudbees.com/job/jclouds-labs-openstack/ws/openstack-swift/target/openstack-swift-2.0.0-SNAPSHOT.jar> to org.apache.jclouds.labs/openstack-swift/2.0.0-20140821.163417-18/openstack-swift-2.0.0-20140821.163417-18.jar
[JENKINS] Archiving <https://jclouds.ci.cloudbees.com/job/jclouds-labs-openstack/ws/openstack-swift/target/openstack-swift-2.0.0-SNAPSHOT-tests.jar> to org.apache.jclouds.labs/openstack-swift/2.0.0-20140821.163417-18/openstack-swift-2.0.0-20140821.163417-18-tests.jar
[JENKINS] Archiving <https://jclouds.ci.cloudbees.com/job/jclouds-labs-openstack/ws/openstack-swift/target/openstack-swift-2.0.0-SNAPSHOT-javadoc.jar> to org.apache.jclouds.labs/openstack-swift/2.0.0-20140821.163417-18/openstack-swift-2.0.0-20140821.163417-18-javadoc.jar
[JENKINS] Archiving <https://jclouds.ci.cloudbees.com/job/jclouds-labs-openstack/ws/openstack-swift/target/openstack-swift-2.0.0-SNAPSHOT-sources.jar> to org.apache.jclouds.labs/openstack-swift/2.0.0-20140821.163417-18/openstack-swift-2.0.0-20140821.163417-18-sources.jar
[JENKINS] Archiving <https://jclouds.ci.cloudbees.com/job/jclouds-labs-openstack/ws/openstack-neutron/pom.xml> to org.apache.jclouds.labs/openstack-neutron/2.0.0-SNAPSHOT/openstack-neutron-2.0.0-SNAPSHOT.pom
[JENKINS] Archiving <https://jclouds.ci.cloudbees.com/job/jclouds-labs-openstack/ws/openstack-neutron/target/openstack-neutron-2.0.0-SNAPSHOT.jar> to org.apache.jclouds.labs/openstack-neutron/2.0.0-20140821.162825-18/openstack-neutron-2.0.0-20140821.162825-18.jar
[JENKINS] Archiving <https://jclouds.ci.cloudbees.com/job/jclouds-labs-openstack/ws/openstack-neutron/target/openstack-neutron-2.0.0-SNAPSHOT-tests.jar> to org.apache.jclouds.labs/openstack-neutron/2.0.0-20140821.162825-18/openstack-neutron-2.0.0-20140821.162825-18-tests.jar
[JENKINS] Archiving <https://jclouds.ci.cloudbees.com/job/jclouds-labs-openstack/ws/openstack-neutron/target/openstack-neutron-2.0.0-SNAPSHOT-javadoc.jar> to org.apache.jclouds.labs/openstack-neutron/2.0.0-20140821.162825-18/openstack-neutron-2.0.0-20140821.162825-18-javadoc.jar
[JENKINS] Archiving <https://jclouds.ci.cloudbees.com/job/jclouds-labs-openstack/ws/openstack-neutron/target/openstack-neutron-2.0.0-SNAPSHOT-sources.jar> to org.apache.jclouds.labs/openstack-neutron/2.0.0-20140821.162825-18/openstack-neutron-2.0.0-20140821.162825-18-sources.jar
[JENKINS] Archiving <https://jclouds.ci.cloudbees.com/job/jclouds-labs-openstack/ws/openstack-glance/pom.xml> to org.apache.jclouds.labs/openstack-glance/2.0.0-SNAPSHOT/openstack-glance-2.0.0-SNAPSHOT.pom
[JENKINS] Archiving <https://jclouds.ci.cloudbees.com/job/jclouds-labs-openstack/ws/openstack-glance/target/openstack-glance-2.0.0-SNAPSHOT.jar> to org.apache.jclouds.labs/openstack-glance/2.0.0-20140821.162337-19/openstack-glance-2.0.0-20140821.162337-19.jar
[JENKINS] Archiving <https://jclouds.ci.cloudbees.com/job/jclouds-labs-openstack/ws/openstack-glance/target/openstack-glance-2.0.0-SNAPSHOT-tests.jar> to org.apache.jclouds.labs/openstack-glance/2.0.0-20140821.162337-19/openstack-glance-2.0.0-20140821.162337-19-tests.jar
[JENKINS] Archiving <https://jclouds.ci.cloudbees.com/job/jclouds-labs-openstack/ws/openstack-glance/target/openstack-glance-2.0.0-SNAPSHOT-javadoc.jar> to org.apache.jclouds.labs/openstack-glance/2.0.0-20140821.162337-19/openstack-glance-2.0.0-20140821.162337-19-javadoc.jar
[JENKINS] Archiving <https://jclouds.ci.cloudbees.com/job/jclouds-labs-openstack/ws/openstack-glance/target/openstack-glance-2.0.0-SNAPSHOT-sources.jar> to org.apache.jclouds.labs/openstack-glance/2.0.0-20140821.162337-19/openstack-glance-2.0.0-20140821.162337-19-sources.jar
[JENKINS] Archiving <https://jclouds.ci.cloudbees.com/job/jclouds-labs-openstack/ws/rackspace-cloudfiles-uk/pom.xml> to org.apache.jclouds.labs/rackspace-cloudfiles-uk/2.0.0-SNAPSHOT/rackspace-cloudfiles-uk-2.0.0-SNAPSHOT.pom
[JENKINS] Archiving <https://jclouds.ci.cloudbees.com/job/jclouds-labs-openstack/ws/rackspace-cloudfiles/pom.xml> to org.apache.jclouds.labs/rackspace-cloudfiles/2.0.0-SNAPSHOT/rackspace-cloudfiles-2.0.0-SNAPSHOT.pom
[JENKINS] Archiving <https://jclouds.ci.cloudbees.com/job/jclouds-labs-openstack/ws/openstack-marconi/pom.xml> to org.apache.jclouds.labs/openstack-marconi/2.0.0-SNAPSHOT/openstack-marconi-2.0.0-SNAPSHOT.pom
[JENKINS] Archiving <https://jclouds.ci.cloudbees.com/job/jclouds-labs-openstack/ws/rackspace-cloudqueues-uk/pom.xml> to org.apache.jclouds.labs/rackspace-cloudqueues-uk/2.0.0-SNAPSHOT/rackspace-cloudqueues-uk-2.0.0-SNAPSHOT.pom
[JENKINS] Archiving <https://jclouds.ci.cloudbees.com/job/jclouds-labs-openstack/ws/rackspace-cloudfiles-us/pom.xml> to org.apache.jclouds.labs/rackspace-cloudfiles-us/2.0.0-SNAPSHOT/rackspace-cloudfiles-us-2.0.0-SNAPSHOT.pom
Sending e-mails to: notifications@jclouds.apache.org
channel stopped
Jenkins build is back to normal : jclouds-labs-openstack #435
Posted by je...@cloudbees.com.
See <https://jclouds.ci.cloudbees.com/job/jclouds-labs-openstack/435/>
Build failed in Jenkins: jclouds-labs-openstack #434
Posted by je...@cloudbees.com.
See <https://jclouds.ci.cloudbees.com/job/jclouds-labs-openstack/434/changes>
Changes:
[Jeremy Daggett] Fix Maven parent.relativePath warnings
------------------------------------------
[...truncated 2183 lines...]
[INFO] Exclude: **/CONTRIBUTING.md
[INFO] Exclude: **/*json
[INFO] Exclude: **/*readme
[INFO] Exclude: **/test
[INFO] Exclude: **/test.pub
[INFO] Exclude: **/target/**
[INFO] Exclude: **/test-output/**
[INFO] Exclude: **/bin/**
[INFO] Exclude: **/.settings/**
[INFO] Exclude: **/.classpath
[INFO] Exclude: **/.dir-locals.el
[INFO] Exclude: **/.project
[INFO] Exclude: **/.idea/**
[INFO] Exclude: **/*.iml
[INFO] Exclude: **/*.eml
[INFO] Exclude: **/*.ipr
[INFO] Exclude: **/*.iws
[INFO] Exclude: **/*.DS_STORE
[INFO] Exclude: **/TAGS
[INFO] Exclude: **/.metadata/**
[INFO] Exclude: **/atlassian-ide-plugin.xml
[INFO] Exclude: **/.DS_Store
[INFO] Exclude: .mailmap
[INFO] Exclude: .git/**
[INFO] Exclude: **/.gitignore
[INFO] Exclude: **/.gitattributes
[INFO] Exclude: .repository/**
[INFO] Exclude: gc.log
[INFO] 38 resources included (use -debug for more details)
Warning: org.apache.xerces.jaxp.SAXParserImpl$JAXPSAXParser: Property 'http://www.oracle.com/xml/jaxp/properties/entityExpansionLimit' is not recognized.
Compiler warnings:
WARNING: 'org.apache.xerces.jaxp.SAXParserImpl: Property 'http://javax.xml.XMLConstants/property/accessExternalDTD' is not recognized.'
Warning: org.apache.xerces.parsers.SAXParser: Feature 'http://javax.xml.XMLConstants/feature/secure-processing' is not recognized.
Warning: org.apache.xerces.parsers.SAXParser: Property 'http://javax.xml.XMLConstants/property/accessExternalDTD' is not recognized.
Warning: org.apache.xerces.parsers.SAXParser: Property 'http://www.oracle.com/xml/jaxp/properties/entityExpansionLimit' is not recognized.
[INFO] Rat check: Summary of files. Unapproved: 0 unknown: 0 generated: 0 approved: 38 licence.
[INFO]
[INFO] --- maven-jar-plugin:2.4:test-jar (default) @ openstack-marconi ---
[INFO] Building jar: <https://jclouds.ci.cloudbees.com/job/jclouds-labs-openstack/ws/openstack-marconi/target/openstack-marconi-2.0.0-SNAPSHOT-tests.jar>
[INFO]
[INFO] --- maven-javadoc-plugin:2.9:jar (javadoc) @ openstack-marconi ---
[INFO]
43 warnings
[WARNING] Javadoc Warnings
[WARNING] <https://jclouds.ci.cloudbees.com/job/jclouds-labs-openstack/ws/.repository/com/google/guava/guava/18.0-rc1/guava-18.0-rc1.jar(com/google/common/util/concurrent/ServiceManager$ServiceManagerState.class)>: warning: Cannot find annotation method 'value()' in type 'GuardedBy': class file for javax.annotation.concurrent.GuardedBy not found
[WARNING] <https://jclouds.ci.cloudbees.com/job/jclouds-labs-openstack/ws/.repository/com/google/guava/guava/18.0-rc1/guava-18.0-rc1.jar(com/google/common/util/concurrent/ServiceManager$ServiceManagerState.class)>: warning: Cannot find annotation method 'value()' in type 'GuardedBy'
[WARNING] <https://jclouds.ci.cloudbees.com/job/jclouds-labs-openstack/ws/.repository/com/google/guava/guava/18.0-rc1/guava-18.0-rc1.jar(com/google/common/util/concurrent/ServiceManager$ServiceManagerState.class)>: warning: Cannot find annotation method 'value()' in type 'GuardedBy'
[WARNING] <https://jclouds.ci.cloudbees.com/job/jclouds-labs-openstack/ws/.repository/com/google/guava/guava/18.0-rc1/guava-18.0-rc1.jar(com/google/common/util/concurrent/ServiceManager$ServiceManagerState.class)>: warning: Cannot find annotation method 'value()' in type 'GuardedBy'
[WARNING] <https://jclouds.ci.cloudbees.com/job/jclouds-labs-openstack/ws/.repository/com/google/guava/guava/18.0-rc1/guava-18.0-rc1.jar(com/google/common/util/concurrent/ServiceManager$ServiceManagerState.class)>: warning: Cannot find annotation method 'value()' in type 'GuardedBy'
[WARNING] <https://jclouds.ci.cloudbees.com/job/jclouds-labs-openstack/ws/.repository/com/google/guava/guava/18.0-rc1/guava-18.0-rc1.jar(com/google/common/util/concurrent/ServiceManager$ServiceManagerState.class)>: warning: Cannot find annotation method 'value()' in type 'GuardedBy'
[WARNING] <https://jclouds.ci.cloudbees.com/job/jclouds-labs-openstack/ws/.repository/com/google/guava/guava/18.0-rc1/guava-18.0-rc1.jar(com/google/common/util/concurrent/ServiceManager$ServiceManagerState.class)>: warning: Cannot find annotation method 'value()' in type 'GuardedBy'
[WARNING] <https://jclouds.ci.cloudbees.com/job/jclouds-labs-openstack/ws/.repository/com/google/guava/guava/18.0-rc1/guava-18.0-rc1.jar(com/google/common/util/concurrent/ServiceManager$ServiceManagerState.class)>: warning: Cannot find annotation method 'value()' in type 'GuardedBy'
[WARNING] <https://jclouds.ci.cloudbees.com/job/jclouds-labs-openstack/ws/.repository/com/google/guava/guava/18.0-rc1/guava-18.0-rc1.jar(com/google/common/util/concurrent/ServiceManager$ServiceManagerState.class)>: warning: Cannot find annotation method 'value()' in type 'GuardedBy'
[WARNING] <https://jclouds.ci.cloudbees.com/job/jclouds-labs-openstack/ws/.repository/com/google/guava/guava/18.0-rc1/guava-18.0-rc1.jar(com/google/common/util/concurrent/ServiceManager$ServiceManagerState.class)>: warning: Cannot find annotation method 'value()' in type 'GuardedBy'
[WARNING] <https://jclouds.ci.cloudbees.com/job/jclouds-labs-openstack/ws/.repository/com/google/guava/guava/18.0-rc1/guava-18.0-rc1.jar(com/google/common/util/concurrent/SerializingExecutor.class)>: warning: Cannot find annotation method 'value()' in type 'GuardedBy'
[WARNING] <https://jclouds.ci.cloudbees.com/job/jclouds-labs-openstack/ws/.repository/com/google/guava/guava/18.0-rc1/guava-18.0-rc1.jar(com/google/common/util/concurrent/SerializingExecutor.class)>: warning: Cannot find annotation method 'value()' in type 'GuardedBy'
[WARNING] <https://jclouds.ci.cloudbees.com/job/jclouds-labs-openstack/ws/.repository/com/google/guava/guava/18.0-rc1/guava-18.0-rc1.jar(com/google/common/util/concurrent/Monitor.class)>: warning: Cannot find annotation method 'value()' in type 'GuardedBy'
[WARNING] <https://jclouds.ci.cloudbees.com/job/jclouds-labs-openstack/ws/.repository/com/google/guava/guava/18.0-rc1/guava-18.0-rc1.jar(com/google/common/util/concurrent/Monitor.class)>: warning: Cannot find annotation method 'value()' in type 'GuardedBy'
[WARNING] <https://jclouds.ci.cloudbees.com/job/jclouds-labs-openstack/ws/.repository/com/google/guava/guava/18.0-rc1/guava-18.0-rc1.jar(com/google/common/util/concurrent/Monitor.class)>: warning: Cannot find annotation method 'value()' in type 'GuardedBy'
[WARNING] <https://jclouds.ci.cloudbees.com/job/jclouds-labs-openstack/ws/.repository/com/google/guava/guava/18.0-rc1/guava-18.0-rc1.jar(com/google/common/util/concurrent/Monitor.class)>: warning: Cannot find annotation method 'value()' in type 'GuardedBy'
[WARNING] <https://jclouds.ci.cloudbees.com/job/jclouds-labs-openstack/ws/.repository/com/google/guava/guava/18.0-rc1/guava-18.0-rc1.jar(com/google/common/util/concurrent/Monitor.class)>: warning: Cannot find annotation method 'value()' in type 'GuardedBy'
[WARNING] <https://jclouds.ci.cloudbees.com/job/jclouds-labs-openstack/ws/.repository/com/google/guava/guava/18.0-rc1/guava-18.0-rc1.jar(com/google/common/util/concurrent/Monitor.class)>: warning: Cannot find annotation method 'value()' in type 'GuardedBy'
[WARNING] <https://jclouds.ci.cloudbees.com/job/jclouds-labs-openstack/ws/.repository/com/google/guava/guava/18.0-rc1/guava-18.0-rc1.jar(com/google/common/util/concurrent/Monitor.class)>: warning: Cannot find annotation method 'value()' in type 'GuardedBy'
[WARNING] <https://jclouds.ci.cloudbees.com/job/jclouds-labs-openstack/ws/.repository/com/google/guava/guava/18.0-rc1/guava-18.0-rc1.jar(com/google/common/util/concurrent/Monitor.class)>: warning: Cannot find annotation method 'value()' in type 'GuardedBy'
[WARNING] <https://jclouds.ci.cloudbees.com/job/jclouds-labs-openstack/ws/.repository/com/google/guava/guava/18.0-rc1/guava-18.0-rc1.jar(com/google/common/util/concurrent/Monitor.class)>: warning: Cannot find annotation method 'value()' in type 'GuardedBy'
[WARNING] <https://jclouds.ci.cloudbees.com/job/jclouds-labs-openstack/ws/.repository/com/google/guava/guava/18.0-rc1/guava-18.0-rc1.jar(com/google/common/util/concurrent/ListenerCallQueue.class)>: warning: Cannot find annotation method 'value()' in type 'GuardedBy'
[WARNING] <https://jclouds.ci.cloudbees.com/job/jclouds-labs-openstack/ws/.repository/com/google/guava/guava/18.0-rc1/guava-18.0-rc1.jar(com/google/common/util/concurrent/ListenerCallQueue.class)>: warning: Cannot find annotation method 'value()' in type 'GuardedBy'
[WARNING] <https://jclouds.ci.cloudbees.com/job/jclouds-labs-openstack/ws/.repository/com/google/guava/guava/18.0-rc1/guava-18.0-rc1.jar(com/google/common/util/concurrent/ExecutionList.class)>: warning: Cannot find annotation method 'value()' in type 'GuardedBy'
[WARNING] <https://jclouds.ci.cloudbees.com/job/jclouds-labs-openstack/ws/.repository/com/google/guava/guava/18.0-rc1/guava-18.0-rc1.jar(com/google/common/util/concurrent/ExecutionList.class)>: warning: Cannot find annotation method 'value()' in type 'GuardedBy'
[WARNING] <https://jclouds.ci.cloudbees.com/job/jclouds-labs-openstack/ws/.repository/com/google/guava/guava/18.0-rc1/guava-18.0-rc1.jar(com/google/common/util/concurrent/AbstractService.class)>: warning: Cannot find annotation method 'value()' in type 'GuardedBy'
[WARNING] <https://jclouds.ci.cloudbees.com/job/jclouds-labs-openstack/ws/.repository/com/google/guava/guava/18.0-rc1/guava-18.0-rc1.jar(com/google/common/util/concurrent/AbstractService.class)>: warning: Cannot find annotation method 'value()' in type 'GuardedBy'
[WARNING] <https://jclouds.ci.cloudbees.com/job/jclouds-labs-openstack/ws/.repository/com/google/guava/guava/18.0-rc1/guava-18.0-rc1.jar(com/google/common/util/concurrent/AbstractService.class)>: warning: Cannot find annotation method 'value()' in type 'GuardedBy'
[WARNING] <https://jclouds.ci.cloudbees.com/job/jclouds-labs-openstack/ws/.repository/com/google/guava/guava/18.0-rc1/guava-18.0-rc1.jar(com/google/common/util/concurrent/AbstractService.class)>: warning: Cannot find annotation method 'value()' in type 'GuardedBy'
[WARNING] <https://jclouds.ci.cloudbees.com/job/jclouds-labs-openstack/ws/.repository/com/google/guava/guava/18.0-rc1/guava-18.0-rc1.jar(com/google/common/util/concurrent/AbstractService.class)>: warning: Cannot find annotation method 'value()' in type 'GuardedBy'
[WARNING] <https://jclouds.ci.cloudbees.com/job/jclouds-labs-openstack/ws/.repository/com/google/guava/guava/18.0-rc1/guava-18.0-rc1.jar(com/google/common/util/concurrent/AbstractService.class)>: warning: Cannot find annotation method 'value()' in type 'GuardedBy'
[WARNING] <https://jclouds.ci.cloudbees.com/job/jclouds-labs-openstack/ws/.repository/com/google/guava/guava/18.0-rc1/guava-18.0-rc1.jar(com/google/common/util/concurrent/AbstractService.class)>: warning: Cannot find annotation method 'value()' in type 'GuardedBy'
[WARNING] <https://jclouds.ci.cloudbees.com/job/jclouds-labs-openstack/ws/.repository/com/google/guava/guava/18.0-rc1/guava-18.0-rc1.jar(com/google/common/util/concurrent/AbstractService.class)>: warning: Cannot find annotation method 'value()' in type 'GuardedBy'
[WARNING] <https://jclouds.ci.cloudbees.com/job/jclouds-labs-openstack/ws/.repository/com/google/guava/guava/18.0-rc1/guava-18.0-rc1.jar(com/google/common/util/concurrent/AbstractScheduledService$CustomScheduler$ReschedulableCallable.class)>: warning: Cannot find annotation method 'value()' in type 'GuardedBy'
[WARNING] <https://jclouds.ci.cloudbees.com/job/jclouds-labs-openstack/ws/openstack-marconi/src/main/java/org/jclouds/openstack/marconi/v1/options/StreamMessagesOptions.java>:112: warning - Tag @see cannot be used in inline documentation. It can only be used in the following types of documentation: overview, package, class/interface, constructor, field, method.
[WARNING] <https://jclouds.ci.cloudbees.com/job/jclouds-labs-openstack/ws/openstack-marconi/src/main/java/org/jclouds/openstack/marconi/v1/options/StreamMessagesOptions.java>:112: warning - Tag @see: reference not found: StremOptions
[WARNING] <https://jclouds.ci.cloudbees.com/job/jclouds-labs-openstack/ws/openstack-marconi/src/main/java/org/jclouds/openstack/marconi/v1/options/StreamMessagesOptions.java>:112: warning - Tag @see cannot be used in inline documentation. It can only be used in the following types of documentation: overview, package, class/interface, constructor, field, method.
[WARNING] <https://jclouds.ci.cloudbees.com/job/jclouds-labs-openstack/ws/openstack-marconi/src/main/java/org/jclouds/openstack/marconi/v1/options/StreamMessagesOptions.java>:112: warning - Tag @see: reference not found: StremOptions
[WARNING] <https://jclouds.ci.cloudbees.com/job/jclouds-labs-openstack/ws/openstack-marconi/src/main/java/org/jclouds/openstack/marconi/v1/options/StreamMessagesOptions.java>:112: warning - Tag @see cannot be used in inline documentation. It can only be used in the following types of documentation: overview, package, class/interface, constructor, field, method.
[WARNING] <https://jclouds.ci.cloudbees.com/job/jclouds-labs-openstack/ws/openstack-marconi/src/main/java/org/jclouds/openstack/marconi/v1/options/StreamMessagesOptions.java>:112: warning - Tag @see cannot be used in inline documentation. It can only be used in the following types of documentation: overview, package, class/interface, constructor, field, method.
[WARNING] <https://jclouds.ci.cloudbees.com/job/jclouds-labs-openstack/ws/openstack-marconi/src/main/java/org/jclouds/openstack/marconi/v1/options/StreamMessagesOptions.java>:112: warning - Tag @see: reference not found: StremOptions
[WARNING] <https://jclouds.ci.cloudbees.com/job/jclouds-labs-openstack/ws/openstack-marconi/src/main/java/org/jclouds/openstack/marconi/v1/options/StreamMessagesOptions.java>:112: warning - Tag @see cannot be used in inline documentation. It can only be used in the following types of documentation: overview, package, class/interface, constructor, field, method.
[WARNING] <https://jclouds.ci.cloudbees.com/job/jclouds-labs-openstack/ws/openstack-marconi/src/main/java/org/jclouds/openstack/marconi/v1/options/StreamMessagesOptions.java>:112: warning - Tag @see: reference not found: StremOptions
[INFO] Building jar: <https://jclouds.ci.cloudbees.com/job/jclouds-labs-openstack/ws/openstack-marconi/target/openstack-marconi-2.0.0-SNAPSHOT-javadoc.jar>
[INFO]
[INFO] --- maven-source-plugin:2.2:jar-no-fork (attach-sources) @ openstack-marconi ---
[INFO] Building jar: <https://jclouds.ci.cloudbees.com/job/jclouds-labs-openstack/ws/openstack-marconi/target/openstack-marconi-2.0.0-SNAPSHOT-sources.jar>
[INFO]
[INFO] --- maven-surefire-plugin:2.17:test (integration) @ openstack-marconi ---
[JENKINS] Recording test results[INFO]
[INFO] --- maven-duplicate-finder-plugin:1.0.5:check (default) @ openstack-marconi ---
[INFO] Checking compile classpath
[INFO] Checking runtime classpath
[INFO] Checking test classpath
[INFO]
[INFO] --- maven-install-plugin:2.4:install (default-install) @ openstack-marconi ---
[INFO] Installing <https://jclouds.ci.cloudbees.com/job/jclouds-labs-openstack/ws/openstack-marconi/target/openstack-marconi-2.0.0-SNAPSHOT.jar> to <https://jclouds.ci.cloudbees.com/job/jclouds-labs-openstack/ws/.repository/org/apache/jclouds/labs/openstack-marconi/2.0.0-SNAPSHOT/openstack-marconi-2.0.0-SNAPSHOT.jar>
[INFO] Installing <https://jclouds.ci.cloudbees.com/job/jclouds-labs-openstack/ws/openstack-marconi/pom.xml> to <https://jclouds.ci.cloudbees.com/job/jclouds-labs-openstack/ws/.repository/org/apache/jclouds/labs/openstack-marconi/2.0.0-SNAPSHOT/openstack-marconi-2.0.0-SNAPSHOT.pom>
[INFO] Installing <https://jclouds.ci.cloudbees.com/job/jclouds-labs-openstack/ws/openstack-marconi/target/openstack-marconi-2.0.0-SNAPSHOT-tests.jar> to <https://jclouds.ci.cloudbees.com/job/jclouds-labs-openstack/ws/.repository/org/apache/jclouds/labs/openstack-marconi/2.0.0-SNAPSHOT/openstack-marconi-2.0.0-SNAPSHOT-tests.jar>
[INFO] Installing <https://jclouds.ci.cloudbees.com/job/jclouds-labs-openstack/ws/openstack-marconi/target/openstack-marconi-2.0.0-SNAPSHOT-javadoc.jar> to <https://jclouds.ci.cloudbees.com/job/jclouds-labs-openstack/ws/.repository/org/apache/jclouds/labs/openstack-marconi/2.0.0-SNAPSHOT/openstack-marconi-2.0.0-SNAPSHOT-javadoc.jar>
[INFO] Installing <https://jclouds.ci.cloudbees.com/job/jclouds-labs-openstack/ws/openstack-marconi/target/openstack-marconi-2.0.0-SNAPSHOT-sources.jar> to <https://jclouds.ci.cloudbees.com/job/jclouds-labs-openstack/ws/.repository/org/apache/jclouds/labs/openstack-marconi/2.0.0-SNAPSHOT/openstack-marconi-2.0.0-SNAPSHOT-sources.jar>
[INFO]
[INFO] --- maven-bundle-plugin:2.3.7:install (default-install) @ openstack-marconi ---
[INFO] Local OBR update disabled (enable with -DobrRepository)
[INFO]
[INFO] --- maven-deploy-plugin:2.7:deploy (default-deploy) @ openstack-marconi ---
Downloading: https://repository.apache.org/content/repositories/snapshots/org/apache/jclouds/labs/openstack-marconi/2.0.0-SNAPSHOT/maven-metadata.xml
Downloaded: https://repository.apache.org/content/repositories/snapshots/org/apache/jclouds/labs/openstack-marconi/2.0.0-SNAPSHOT/maven-metadata.xml (2 KB at 0.2 KB/sec)
Uploading: https://repository.apache.org/content/repositories/snapshots/org/apache/jclouds/labs/openstack-marconi/2.0.0-SNAPSHOT/openstack-marconi-2.0.0-20140821.184227-18.jar
Uploading: https://repository.apache.org/content/repositories/snapshots/org/apache/jclouds/labs/openstack-marconi/2.0.0-SNAPSHOT/openstack-marconi-2.0.0-20140821.184227-18.pom
Uploaded: https://repository.apache.org/content/repositories/snapshots/org/apache/jclouds/labs/openstack-marconi/2.0.0-SNAPSHOT/openstack-marconi-2.0.0-20140821.184227-18.pom (6 KB at 0.1 KB/sec)
[INFO] ------------------------------------------------------------------------
[INFO] Reactor Summary:
[INFO]
[INFO] jclouds openstack-glance api ...................... SUCCESS [2:56.928s]
[INFO] jclouds openstack-neutron api ..................... SUCCESS [3:24.113s]
[INFO] jclouds openstack-swift api ....................... SUCCESS [1:44.248s]
[INFO] jclouds openstack-marconi api ..................... FAILURE [3:03.029s]
[INFO] jclouds Rackspace Auto Scale API .................. SKIPPED
[INFO] jclouds Rackspace Auto Scale UK Provider .......... SKIPPED
[INFO] jclouds Rackspace Auto Scale US Provider .......... SKIPPED
[INFO] jclouds Rackspace Cloud Queues US provider ........ SKIPPED
[INFO] jclouds Rackspace Cloud Queues UK provider ........ SKIPPED
[INFO] jclouds rackspace-cloudbigdata api ................ SKIPPED
[INFO] jclouds rackspace-cloudbigdata api provider ....... SKIPPED
[INFO] jclouds rackspace-cloudfiles api .................. SKIPPED
[INFO] jclouds Rackspace Cloud Files UK provider ......... SKIPPED
[INFO] jclouds Rackspace Cloud Files US provider ......... SKIPPED
[INFO] Apache jclouds labs openstack ..................... SKIPPED
[INFO] ------------------------------------------------------------------------
[INFO] BUILD FAILURE
[INFO] ------------------------------------------------------------------------
[INFO] Total time: 11:22.630s
[INFO] Finished at: Thu Aug 21 14:44:10 EDT 2014
[INFO] Final Memory: 40M/218M
[INFO] ------------------------------------------------------------------------
Waiting for Jenkins to finish collecting data
[ERROR] Failed to execute goal org.apache.maven.plugins:maven-deploy-plugin:2.7:deploy (default-deploy) on project openstack-marconi: Failed to deploy artifacts: Could not transfer artifact org.apache.jclouds.labs:openstack-marconi:jar:2.0.0-20140821.184227-18 from/to apache.snapshots.https (https://repository.apache.org/content/repositories/snapshots): Failed to transfer file: https://repository.apache.org/content/repositories/snapshots/org/apache/jclouds/labs/openstack-marconi/2.0.0-SNAPSHOT/openstack-marconi-2.0.0-20140821.184227-18.jar. Return code is: 502 -> [Help 1]
org.apache.maven.lifecycle.LifecycleExecutionException: Failed to execute goal org.apache.maven.plugins:maven-deploy-plugin:2.7:deploy (default-deploy) on project openstack-marconi: Failed to deploy artifacts: Could not transfer artifact org.apache.jclouds.labs:openstack-marconi:jar:2.0.0-20140821.184227-18 from/to apache.snapshots.https (https://repository.apache.org/content/repositories/snapshots): Failed to transfer file: https://repository.apache.org/content/repositories/snapshots/org/apache/jclouds/labs/openstack-marconi/2.0.0-SNAPSHOT/openstack-marconi-2.0.0-20140821.184227-18.jar. Return code is: 502
at org.apache.maven.lifecycle.internal.MojoExecutor.execute(MojoExecutor.java:217)
at org.apache.maven.lifecycle.internal.MojoExecutor.execute(MojoExecutor.java:153)
at org.apache.maven.lifecycle.internal.MojoExecutor.execute(MojoExecutor.java:145)
at org.apache.maven.lifecycle.internal.LifecycleModuleBuilder.buildProject(LifecycleModuleBuilder.java:84)
at org.apache.maven.lifecycle.internal.LifecycleModuleBuilder.buildProject(LifecycleModuleBuilder.java:59)
at org.apache.maven.lifecycle.internal.LifecycleStarter.singleThreadedBuild(LifecycleStarter.java:183)
at org.apache.maven.lifecycle.internal.LifecycleStarter.execute(LifecycleStarter.java:161)
at org.apache.maven.DefaultMaven.doExecute(DefaultMaven.java:319)
at org.apache.maven.DefaultMaven.execute(DefaultMaven.java:156)
at org.jvnet.hudson.maven3.launcher.Maven3Launcher.main(Maven3Launcher.java:117)
at sun.reflect.NativeMethodAccessorImpl.invoke0(Native Method)
at sun.reflect.NativeMethodAccessorImpl.invoke(NativeMethodAccessorImpl.java:57)
at sun.reflect.DelegatingMethodAccessorImpl.invoke(DelegatingMethodAccessorImpl.java:43)
at java.lang.reflect.Method.invoke(Method.java:606)
at org.codehaus.plexus.classworlds.launcher.Launcher.launchStandard(Launcher.java:329)
at org.codehaus.plexus.classworlds.launcher.Launcher.launch(Launcher.java:239)
at org.jvnet.hudson.maven3.agent.Maven3Main.launch(Maven3Main.java:178)
at sun.reflect.NativeMethodAccessorImpl.invoke0(Native Method)
at sun.reflect.NativeMethodAccessorImpl.invoke(NativeMethodAccessorImpl.java:57)
at sun.reflect.DelegatingMethodAccessorImpl.invoke(DelegatingMethodAccessorImpl.java:43)
at java.lang.reflect.Method.invoke(Method.java:606)
at hudson.maven.Maven3Builder.call(Maven3Builder.java:134)
at hudson.maven.Maven3Builder.call(Maven3Builder.java:69)
at hudson.remoting.UserRequest.perform(UserRequest.java:118)
at hudson.remoting.UserRequest.perform(UserRequest.java:48)
at hudson.remoting.Request$2.run(Request.java:328)
at hudson.remoting.InterceptingExecutorService$1.call(InterceptingExecutorService.java:72)
at java.util.concurrent.FutureTask.run(FutureTask.java:262)
at java.util.concurrent.ThreadPoolExecutor.runWorker(ThreadPoolExecutor.java:1145)
at java.util.concurrent.ThreadPoolExecutor$Worker.run(ThreadPoolExecutor.java:615)
at java.lang.Thread.run(Thread.java:744)
Caused by: org.apache.maven.plugin.MojoExecutionException: Failed to deploy artifacts: Could not transfer artifact org.apache.jclouds.labs:openstack-marconi:jar:2.0.0-20140821.184227-18 from/to apache.snapshots.https (https://repository.apache.org/content/repositories/snapshots): Failed to transfer file: https://repository.apache.org/content/repositories/snapshots/org/apache/jclouds/labs/openstack-marconi/2.0.0-SNAPSHOT/openstack-marconi-2.0.0-20140821.184227-18.jar. Return code is: 502
at org.apache.maven.plugin.deploy.DeployMojo.execute(DeployMojo.java:193)
at org.apache.maven.plugin.DefaultBuildPluginManager.executeMojo(DefaultBuildPluginManager.java:101)
at org.apache.maven.lifecycle.internal.MojoExecutor.execute(MojoExecutor.java:209)
... 30 more
Caused by: org.apache.maven.artifact.deployer.ArtifactDeploymentException: Failed to deploy artifacts: Could not transfer artifact org.apache.jclouds.labs:openstack-marconi:jar:2.0.0-20140821.184227-18 from/to apache.snapshots.https (https://repository.apache.org/content/repositories/snapshots): Failed to transfer file: https://repository.apache.org/content/repositories/snapshots/org/apache/jclouds/labs/openstack-marconi/2.0.0-SNAPSHOT/openstack-marconi-2.0.0-20140821.184227-18.jar. Return code is: 502
at org.apache.maven.artifact.deployer.DefaultArtifactDeployer.deploy(DefaultArtifactDeployer.java:141)
at org.apache.maven.plugin.deploy.AbstractDeployMojo.deploy(AbstractDeployMojo.java:167)
at org.apache.maven.plugin.deploy.DeployMojo.execute(DeployMojo.java:157)
... 32 more
Caused by: org.sonatype.aether.deployment.DeploymentException: Failed to deploy artifacts: Could not transfer artifact org.apache.jclouds.labs:openstack-marconi:jar:2.0.0-20140821.184227-18 from/to apache.snapshots.https (https://repository.apache.org/content/repositories/snapshots): Failed to transfer file: https://repository.apache.org/content/repositories/snapshots/org/apache/jclouds/labs/openstack-marconi/2.0.0-SNAPSHOT/openstack-marconi-2.0.0-20140821.184227-18.jar. Return code is: 502
at org.sonatype.aether.impl.internal.DefaultDeployer.deploy(DefaultDeployer.java:284)
at org.sonatype.aether.impl.internal.DefaultDeployer.deploy(DefaultDeployer.java:215)
at org.sonatype.aether.impl.internal.DefaultRepositorySystem.deploy(DefaultRepositorySystem.java:480)
at org.apache.maven.artifact.deployer.DefaultArtifactDeployer.deploy(DefaultArtifactDeployer.java:137)
... 34 more
Caused by: org.sonatype.aether.transfer.ArtifactTransferException: Could not transfer artifact org.apache.jclouds.labs:openstack-marconi:jar:2.0.0-20140821.184227-18 from/to apache.snapshots.https (https://repository.apache.org/content/repositories/snapshots): Failed to transfer file: https://repository.apache.org/content/repositories/snapshots/org/apache/jclouds/labs/openstack-marconi/2.0.0-SNAPSHOT/openstack-marconi-2.0.0-20140821.184227-18.jar. Return code is: 502
at org.sonatype.aether.connector.wagon.WagonRepositoryConnector$4.wrap(WagonRepositoryConnector.java:949)
at org.sonatype.aether.connector.wagon.WagonRepositoryConnector$4.wrap(WagonRepositoryConnector.java:940)
at org.sonatype.aether.connector.wagon.WagonRepositoryConnector$PutTask.flush(WagonRepositoryConnector.java:864)
at org.sonatype.aether.connector.wagon.WagonRepositoryConnector.put(WagonRepositoryConnector.java:466)
at org.sonatype.aether.impl.internal.DefaultDeployer.deploy(DefaultDeployer.java:278)
... 37 more
Caused by: org.apache.maven.wagon.TransferFailedException: Failed to transfer file: https://repository.apache.org/content/repositories/snapshots/org/apache/jclouds/labs/openstack-marconi/2.0.0-SNAPSHOT/openstack-marconi-2.0.0-20140821.184227-18.jar. Return code is: 502
at org.apache.maven.wagon.providers.http.LightweightHttpWagon.finishPutTransfer(LightweightHttpWagon.java:205)
at org.apache.maven.wagon.AbstractWagon.putTransfer(AbstractWagon.java:413)
at org.apache.maven.wagon.AbstractWagon.transfer(AbstractWagon.java:392)
at org.apache.maven.wagon.AbstractWagon.putTransfer(AbstractWagon.java:365)
at org.apache.maven.wagon.StreamWagon.put(StreamWagon.java:163)
at org.sonatype.aether.connector.wagon.WagonRepositoryConnector$PutTask.run(WagonRepositoryConnector.java:825)
at org.sonatype.aether.connector.wagon.WagonRepositoryConnector.put(WagonRepositoryConnector.java:465)
... 38 more
[ERROR]
[ERROR] Re-run Maven using the -X switch to enable full debug logging.
[ERROR]
[ERROR] For more information about the errors and possible solutions, please read the following articles:
[ERROR] [Help 1] http://cwiki.apache.org/confluence/display/MAVEN/MojoExecutionException
[ERROR]
[ERROR] After correcting the problems, you can resume the build with the command
[ERROR] mvn <goals> -rf :openstack-marconi
[JENKINS] Archiving <https://jclouds.ci.cloudbees.com/job/jclouds-labs-openstack/ws/rackspace-cloudqueues-us/pom.xml> to org.apache.jclouds.labs/rackspace-cloudqueues-us/2.0.0-SNAPSHOT/rackspace-cloudqueues-us-2.0.0-SNAPSHOT.pom
[JENKINS] Archiving <https://jclouds.ci.cloudbees.com/job/jclouds-labs-openstack/ws/rackspace-autoscale-uk/pom.xml> to org.apache.jclouds.labs/rackspace-autoscale-uk/2.0.0-SNAPSHOT/rackspace-autoscale-uk-2.0.0-SNAPSHOT.pom
[JENKINS] Archiving <https://jclouds.ci.cloudbees.com/job/jclouds-labs-openstack/ws/rackspace-cloudbigdata/pom.xml> to org.apache.jclouds.labs/rackspace-cloudbigdata/2.0.0-SNAPSHOT/rackspace-cloudbigdata-2.0.0-SNAPSHOT.pom
[JENKINS] Archiving <https://jclouds.ci.cloudbees.com/job/jclouds-labs-openstack/ws/rackspace-cloudbigdata-us/pom.xml> to org.apache.jclouds.labs/rackspace-cloudbigdata-us/2.0.0-SNAPSHOT/rackspace-cloudbigdata-us-2.0.0-SNAPSHOT.pom
[JENKINS] Archiving <https://jclouds.ci.cloudbees.com/job/jclouds-labs-openstack/ws/pom.xml> to org.apache.jclouds.labs/jclouds-labs-openstack/2.0.0-SNAPSHOT/jclouds-labs-openstack-2.0.0-SNAPSHOT.pom
[JENKINS] Archiving <https://jclouds.ci.cloudbees.com/job/jclouds-labs-openstack/ws/rackspace-autoscale-us/pom.xml> to org.apache.jclouds.labs/rackspace-autoscale-us/2.0.0-SNAPSHOT/rackspace-autoscale-us-2.0.0-SNAPSHOT.pom
[JENKINS] Archiving <https://jclouds.ci.cloudbees.com/job/jclouds-labs-openstack/ws/rackspace-autoscale/pom.xml> to org.apache.jclouds.labs/rackspace-autoscale/2.0.0-SNAPSHOT/rackspace-autoscale-2.0.0-SNAPSHOT.pom
[JENKINS] Archiving <https://jclouds.ci.cloudbees.com/job/jclouds-labs-openstack/ws/openstack-swift/pom.xml> to org.apache.jclouds.labs/openstack-swift/2.0.0-SNAPSHOT/openstack-swift-2.0.0-SNAPSHOT.pom
[JENKINS] Archiving <https://jclouds.ci.cloudbees.com/job/jclouds-labs-openstack/ws/openstack-swift/target/openstack-swift-2.0.0-SNAPSHOT.jar> to org.apache.jclouds.labs/openstack-swift/2.0.0-20140821.184052-19/openstack-swift-2.0.0-20140821.184052-19.jar
[JENKINS] Archiving <https://jclouds.ci.cloudbees.com/job/jclouds-labs-openstack/ws/openstack-swift/target/openstack-swift-2.0.0-SNAPSHOT-tests.jar> to org.apache.jclouds.labs/openstack-swift/2.0.0-20140821.184052-19/openstack-swift-2.0.0-20140821.184052-19-tests.jar
[JENKINS] Archiving <https://jclouds.ci.cloudbees.com/job/jclouds-labs-openstack/ws/openstack-swift/target/openstack-swift-2.0.0-SNAPSHOT-javadoc.jar> to org.apache.jclouds.labs/openstack-swift/2.0.0-20140821.184052-19/openstack-swift-2.0.0-20140821.184052-19-javadoc.jar
[JENKINS] Archiving <https://jclouds.ci.cloudbees.com/job/jclouds-labs-openstack/ws/openstack-swift/target/openstack-swift-2.0.0-SNAPSHOT-sources.jar> to org.apache.jclouds.labs/openstack-swift/2.0.0-20140821.184052-19/openstack-swift-2.0.0-20140821.184052-19-sources.jar
[JENKINS] Archiving <https://jclouds.ci.cloudbees.com/job/jclouds-labs-openstack/ws/openstack-neutron/pom.xml> to org.apache.jclouds.labs/openstack-neutron/2.0.0-SNAPSHOT/openstack-neutron-2.0.0-SNAPSHOT.pom
[JENKINS] Archiving <https://jclouds.ci.cloudbees.com/job/jclouds-labs-openstack/ws/openstack-neutron/target/openstack-neutron-2.0.0-SNAPSHOT.jar> to org.apache.jclouds.labs/openstack-neutron/2.0.0-20140821.183908-19/openstack-neutron-2.0.0-20140821.183908-19.jar
[JENKINS] Archiving <https://jclouds.ci.cloudbees.com/job/jclouds-labs-openstack/ws/openstack-neutron/target/openstack-neutron-2.0.0-SNAPSHOT-tests.jar> to org.apache.jclouds.labs/openstack-neutron/2.0.0-20140821.183908-19/openstack-neutron-2.0.0-20140821.183908-19-tests.jar
[JENKINS] Archiving <https://jclouds.ci.cloudbees.com/job/jclouds-labs-openstack/ws/openstack-neutron/target/openstack-neutron-2.0.0-SNAPSHOT-javadoc.jar> to org.apache.jclouds.labs/openstack-neutron/2.0.0-20140821.183908-19/openstack-neutron-2.0.0-20140821.183908-19-javadoc.jar
[JENKINS] Archiving <https://jclouds.ci.cloudbees.com/job/jclouds-labs-openstack/ws/openstack-neutron/target/openstack-neutron-2.0.0-SNAPSHOT-sources.jar> to org.apache.jclouds.labs/openstack-neutron/2.0.0-20140821.183908-19/openstack-neutron-2.0.0-20140821.183908-19-sources.jar
[JENKINS] Archiving <https://jclouds.ci.cloudbees.com/job/jclouds-labs-openstack/ws/openstack-glance/pom.xml> to org.apache.jclouds.labs/openstack-glance/2.0.0-SNAPSHOT/openstack-glance-2.0.0-SNAPSHOT.pom
[JENKINS] Archiving <https://jclouds.ci.cloudbees.com/job/jclouds-labs-openstack/ws/openstack-glance/target/openstack-glance-2.0.0-SNAPSHOT.jar> to org.apache.jclouds.labs/openstack-glance/2.0.0-20140821.183545-20/openstack-glance-2.0.0-20140821.183545-20.jar
[JENKINS] Archiving <https://jclouds.ci.cloudbees.com/job/jclouds-labs-openstack/ws/openstack-glance/target/openstack-glance-2.0.0-SNAPSHOT-tests.jar> to org.apache.jclouds.labs/openstack-glance/2.0.0-20140821.183545-20/openstack-glance-2.0.0-20140821.183545-20-tests.jar
[JENKINS] Archiving <https://jclouds.ci.cloudbees.com/job/jclouds-labs-openstack/ws/openstack-glance/target/openstack-glance-2.0.0-SNAPSHOT-javadoc.jar> to org.apache.jclouds.labs/openstack-glance/2.0.0-20140821.183545-20/openstack-glance-2.0.0-20140821.183545-20-javadoc.jar
[JENKINS] Archiving <https://jclouds.ci.cloudbees.com/job/jclouds-labs-openstack/ws/openstack-glance/target/openstack-glance-2.0.0-SNAPSHOT-sources.jar> to org.apache.jclouds.labs/openstack-glance/2.0.0-20140821.183545-20/openstack-glance-2.0.0-20140821.183545-20-sources.jar
[JENKINS] Archiving <https://jclouds.ci.cloudbees.com/job/jclouds-labs-openstack/ws/rackspace-cloudfiles-uk/pom.xml> to org.apache.jclouds.labs/rackspace-cloudfiles-uk/2.0.0-SNAPSHOT/rackspace-cloudfiles-uk-2.0.0-SNAPSHOT.pom
[JENKINS] Archiving <https://jclouds.ci.cloudbees.com/job/jclouds-labs-openstack/ws/rackspace-cloudfiles/pom.xml> to org.apache.jclouds.labs/rackspace-cloudfiles/2.0.0-SNAPSHOT/rackspace-cloudfiles-2.0.0-SNAPSHOT.pom
[JENKINS] Archiving <https://jclouds.ci.cloudbees.com/job/jclouds-labs-openstack/ws/openstack-marconi/pom.xml> to org.apache.jclouds.labs/openstack-marconi/2.0.0-SNAPSHOT/openstack-marconi-2.0.0-SNAPSHOT.pom
[JENKINS] Archiving <https://jclouds.ci.cloudbees.com/job/jclouds-labs-openstack/ws/openstack-marconi/target/openstack-marconi-2.0.0-SNAPSHOT.jar> to org.apache.jclouds.labs/openstack-marconi/2.0.0-SNAPSHOT/openstack-marconi-2.0.0-SNAPSHOT.jar
[JENKINS] Archiving <https://jclouds.ci.cloudbees.com/job/jclouds-labs-openstack/ws/openstack-marconi/target/openstack-marconi-2.0.0-SNAPSHOT-tests.jar> to org.apache.jclouds.labs/openstack-marconi/2.0.0-SNAPSHOT/openstack-marconi-2.0.0-SNAPSHOT-tests.jar
[JENKINS] Archiving <https://jclouds.ci.cloudbees.com/job/jclouds-labs-openstack/ws/openstack-marconi/target/openstack-marconi-2.0.0-SNAPSHOT-javadoc.jar> to org.apache.jclouds.labs/openstack-marconi/2.0.0-SNAPSHOT/openstack-marconi-2.0.0-SNAPSHOT-javadoc.jar
[JENKINS] Archiving <https://jclouds.ci.cloudbees.com/job/jclouds-labs-openstack/ws/openstack-marconi/target/openstack-marconi-2.0.0-SNAPSHOT-sources.jar> to org.apache.jclouds.labs/openstack-marconi/2.0.0-SNAPSHOT/openstack-marconi-2.0.0-SNAPSHOT-sources.jar
[JENKINS] Archiving <https://jclouds.ci.cloudbees.com/job/jclouds-labs-openstack/ws/rackspace-cloudqueues-uk/pom.xml> to org.apache.jclouds.labs/rackspace-cloudqueues-uk/2.0.0-SNAPSHOT/rackspace-cloudqueues-uk-2.0.0-SNAPSHOT.pom
[JENKINS] Archiving <https://jclouds.ci.cloudbees.com/job/jclouds-labs-openstack/ws/rackspace-cloudfiles-us/pom.xml> to org.apache.jclouds.labs/rackspace-cloudfiles-us/2.0.0-SNAPSHOT/rackspace-cloudfiles-us-2.0.0-SNAPSHOT.pom
Sending e-mails to: notifications@jclouds.apache.org
Sending e-mails to: notifications@jclouds.apache.org
channel stopped