You are viewing a plain text version of this content. The canonical link for it is here.
Posted to dev@hama.apache.org by Apache Hudson Server <hu...@hudson.apache.org> on 2010/11/08 07:01:35 UTC
Build failed in Hudson: Hama-Patch #286
See <https://hudson.apache.org/hudson/job/Hama-Patch/286/>
------------------------------------------
[...truncated 1777 lines...]
[exec] Copying 1 file to /zonestorage/hudson<https://hudson.apache.org/hudson/job/Hama-Patch/ws/trunk/src/docs/build/tmp>
[exec] Copying 1 file to /zonestorage/hudson<https://hudson.apache.org/hudson/job/Hama-Patch/ws/trunk/src/docs/build/tmp>
[exec] Copying 1 file to /zonestorage/hudson<https://hudson.apache.org/hudson/job/Hama-Patch/ws/trunk/src/docs/build/tmp>
[exec] Copying 1 file to /zonestorage/hudson<https://hudson.apache.org/hudson/job/Hama-Patch/ws/trunk/src/docs/build/tmp>
[exec] Copying 1 file to /zonestorage/hudson<https://hudson.apache.org/hudson/job/Hama-Patch/ws/trunk/src/docs/build/tmp>
[exec]
[exec] --------------------------------------------------------------
[exec] Installing plugin: org.apache.forrest.plugin.output.pdf
[exec] --------------------------------------------------------------
[exec]
[exec]
[exec] check-plugin:
[exec] org.apache.forrest.plugin.output.pdf is available in the build dir. Trying to update it...
[exec]
[exec] init-props:
[exec]
[exec] echo-settings:
[exec]
[exec] init-proxy:
[exec]
[exec] fetch-plugins-descriptors:
[exec]
[exec] fetch-plugin:
[exec] Trying to find the description of org.apache.forrest.plugin.output.pdf in the different descriptor files
[exec] Using the descriptor file /zonestorage/hudson<https://hudson.apache.org/hudson/job/Hama-Patch/ws/trunk/src/docs/build/tmp/plugins-1.xml...>
[exec] Processing /zonestorage/hudson<https://hudson.apache.org/hudson/job/Hama-Patch/ws/trunk/src/docs/build/tmp/plugins-1.xml> to /zonestorage/hudson<https://hudson.apache.org/hudson/job/Hama-Patch/ws/trunk/src/docs/build/tmp/pluginlist2fetchbuild.xml>
[exec] Loading stylesheet /zonestorage/hudson/home/edwardyoon/tools/forrest/latest/main/var/pluginlist2fetch.xsl
[exec]
[exec] fetch-local-unversioned-plugin:
[exec]
[exec] get-local:
[exec] Trying to locally get org.apache.forrest.plugin.output.pdf
[exec] Looking in local /zonestorage/hudson/home/edwardyoon/tools/forrest/latest/plugins
[exec] Found !
[exec]
[exec] init-build-compiler:
[exec]
[exec] echo-init:
[exec]
[exec] init:
[exec]
[exec] compile:
[exec]
[exec] jar:
[exec]
[exec] local-deploy:
[exec] Locally deploying org.apache.forrest.plugin.output.pdf
[exec]
[exec] build:
[exec] Plugin org.apache.forrest.plugin.output.pdf deployed ! Ready to configure
[exec]
[exec] fetch-remote-unversioned-plugin-version-forrest:
[exec]
[exec] fetch-remote-unversioned-plugin-unversion-forrest:
[exec]
[exec] has-been-downloaded:
[exec]
[exec] downloaded-message:
[exec]
[exec] uptodate-message:
[exec]
[exec] not-found-message:
[exec] Fetch-plugin Ok, installing !
[exec]
[exec] unpack-plugin:
[exec]
[exec] install-plugin:
[exec]
[exec] configure-plugin:
[exec]
[exec] configure-output-plugin:
[exec] Mounting output plugin: org.apache.forrest.plugin.output.pdf
[exec] Processing /zonestorage/hudson<https://hudson.apache.org/hudson/job/Hama-Patch/ws/trunk/src/docs/build/tmp/output.xmap> to /zonestorage/hudson<https://hudson.apache.org/hudson/job/Hama-Patch/ws/trunk/src/docs/build/tmp/output.xmap.new>
[exec] Loading stylesheet /zonestorage/hudson/home/edwardyoon/tools/forrest/latest/main/var/pluginMountSnippet.xsl
[exec] Moving 1 file to /zonestorage/hudson<https://hudson.apache.org/hudson/job/Hama-Patch/ws/trunk/src/docs/build/tmp>
[exec]
[exec] configure-plugin-locationmap:
[exec] Mounting plugin locationmap for org.apache.forrest.plugin.output.pdf
[exec] Processing /zonestorage/hudson<https://hudson.apache.org/hudson/job/Hama-Patch/ws/trunk/src/docs/build/tmp/locationmap.xml> to /zonestorage/hudson<https://hudson.apache.org/hudson/job/Hama-Patch/ws/trunk/src/docs/build/tmp/locationmap.xml.new>
[exec] Loading stylesheet /zonestorage/hudson/home/edwardyoon/tools/forrest/latest/main/var/pluginLmMountSnippet.xsl
[exec] Moving 1 file to /zonestorage/hudson<https://hudson.apache.org/hudson/job/Hama-Patch/ws/trunk/src/docs/build/tmp>
[exec]
[exec] init:
[exec]
[exec] -prepare-classpath:
[exec]
[exec] check-contentdir:
[exec]
[exec] examine-proj:
[exec]
[exec] validation-props:
[exec]
[exec] validate-xdocs:
[exec]
[exec] validate-skinconf:
[exec]
[exec] validate-sitemap:
[exec]
[exec] validate-skins-stylesheets:
[exec]
[exec] validate-skins:
[exec]
[exec] validate-skinchoice:
[exec] ...validated existence of skin 'pelt'
[exec]
[exec] validate-stylesheets:
[exec]
[exec] validate:
[exec]
[exec] site:
[exec]
[exec] Copying the various non-generated resources to site.
[exec] Warnings will be issued if the optional project resources are not found.
[exec] This is often the case, because they are optional and so may not be available.
[exec] Copying project resources and images to site ...
[exec] Warning: /zonestorage/hudson<https://hudson.apache.org/hudson/job/Hama-Patch/ws/trunk/src/docs/build/webapp/resources> not found.
[exec] Copied 1 empty directory to 1 empty directory under /zonestorage/hudson<https://hudson.apache.org/hudson/job/Hama-Patch/ws/trunk/src/docs/build/site>
[exec] Copying main skin images to site ...
[exec] Created dir: /zonestorage/hudson<https://hudson.apache.org/hudson/job/Hama-Patch/ws/trunk/src/docs/build/site/skin/images>
[exec] Copying 18 files to /zonestorage/hudson<https://hudson.apache.org/hudson/job/Hama-Patch/ws/trunk/src/docs/build/site/skin/images>
[exec] Copying 14 files to /zonestorage/hudson<https://hudson.apache.org/hudson/job/Hama-Patch/ws/trunk/src/docs/build/site/skin/images>
[exec] Copying project skin images to site ...
[exec] Warning: /zonestorage/hudson<https://hudson.apache.org/hudson/job/Hama-Patch/ws/trunk/src/docs/src/documentation/skins/common/images> not found.
[exec] Warning: /zonestorage/hudson<https://hudson.apache.org/hudson/job/Hama-Patch/ws/trunk/src/docs/src/documentation/skins/pelt/images> not found.
[exec] Copying main skin css and js files to site ...
[exec] Copying 11 files to /zonestorage/hudson<https://hudson.apache.org/hudson/job/Hama-Patch/ws/trunk/src/docs/build/site/skin>
[exec] Copied 4 empty directories to 3 empty directories under /zonestorage/hudson<https://hudson.apache.org/hudson/job/Hama-Patch/ws/trunk/src/docs/build/site/skin>
[exec] Copying 4 files to /zonestorage/hudson<https://hudson.apache.org/hudson/job/Hama-Patch/ws/trunk/src/docs/build/site/skin>
[exec] Copying project skin css and js files to site ...
[exec] Warning: /zonestorage/hudson<https://hudson.apache.org/hudson/job/Hama-Patch/ws/trunk/src/docs/src/documentation/skins/common> not found.
[exec] Warning: /zonestorage/hudson<https://hudson.apache.org/hudson/job/Hama-Patch/ws/trunk/src/docs/src/documentation/skins/pelt> not found.
[exec]
[exec] Finished copying the non-generated resources.
[exec] Now Cocoon will generate the rest.
[exec]
[exec] Static site will be generated at:
[exec] /zonestorage/hudson<https://hudson.apache.org/hudson/job/Hama-Patch/ws/trunk/src/docs/build/site>
[exec]
[exec] Cocoon will report the status of each document:
[exec] - in column 1: *=okay X=brokenLink ^=pageSkipped (see FAQ).
[exec]
[exec] ------------------------------------------------------------------------
[exec] cocoon 2.2.0-dev
[exec] Copyright (c) 1999-2005 Apache Software Foundation. All rights reserved.
[exec] Build: December 8 2005 (TargetVM=1.4, SourceVM=1.4, Debug=on, Optimize=on)
[exec] ------------------------------------------------------------------------
[exec]
[exec]
[exec] * [1/20] [20/20] 4.924s 6.9Kb linkmap.html
[exec] * [3/18] [0/0] 1.121s 2.9Kb skin/basic.css
[exec] * [4/17] [0/0] 0.395s 1.2Kb skin/print.css
[exec] * [5/16] [0/0] 0.111s 4.0Kb skin/profile.css
[exec] * [7/15] [1/19] 1.014s 7.5Kb privacy_policy.html
[exec] * [9/13] [0/0] 0.051s 19.2Kb images/headerlogo.png
[exec] * [10/13] [1/19] 0.506s 7.6Kb who_we_are.html
[exec] * [11/12] [0/0] 1.387s 6.1Kb who_we_are.pdf
[exec] * [12/11] [0/0] 1.701s 348b skin/images/rc-b-l-15-1body-2menu-3menu.png
[exec] * [13/11] [1/20] 0.417s 6.6Kb irc_channel.html
[exec] * [14/23] [13/13] 0.221s 12.4Kb skin/screen.css
[exec] * [15/22] [0/0] 0.027s 390b skin/images/rc-t-r-15-1body-2menu-3menu.png
[exec] * [16/21] [0/0] 0.028s 199b skin/images/rc-t-l-5-1header-2tab-unselected-3tab-unselected.png
[exec] * [17/20] [0/0] 0.024s 214b skin/images/rc-t-r-5-1header-2searchbox-3searchbox.png
[exec] * [19/18] [0/0] 0.033s 200b skin/images/rc-b-r-5-1header-2tab-selected-3tab-selected.png
[exec] * [20/17] [0/0] 0.028s 319b skin/images/rc-b-r-15-1body-2menu-3menu.png
[exec] * [21/16] [0/0] 0.024s 199b skin/images/rc-t-l-5-1header-2searchbox-3searchbox.png
[exec] * [22/15] [0/0] 0.0070s 285b images/instruction_arrow.png
[exec] * [23/14] [0/0] 0.025s 214b skin/images/rc-t-r-5-1header-2tab-unselected-3tab-unselected.png
[exec] * [24/13] [0/0] 0.025s 209b skin/images/rc-t-l-5-1header-2tab-selected-3tab-selected.png
[exec] * [25/13] [1/19] 0.52s 7.8Kb mailing_lists.html
[exec] * [26/13] [1/20] 0.367s 7.8Kb developers.html
[exec] * [27/12] [0/0] 0.077s 4.5Kb irc_channel.pdf
[exec] * [28/11] [0/0] 0.131s 2.1Kb linkmap.pdf
[exec] * [29/11] [1/20] 0.602s 6.5Kb issue_tracking.html
[exec] * [30/10] [0/0] 0.082s 4.2Kb issue_tracking.pdf
[exec] * [31/9] [0/0] 0.017s 0b images/favicon.ico
[exec] * [32/8] [0/0] 0.131s 215b skin/images/rc-t-r-5-1header-2tab-selected-3tab-selected.png
[exec] * [34/6] [0/0] 0.19s 4.8Kb privacy_policy.pdf
[exec] * [36/4] [0/0] 0.09s 7.2Kb developers.pdf
[exec] * [38/4] [2/22] 0.447s 8.1Kb index.html
[exec] * [39/3] [0/0] 0.0060s 1.8Kb images/built-with-forrest-button.png
[exec] * [40/2] [0/0] 0.085s 7.4Kb mailing_lists.pdf
[exec] * [42/0] [0/0] 0.233s 8.5Kb index.pdf
[exec] Total time: 0 minutes 19 seconds, Site size: 152,324 Site pages: 34
[exec]
[exec] Copying broken links file to site root.
[exec]
[exec] Copying 1 file to /zonestorage/hudson<https://hudson.apache.org/hudson/job/Hama-Patch/ws/trunk/src/docs/build/site>
[exec]
[exec] -----------------------------
[exec] Static site was successfully generated at:
[exec] /zonestorage/hudson<https://hudson.apache.org/hudson/job/Hama-Patch/ws/trunk/src/docs/build/site>
[exec] ------------------------------
[exec]
[exec]
[exec] BUILD SUCCESSFUL
[exec] Total time: 24 seconds
[copy] Copying 76 files to /zonestorage/hudson<https://hudson.apache.org/hudson/job/Hama-Patch/ws/trunk/build/docs/site>
[copy] Copied 7 empty directories to 3 empty directories under /zonestorage/hudson<https://hudson.apache.org/hudson/job/Hama-Patch/ws/trunk/build/docs/site>
[delete] Deleting directory /zonestorage/hudson<https://hudson.apache.org/hudson/job/Hama-Patch/ws/trunk/src/docs/build>
BUILD SUCCESSFUL
Total time: 2 minutes 11 seconds
======================================================================
======================================================================
Adding comment to Jira.
======================================================================
======================================================================
-1 overall. Here are the results of testing the latest attachment
http://issues.apache.org/jira/secure/attachment/12459039/HAMA-326.patch
against trunk revision 1030802.
@author +1. The patch does not contain any @author tags.
tests included -1. The patch doesn't appear to include any new or modified tests.
Please justify why no tests are needed for this patch.
javadoc +1. The javadoc tool did not generate any warning messages.
javac +1. The applied patch does not generate any new javac compiler warnings.
release audit +1. The applied patch does not generate any new release audit warnings.
findbugs -1. The patch appears to introduce 2 new Findbugs warnings.
core tests +1. The patch passed core unit tests.
Test results: http://hudson.zones.apache.org/hudson/job/Hama-Patch/286/testReport/
Findbugs warnings: http://hudson.zones.apache.org/hudson/job/Hama-Patch/286/findbugsResult/
Checkstyle results: http://hudson.zones.apache.org/hudson/job/Hama-Patch/286/artifact/trunk/build/test/checkstyle-errors.html
Console output: http://hudson.zones.apache.org/hudson/job/Hama-Patch/286/console
This message is automatically generated.
======================================================================
======================================================================
Finished build.
======================================================================
======================================================================
[FINDBUGS] Skipping publisher since build result is FAILURE
Archiving artifacts
Recording test results
Description set: HAMA-326
Hudson build is back to normal : Hama-Patch #290
Posted by Apache Hudson Server <hu...@hudson.apache.org>.
See <https://hudson.apache.org/hudson/job/Hama-Patch/290/>
Build failed in Hudson: Hama-Patch #289
Posted by Apache Hudson Server <hu...@hudson.apache.org>.
See <https://hudson.apache.org/hudson/job/Hama-Patch/289/changes>
Changes:
[edwardyoon] Trivial changes of hama-default.xml
[edwardyoon] Trivial change of hama-default.xml
------------------------------------------
[...truncated 1750 lines...]
[junit] 5, Thread-68
[junit] 0, Thread-72
[junit] 1, Thread-76
[junit] 6, Thread-80
[junit] 7, Thread-84
[junit] 8, Thread-88
[junit] 9, Thread-92
[junit] Hello BSP from 0 of 10: Thread-72
[junit] 2010-11-09 03:29:39,666 ERROR [Thread-60] server.NIOServerCnxn$Factory$1(81): Thread Thread[Thread-60,5,main] died
[junit] java.lang.NullPointerException
[junit] at org.apache.hama.bsp.BSPPeer.enterBarrier(BSPPeer.java:204)
[junit] at org.apache.hama.bsp.BSPPeer.sync(BSPPeer.java:179)
[junit] at org.apache.hama.bsp.TestSerializePrinting$BSPPeerThread.run(TestSerializePrinting.java:121)
[junit] 2010-11-09 03:29:39,671 ERROR [Thread-64] server.NIOServerCnxn$Factory$1(81): Thread Thread[Thread-64,5,main] died
[junit] java.lang.NullPointerException
[junit] at org.apache.hama.bsp.BSPPeer.enterBarrier(BSPPeer.java:204)
[junit] at org.apache.hama.bsp.BSPPeer.sync(BSPPeer.java:179)
[junit] at org.apache.hama.bsp.TestSerializePrinting$BSPPeerThread.run(TestSerializePrinting.java:121)
[junit] 2010-11-09 03:29:39,667 ERROR [Thread-92] server.NIOServerCnxn$Factory$1(81): Thread Thread[Thread-92,5,main] died
[junit] java.lang.NullPointerException
[junit] at org.apache.hama.bsp.BSPPeer.enterBarrier(BSPPeer.java:204)
[junit] at org.apache.hama.bsp.BSPPeer.sync(BSPPeer.java:179)
[junit] at org.apache.hama.bsp.TestSerializePrinting$BSPPeerThread.run(TestSerializePrinting.java:121)
[junit] 2010-11-09 03:29:39,667 ERROR [Thread-76] server.NIOServerCnxn$Factory$1(81): Thread Thread[Thread-76,5,main] died
[junit] java.lang.NullPointerException
[junit] at org.apache.hama.bsp.BSPPeer.enterBarrier(BSPPeer.java:204)
[junit] at org.apache.hama.bsp.BSPPeer.sync(BSPPeer.java:179)
[junit] at org.apache.hama.bsp.TestSerializePrinting$BSPPeerThread.run(TestSerializePrinting.java:121)
[junit] 2010-11-09 03:29:39,670 ERROR [Thread-88] server.NIOServerCnxn$Factory$1(81): Thread Thread[Thread-88,5,main] died
[junit] java.lang.NullPointerException
[junit] at org.apache.hama.bsp.BSPPeer.enterBarrier(BSPPeer.java:204)
[junit] at org.apache.hama.bsp.BSPPeer.sync(BSPPeer.java:179)
[junit] at org.apache.hama.bsp.TestSerializePrinting$BSPPeerThread.run(TestSerializePrinting.java:121)
[junit] 2010-11-09 03:29:39,669 ERROR [Thread-84] server.NIOServerCnxn$Factory$1(81): Thread Thread[Thread-84,5,main] died
[junit] java.lang.NullPointerException
[junit] at org.apache.hama.bsp.BSPPeer.enterBarrier(BSPPeer.java:204)
[junit] at org.apache.hama.bsp.BSPPeer.sync(BSPPeer.java:179)
[junit] at org.apache.hama.bsp.TestSerializePrinting$BSPPeerThread.run(TestSerializePrinting.java:121)
[junit] 2010-11-09 03:29:39,667 ERROR [Thread-68] server.NIOServerCnxn$Factory$1(81): Thread Thread[Thread-68,5,main] died
[junit] java.lang.NullPointerException
[junit] at org.apache.hama.bsp.BSPPeer.enterBarrier(BSPPeer.java:204)
[junit] at org.apache.hama.bsp.BSPPeer.sync(BSPPeer.java:179)
[junit] at org.apache.hama.bsp.TestSerializePrinting$BSPPeerThread.run(TestSerializePrinting.java:121)
[junit] 2010-11-09 03:29:39,677 ERROR [Thread-80] server.NIOServerCnxn$Factory$1(81): Thread Thread[Thread-80,5,main] died
[junit] java.lang.NullPointerException
[junit] at org.apache.hama.bsp.BSPPeer.enterBarrier(BSPPeer.java:204)
[junit] at org.apache.hama.bsp.BSPPeer.sync(BSPPeer.java:179)
[junit] at org.apache.hama.bsp.TestSerializePrinting$BSPPeerThread.run(TestSerializePrinting.java:121)
[junit] 2010-11-09 03:29:39,675 ERROR [Thread-56] server.NIOServerCnxn$Factory$1(81): Thread Thread[Thread-56,5,main] died
[junit] java.lang.NullPointerException
[junit] at org.apache.hama.bsp.BSPPeer.enterBarrier(BSPPeer.java:204)
[junit] at org.apache.hama.bsp.BSPPeer.sync(BSPPeer.java:179)
[junit] at org.apache.hama.bsp.TestSerializePrinting$BSPPeerThread.run(TestSerializePrinting.java:121)
[junit] 2010-11-09 03:29:39,673 ERROR [Thread-72] server.NIOServerCnxn$Factory$1(81): Thread Thread[Thread-72,5,main] died
[junit] java.lang.NullPointerException
[junit] at org.apache.hama.bsp.BSPPeer.enterBarrier(BSPPeer.java:204)
[junit] at org.apache.hama.bsp.BSPPeer.sync(BSPPeer.java:179)
[junit] at org.apache.hama.bsp.TestSerializePrinting$BSPPeerThread.run(TestSerializePrinting.java:121)
[junit] 2010-11-09 03:29:39,690 INFO [main] hama.HamaTestCase(137): Shutting down Mini DFS
[junit] Shutting down the Mini HDFS Cluster
[junit] Shutting down DataNode 1
[junit] 2010-11-09 03:29:39.693::WARN: EXCEPTION
[junit] java.lang.NullPointerException
[junit] at org.apache.jasper.servlet.JspServlet.destroy(JspServlet.java:282)
[junit] at org.mortbay.jetty.servlet.ServletHolder.destroyInstance(ServletHolder.java:318)
[junit] at org.mortbay.jetty.servlet.ServletHolder.doStop(ServletHolder.java:289)
[junit] at org.mortbay.component.AbstractLifeCycle.stop(AbstractLifeCycle.java:78)
[junit] at org.mortbay.jetty.servlet.ServletHandler.doStop(ServletHandler.java:171)
[junit] at org.mortbay.component.AbstractLifeCycle.stop(AbstractLifeCycle.java:78)
[junit] at org.mortbay.jetty.handler.HandlerWrapper.doStop(HandlerWrapper.java:142)
[junit] at org.mortbay.component.AbstractLifeCycle.stop(AbstractLifeCycle.java:78)
[junit] at org.mortbay.jetty.handler.HandlerWrapper.doStop(HandlerWrapper.java:142)
[junit] at org.mortbay.jetty.servlet.SessionHandler.doStop(SessionHandler.java:124)
[junit] at org.mortbay.component.AbstractLifeCycle.stop(AbstractLifeCycle.java:78)
[junit] at org.mortbay.jetty.handler.HandlerWrapper.doStop(HandlerWrapper.java:142)
[junit] at org.mortbay.jetty.handler.ContextHandler.doStop(ContextHandler.java:591)
[junit] at org.mortbay.jetty.webapp.WebAppContext.doStop(WebAppContext.java:498)
[junit] at org.mortbay.component.AbstractLifeCycle.stop(AbstractLifeCycle.java:78)
[junit] at org.mortbay.jetty.handler.HandlerCollection.doStop(HandlerCollection.java:169)
[junit] at org.mortbay.component.AbstractLifeCycle.stop(AbstractLifeCycle.java:78)
[junit] at org.mortbay.jetty.handler.HandlerWrapper.doStop(HandlerWrapper.java:142)
[junit] at org.mortbay.jetty.Server.doStop(Server.java:281)
[junit] at org.mortbay.component.AbstractLifeCycle.stop(AbstractLifeCycle.java:78)
[junit] at org.apache.hadoop.http.HttpServer.stop(HttpServer.java:491)
[junit] at org.apache.hadoop.hdfs.server.datanode.DataNode.shutdown(DataNode.java:569)
[junit] at org.apache.hadoop.hdfs.MiniDFSCluster.shutdownDataNodes(MiniDFSCluster.java:561)
[junit] at org.apache.hadoop.hdfs.MiniDFSCluster.shutdown(MiniDFSCluster.java:545)
[junit] at org.apache.hama.HamaTestCase.shutdownDfs(HamaTestCase.java:139)
[junit] at org.apache.hama.HamaClusterTestCase.tearDown(HamaClusterTestCase.java:126)
[junit] at junit.framework.TestCase.runBare(TestCase.java:130)
[junit] at junit.framework.TestResult$1.protect(TestResult.java:106)
[junit] at junit.framework.TestResult.runProtected(TestResult.java:124)
[junit] at junit.framework.TestResult.run(TestResult.java:109)
[junit] at junit.framework.TestCase.run(TestCase.java:118)
[junit] at junit.framework.TestSuite.runTest(TestSuite.java:208)
[junit] at junit.framework.TestSuite.run(TestSuite.java:203)
[junit] at org.apache.tools.ant.taskdefs.optional.junit.JUnitTestRunner.run(JUnitTestRunner.java:420)
[junit] at org.apache.tools.ant.taskdefs.optional.junit.JUnitTestRunner.launch(JUnitTestRunner.java:911)
[junit] at org.apache.tools.ant.taskdefs.optional.junit.JUnitTestRunner.main(JUnitTestRunner.java:768)
[junit] Shutting down DataNode 0
[junit] 2010-11-09 03:29:40.813::WARN: EXCEPTION
[junit] java.lang.NullPointerException
[junit] at org.apache.jasper.servlet.JspServlet.destroy(JspServlet.java:282)
[junit] at org.mortbay.jetty.servlet.ServletHolder.destroyInstance(ServletHolder.java:318)
[junit] at org.mortbay.jetty.servlet.ServletHolder.doStop(ServletHolder.java:289)
[junit] at org.mortbay.component.AbstractLifeCycle.stop(AbstractLifeCycle.java:78)
[junit] at org.mortbay.jetty.servlet.ServletHandler.doStop(ServletHandler.java:171)
[junit] at org.mortbay.component.AbstractLifeCycle.stop(AbstractLifeCycle.java:78)
[junit] at org.mortbay.jetty.handler.HandlerWrapper.doStop(HandlerWrapper.java:142)
[junit] at org.mortbay.component.AbstractLifeCycle.stop(AbstractLifeCycle.java:78)
[junit] at org.mortbay.jetty.handler.HandlerWrapper.doStop(HandlerWrapper.java:142)
[junit] at org.mortbay.jetty.servlet.SessionHandler.doStop(SessionHandler.java:124)
[junit] at org.mortbay.component.AbstractLifeCycle.stop(AbstractLifeCycle.java:78)
[junit] at org.mortbay.jetty.handler.HandlerWrapper.doStop(HandlerWrapper.java:142)
[junit] at org.mortbay.jetty.handler.ContextHandler.doStop(ContextHandler.java:591)
[junit] at org.mortbay.jetty.webapp.WebAppContext.doStop(WebAppContext.java:498)
[junit] at org.mortbay.component.AbstractLifeCycle.stop(AbstractLifeCycle.java:78)
[junit] at org.mortbay.jetty.handler.HandlerCollection.doStop(HandlerCollection.java:169)
[junit] at org.mortbay.component.AbstractLifeCycle.stop(AbstractLifeCycle.java:78)
[junit] at org.mortbay.jetty.handler.HandlerWrapper.doStop(HandlerWrapper.java:142)
[junit] at org.mortbay.jetty.Server.doStop(Server.java:281)
[junit] at org.mortbay.component.AbstractLifeCycle.stop(AbstractLifeCycle.java:78)
[junit] at org.apache.hadoop.http.HttpServer.stop(HttpServer.java:491)
[junit] at org.apache.hadoop.hdfs.server.datanode.DataNode.shutdown(DataNode.java:569)
[junit] at org.apache.hadoop.hdfs.MiniDFSCluster.shutdownDataNodes(MiniDFSCluster.java:561)
[junit] at org.apache.hadoop.hdfs.MiniDFSCluster.shutdown(MiniDFSCluster.java:545)
[junit] at org.apache.hama.HamaTestCase.shutdownDfs(HamaTestCase.java:139)
[junit] at org.apache.hama.HamaClusterTestCase.tearDown(HamaClusterTestCase.java:126)
[junit] at junit.framework.TestCase.runBare(TestCase.java:130)
[junit] at junit.framework.TestResult$1.protect(TestResult.java:106)
[junit] at junit.framework.TestResult.runProtected(TestResult.java:124)
[junit] at junit.framework.TestResult.run(TestResult.java:109)
[junit] at junit.framework.TestCase.run(TestCase.java:118)
[junit] at junit.framework.TestSuite.runTest(TestSuite.java:208)
[junit] at junit.framework.TestSuite.run(TestSuite.java:203)
[junit] at org.apache.tools.ant.taskdefs.optional.junit.JUnitTestRunner.run(JUnitTestRunner.java:420)
[junit] at org.apache.tools.ant.taskdefs.optional.junit.JUnitTestRunner.launch(JUnitTestRunner.java:911)
[junit] at org.apache.tools.ant.taskdefs.optional.junit.JUnitTestRunner.main(JUnitTestRunner.java:768)
[junit] 2010-11-09 03:29:41.933::WARN: EXCEPTION
[junit] java.lang.NullPointerException
[junit] at org.apache.jasper.servlet.JspServlet.destroy(JspServlet.java:282)
[junit] at org.mortbay.jetty.servlet.ServletHolder.destroyInstance(ServletHolder.java:318)
[junit] at org.mortbay.jetty.servlet.ServletHolder.doStop(ServletHolder.java:289)
[junit] at org.mortbay.component.AbstractLifeCycle.stop(AbstractLifeCycle.java:78)
[junit] at org.mortbay.jetty.servlet.ServletHandler.doStop(ServletHandler.java:171)
[junit] at org.mortbay.component.AbstractLifeCycle.stop(AbstractLifeCycle.java:78)
[junit] at org.mortbay.jetty.handler.HandlerWrapper.doStop(HandlerWrapper.java:142)
[junit] at org.mortbay.component.AbstractLifeCycle.stop(AbstractLifeCycle.java:78)
[junit] at org.mortbay.jetty.handler.HandlerWrapper.doStop(HandlerWrapper.java:142)
[junit] at org.mortbay.jetty.servlet.SessionHandler.doStop(SessionHandler.java:124)
[junit] at org.mortbay.component.AbstractLifeCycle.stop(AbstractLifeCycle.java:78)
[junit] at org.mortbay.jetty.handler.HandlerWrapper.doStop(HandlerWrapper.java:142)
[junit] at org.mortbay.jetty.handler.ContextHandler.doStop(ContextHandler.java:591)
[junit] at org.mortbay.jetty.webapp.WebAppContext.doStop(WebAppContext.java:498)
[junit] at org.mortbay.component.AbstractLifeCycle.stop(AbstractLifeCycle.java:78)
[junit] at org.mortbay.jetty.handler.HandlerCollection.doStop(HandlerCollection.java:169)
[junit] at org.mortbay.component.AbstractLifeCycle.stop(AbstractLifeCycle.java:78)
[junit] at org.mortbay.jetty.handler.HandlerWrapper.doStop(HandlerWrapper.java:142)
[junit] at org.mortbay.jetty.Server.doStop(Server.java:281)
[junit] at org.mortbay.component.AbstractLifeCycle.stop(AbstractLifeCycle.java:78)
[junit] at org.apache.hadoop.http.HttpServer.stop(HttpServer.java:491)
[junit] at org.apache.hadoop.hdfs.server.namenode.NameNode.stop(NameNode.java:305)
[junit] at org.apache.hadoop.hdfs.MiniDFSCluster.shutdown(MiniDFSCluster.java:547)
[junit] at org.apache.hama.HamaTestCase.shutdownDfs(HamaTestCase.java:139)
[junit] at org.apache.hama.HamaClusterTestCase.tearDown(HamaClusterTestCase.java:126)
[junit] at junit.framework.TestCase.runBare(TestCase.java:130)
[junit] at junit.framework.TestResult$1.protect(TestResult.java:106)
[junit] at junit.framework.TestResult.runProtected(TestResult.java:124)
[junit] at junit.framework.TestResult.run(TestResult.java:109)
[junit] at junit.framework.TestCase.run(TestCase.java:118)
[junit] at junit.framework.TestSuite.runTest(TestSuite.java:208)
[junit] at junit.framework.TestSuite.run(TestSuite.java:203)
[junit] at org.apache.tools.ant.taskdefs.optional.junit.JUnitTestRunner.run(JUnitTestRunner.java:420)
[junit] at org.apache.tools.ant.taskdefs.optional.junit.JUnitTestRunner.launch(JUnitTestRunner.java:911)
[junit] at org.apache.tools.ant.taskdefs.optional.junit.JUnitTestRunner.main(JUnitTestRunner.java:768)
[junit] 2010-11-09 03:29:42,054 WARN [org.apache.hadoop.hdfs.server.namenode.FSNamesystem$ReplicationMonitor@2c35e] namenode.FSNamesystem$ReplicationMonitor(2323): ReplicationMonitor thread received InterruptedException.java.lang.InterruptedException: sleep interrupted
[junit] 2010-11-09 03:29:42,086 INFO [main] hama.HamaTestCase(148): Shutting down FileSystem
[junit] Tests run: 1, Failures: 0, Errors: 0, Time elapsed: 15.685 sec
[junit] Running org.apache.hama.ipc.TestIPC
[junit] Tests run: 3, Failures: 0, Errors: 0, Time elapsed: 11.647 sec
[junit] Running org.apache.hama.ipc.TestRPC
[junit] Tests run: 1, Failures: 0, Errors: 0, Time elapsed: 0.623 sec
[junit] Running org.apache.hama.util.TestBytes
[junit] AAA
[junit] CCC
[junit] EEE
[junit] AAA
[junit] BBB
[junit] CCC
[junit] DDD
[junit] http://A
[junit] http://]
[junit] http://z
[junit] Tests run: 8, Failures: 0, Errors: 0, Time elapsed: 0.194 sec
[junit] Running org.apache.hama.util.TestNumeric
[junit] Tests run: 1, Failures: 0, Errors: 0, Time elapsed: 0.149 sec
[junit] Running org.apache.hama.util.TestRandomVariable
[junit] Tests run: 3, Failures: 0, Errors: 0, Time elapsed: 0.048 sec
BUILD FAILED
/zonestorage/hudson<https://hudson.apache.org/hudson/job/Hama-Patch/ws/trunk/build.xml>:289: Tests failed!
Total time: 59 seconds
======================================================================
======================================================================
Adding comment to Jira.
======================================================================
======================================================================
-1 overall. Here are the results of testing the latest attachment
http://issues.apache.org/jira/secure/attachment/12459145/HAMA-321_v02.patch
against trunk revision 1032884.
@author +1. The patch does not contain any @author tags.
tests included +1. The patch appears to include 3 new or modified tests.
javadoc +1. The javadoc tool did not generate any warning messages.
javac +1. The applied patch does not generate any new javac compiler warnings.
release audit +1. The applied patch does not generate any new release audit warnings.
findbugs +1. The patch does not introduce any new Findbugs warnings.
core tests -1. The patch failed core unit tests.
Test results: http://hudson.zones.apache.org/hudson/job/Hama-Patch/289/testReport/
Findbugs warnings: http://hudson.zones.apache.org/hudson/job/Hama-Patch/289/findbugsResult/
Checkstyle results: http://hudson.zones.apache.org/hudson/job/Hama-Patch/289/artifact/trunk/build/test/checkstyle-errors.html
Console output: http://hudson.zones.apache.org/hudson/job/Hama-Patch/289/console
This message is automatically generated.
======================================================================
======================================================================
Finished build.
======================================================================
======================================================================
[FINDBUGS] Skipping publisher since build result is FAILURE
Archiving artifacts
Recording test results
Description set: HAMA-321
Build failed in Hudson: Hama-Patch #288
Posted by Apache Hudson Server <hu...@hudson.apache.org>.
See <https://hudson.apache.org/hudson/job/Hama-Patch/288/changes>
Changes:
[edwardyoon] Add superstep counter
[edwardyoon] Fix typos on website.
[edwardyoon] Add overview for javadoc
------------------------------------------
[...truncated 1822 lines...]
[exec] Copying 1 file to /zonestorage/hudson<https://hudson.apache.org/hudson/job/Hama-Patch/ws/trunk/src/docs/build/tmp>
[exec] Copying 1 file to /zonestorage/hudson<https://hudson.apache.org/hudson/job/Hama-Patch/ws/trunk/src/docs/build/tmp>
[exec] Copying 1 file to /zonestorage/hudson<https://hudson.apache.org/hudson/job/Hama-Patch/ws/trunk/src/docs/build/tmp>
[exec] Copying 1 file to /zonestorage/hudson<https://hudson.apache.org/hudson/job/Hama-Patch/ws/trunk/src/docs/build/tmp>
[exec] Copying 1 file to /zonestorage/hudson<https://hudson.apache.org/hudson/job/Hama-Patch/ws/trunk/src/docs/build/tmp>
[exec]
[exec] --------------------------------------------------------------
[exec] Installing plugin: org.apache.forrest.plugin.output.pdf
[exec] --------------------------------------------------------------
[exec]
[exec]
[exec] check-plugin:
[exec] org.apache.forrest.plugin.output.pdf is available in the build dir. Trying to update it...
[exec]
[exec] init-props:
[exec]
[exec] echo-settings:
[exec]
[exec] init-proxy:
[exec]
[exec] fetch-plugins-descriptors:
[exec]
[exec] fetch-plugin:
[exec] Trying to find the description of org.apache.forrest.plugin.output.pdf in the different descriptor files
[exec] Using the descriptor file /zonestorage/hudson<https://hudson.apache.org/hudson/job/Hama-Patch/ws/trunk/src/docs/build/tmp/plugins-1.xml...>
[exec] Processing /zonestorage/hudson<https://hudson.apache.org/hudson/job/Hama-Patch/ws/trunk/src/docs/build/tmp/plugins-1.xml> to /zonestorage/hudson<https://hudson.apache.org/hudson/job/Hama-Patch/ws/trunk/src/docs/build/tmp/pluginlist2fetchbuild.xml>
[exec] Loading stylesheet /zonestorage/hudson/home/edwardyoon/tools/forrest/latest/main/var/pluginlist2fetch.xsl
[exec]
[exec] fetch-local-unversioned-plugin:
[exec]
[exec] get-local:
[exec] Trying to locally get org.apache.forrest.plugin.output.pdf
[exec] Looking in local /zonestorage/hudson/home/edwardyoon/tools/forrest/latest/plugins
[exec] Found !
[exec]
[exec] init-build-compiler:
[exec]
[exec] echo-init:
[exec]
[exec] init:
[exec]
[exec] compile:
[exec]
[exec] jar:
[exec]
[exec] local-deploy:
[exec] Locally deploying org.apache.forrest.plugin.output.pdf
[exec]
[exec] build:
[exec] Plugin org.apache.forrest.plugin.output.pdf deployed ! Ready to configure
[exec]
[exec] fetch-remote-unversioned-plugin-version-forrest:
[exec]
[exec] fetch-remote-unversioned-plugin-unversion-forrest:
[exec]
[exec] has-been-downloaded:
[exec]
[exec] downloaded-message:
[exec]
[exec] uptodate-message:
[exec]
[exec] not-found-message:
[exec] Fetch-plugin Ok, installing !
[exec]
[exec] unpack-plugin:
[exec]
[exec] install-plugin:
[exec]
[exec] configure-plugin:
[exec]
[exec] configure-output-plugin:
[exec] Mounting output plugin: org.apache.forrest.plugin.output.pdf
[exec] Processing /zonestorage/hudson<https://hudson.apache.org/hudson/job/Hama-Patch/ws/trunk/src/docs/build/tmp/output.xmap> to /zonestorage/hudson<https://hudson.apache.org/hudson/job/Hama-Patch/ws/trunk/src/docs/build/tmp/output.xmap.new>
[exec] Loading stylesheet /zonestorage/hudson/home/edwardyoon/tools/forrest/latest/main/var/pluginMountSnippet.xsl
[exec] Moving 1 file to /zonestorage/hudson<https://hudson.apache.org/hudson/job/Hama-Patch/ws/trunk/src/docs/build/tmp>
[exec]
[exec] configure-plugin-locationmap:
[exec] Mounting plugin locationmap for org.apache.forrest.plugin.output.pdf
[exec] Processing /zonestorage/hudson<https://hudson.apache.org/hudson/job/Hama-Patch/ws/trunk/src/docs/build/tmp/locationmap.xml> to /zonestorage/hudson<https://hudson.apache.org/hudson/job/Hama-Patch/ws/trunk/src/docs/build/tmp/locationmap.xml.new>
[exec] Loading stylesheet /zonestorage/hudson/home/edwardyoon/tools/forrest/latest/main/var/pluginLmMountSnippet.xsl
[exec] Moving 1 file to /zonestorage/hudson<https://hudson.apache.org/hudson/job/Hama-Patch/ws/trunk/src/docs/build/tmp>
[exec]
[exec] init:
[exec]
[exec] -prepare-classpath:
[exec]
[exec] check-contentdir:
[exec]
[exec] examine-proj:
[exec]
[exec] validation-props:
[exec]
[exec] validate-xdocs:
[exec]
[exec] validate-skinconf:
[exec]
[exec] validate-sitemap:
[exec]
[exec] validate-skins-stylesheets:
[exec]
[exec] validate-skins:
[exec]
[exec] validate-skinchoice:
[exec] ...validated existence of skin 'pelt'
[exec]
[exec] validate-stylesheets:
[exec]
[exec] validate:
[exec]
[exec] site:
[exec]
[exec] Copying the various non-generated resources to site.
[exec] Warnings will be issued if the optional project resources are not found.
[exec] This is often the case, because they are optional and so may not be available.
[exec] Copying project resources and images to site ...
[exec] Warning: /zonestorage/hudson<https://hudson.apache.org/hudson/job/Hama-Patch/ws/trunk/src/docs/build/webapp/resources> not found.
[exec] Copied 1 empty directory to 1 empty directory under /zonestorage/hudson<https://hudson.apache.org/hudson/job/Hama-Patch/ws/trunk/src/docs/build/site>
[exec] Copying main skin images to site ...
[exec] Created dir: /zonestorage/hudson<https://hudson.apache.org/hudson/job/Hama-Patch/ws/trunk/src/docs/build/site/skin/images>
[exec] Copying 18 files to /zonestorage/hudson<https://hudson.apache.org/hudson/job/Hama-Patch/ws/trunk/src/docs/build/site/skin/images>
[exec] Copying 14 files to /zonestorage/hudson<https://hudson.apache.org/hudson/job/Hama-Patch/ws/trunk/src/docs/build/site/skin/images>
[exec] Copying project skin images to site ...
[exec] Warning: /zonestorage/hudson<https://hudson.apache.org/hudson/job/Hama-Patch/ws/trunk/src/docs/src/documentation/skins/common/images> not found.
[exec] Warning: /zonestorage/hudson<https://hudson.apache.org/hudson/job/Hama-Patch/ws/trunk/src/docs/src/documentation/skins/pelt/images> not found.
[exec] Copying main skin css and js files to site ...
[exec] Copying 11 files to /zonestorage/hudson<https://hudson.apache.org/hudson/job/Hama-Patch/ws/trunk/src/docs/build/site/skin>
[exec] Copied 4 empty directories to 3 empty directories under /zonestorage/hudson<https://hudson.apache.org/hudson/job/Hama-Patch/ws/trunk/src/docs/build/site/skin>
[exec] Copying 4 files to /zonestorage/hudson<https://hudson.apache.org/hudson/job/Hama-Patch/ws/trunk/src/docs/build/site/skin>
[exec] Copying project skin css and js files to site ...
[exec] Warning: /zonestorage/hudson<https://hudson.apache.org/hudson/job/Hama-Patch/ws/trunk/src/docs/src/documentation/skins/common> not found.
[exec] Warning: /zonestorage/hudson<https://hudson.apache.org/hudson/job/Hama-Patch/ws/trunk/src/docs/src/documentation/skins/pelt> not found.
[exec]
[exec] Finished copying the non-generated resources.
[exec] Now Cocoon will generate the rest.
[exec]
[exec] Static site will be generated at:
[exec] /zonestorage/hudson<https://hudson.apache.org/hudson/job/Hama-Patch/ws/trunk/src/docs/build/site>
[exec]
[exec] Cocoon will report the status of each document:
[exec] - in column 1: *=okay X=brokenLink ^=pageSkipped (see FAQ).
[exec]
[exec] ------------------------------------------------------------------------
[exec] cocoon 2.2.0-dev
[exec] Copyright (c) 1999-2005 Apache Software Foundation. All rights reserved.
[exec] Build: December 8 2005 (TargetVM=1.4, SourceVM=1.4, Debug=on, Optimize=on)
[exec] ------------------------------------------------------------------------
[exec]
[exec]
[exec] * [1/20] [20/20] 4.559s 6.9Kb linkmap.html
[exec] * [3/18] [0/0] 1.018s 2.9Kb skin/basic.css
[exec] * [4/17] [0/0] 0.061s 1.2Kb skin/print.css
[exec] * [5/16] [0/0] 0.213s 4.0Kb skin/profile.css
[exec] * [7/15] [1/19] 0.568s 7.5Kb privacy_policy.html
[exec] * [9/13] [0/0] 0.223s 19.2Kb images/headerlogo.png
[exec] * [10/13] [1/19] 0.36s 7.6Kb who_we_are.html
[exec] * [11/12] [0/0] 1.146s 6.1Kb who_we_are.pdf
[exec] * [12/11] [0/0] 2.179s 348b skin/images/rc-b-l-15-1body-2menu-3menu.png
[exec] * [13/11] [1/20] 0.292s 6.6Kb irc_channel.html
[exec] * [14/23] [13/13] 0.11s 12.4Kb skin/screen.css
[exec] * [15/22] [0/0] 0.063s 390b skin/images/rc-t-r-15-1body-2menu-3menu.png
[exec] * [16/21] [0/0] 0.027s 199b skin/images/rc-t-l-5-1header-2tab-unselected-3tab-unselected.png
[exec] * [17/20] [0/0] 0.028s 214b skin/images/rc-t-r-5-1header-2searchbox-3searchbox.png
[exec] * [19/18] [0/0] 0.022s 200b skin/images/rc-b-r-5-1header-2tab-selected-3tab-selected.png
[exec] * [20/17] [0/0] 0.025s 319b skin/images/rc-b-r-15-1body-2menu-3menu.png
[exec] * [21/16] [0/0] 0.022s 199b skin/images/rc-t-l-5-1header-2searchbox-3searchbox.png
[exec] * [22/15] [0/0] 0.0070s 285b images/instruction_arrow.png
[exec] * [23/14] [0/0] 0.027s 214b skin/images/rc-t-r-5-1header-2tab-unselected-3tab-unselected.png
[exec] * [24/13] [0/0] 0.026s 209b skin/images/rc-t-l-5-1header-2tab-selected-3tab-selected.png
[exec] * [25/13] [1/19] 0.472s 7.8Kb mailing_lists.html
[exec] * [26/13] [1/20] 0.307s 7.8Kb developers.html
[exec] * [27/12] [0/0] 0.112s 4.5Kb irc_channel.pdf
[exec] * [28/11] [0/0] 0.304s 2.1Kb linkmap.pdf
[exec] * [29/11] [1/20] 0.398s 6.5Kb issue_tracking.html
[exec] * [30/10] [0/0] 0.166s 4.2Kb issue_tracking.pdf
[exec] * [31/9] [0/0] 0.015s 0b images/favicon.ico
[exec] * [32/8] [0/0] 0.136s 215b skin/images/rc-t-r-5-1header-2tab-selected-3tab-selected.png
[exec] * [34/6] [0/0] 0.083s 4.8Kb privacy_policy.pdf
[exec] * [36/4] [0/0] 0.09s 7.2Kb developers.pdf
[exec] * [38/4] [2/22] 0.384s 8.6Kb index.html
[exec] * [39/3] [0/0] 0.0070s 1.8Kb images/built-with-forrest-button.png
[exec] * [40/2] [0/0] 0.102s 7.4Kb mailing_lists.pdf
[exec] * [42/0] [0/0] 0.112s 8.8Kb index.pdf
[exec] Total time: 0 minutes 16 seconds, Site size: 153,261 Site pages: 34
[exec]
[exec] Copying broken links file to site root.
[exec]
[exec] Copying 1 file to /zonestorage/hudson<https://hudson.apache.org/hudson/job/Hama-Patch/ws/trunk/src/docs/build/site>
[exec]
[exec] -----------------------------
[exec] Static site was successfully generated at:
[exec] /zonestorage/hudson<https://hudson.apache.org/hudson/job/Hama-Patch/ws/trunk/src/docs/build/site>
[exec] ------------------------------
[exec]
[exec]
[exec] BUILD SUCCESSFUL
[exec] Total time: 22 seconds
[copy] Copying 76 files to /zonestorage/hudson<https://hudson.apache.org/hudson/job/Hama-Patch/ws/trunk/build/docs/site>
[copy] Copied 7 empty directories to 3 empty directories under /zonestorage/hudson<https://hudson.apache.org/hudson/job/Hama-Patch/ws/trunk/build/docs/site>
[delete] Deleting directory /zonestorage/hudson<https://hudson.apache.org/hudson/job/Hama-Patch/ws/trunk/src/docs/build>
BUILD SUCCESSFUL
Total time: 2 minutes 35 seconds
======================================================================
======================================================================
Adding comment to Jira.
======================================================================
======================================================================
-1 overall. Here are the results of testing the latest attachment
http://issues.apache.org/jira/secure/attachment/12459142/HAMA-321.patch
against trunk revision 1032869.
@author +1. The patch does not contain any @author tags.
tests included -1. The patch doesn't appear to include any new or modified tests.
Please justify why no tests are needed for this patch.
javadoc +1. The javadoc tool did not generate any warning messages.
javac +1. The applied patch does not generate any new javac compiler warnings.
release audit +1. The applied patch does not generate any new release audit warnings.
findbugs +1. The patch does not introduce any new Findbugs warnings.
core tests +1. The patch passed core unit tests.
Test results: http://hudson.zones.apache.org/hudson/job/Hama-Patch/288/testReport/
Findbugs warnings: http://hudson.zones.apache.org/hudson/job/Hama-Patch/288/findbugsResult/
Checkstyle results: http://hudson.zones.apache.org/hudson/job/Hama-Patch/288/artifact/trunk/build/test/checkstyle-errors.html
Console output: http://hudson.zones.apache.org/hudson/job/Hama-Patch/288/console
This message is automatically generated.
======================================================================
======================================================================
Finished build.
======================================================================
======================================================================
[FINDBUGS] Skipping publisher since build result is FAILURE
Archiving artifacts
Recording test results
Description set: HAMA-321
Build failed in Hudson: Hama-Patch #287
Posted by Apache Hudson Server <hu...@hudson.apache.org>.
See <https://hudson.apache.org/hudson/job/Hama-Patch/287/changes>
Changes:
[edwardyoon] GroomServer should wait until a job finishes
------------------------------------------
Started by remote host 127.0.0.1
Building remotely on solaris2
Updating https://svn.apache.org/repos/asf/incubator/hama/trunk
U CHANGES.txt
G src/java/org/apache/hama/bsp/GroomServer.java
C src/java/org/apache/hama/bsp/BSPTaskRunner.java
C src/examples/org/apache/hama/examples/SerializePrinting.java
At revision 1032477
[Hama-Patch] $ /bin/bash -xe /var/tmp/hudson59759.sh
+ set +x
======================================================================
======================================================================
Testing patch for HAMA-241.
======================================================================
======================================================================
Reverted 'src/java/org/apache/hama/bsp/BSPTaskRunner.java'
Reverted 'src/examples/org/apache/hama/examples/SerializePrinting.java'
At revision 1032477.
HAMA-241 patch is being downloaded at Mon Nov 8 02:36:44 EST 2010 from
http://issues.apache.org/jira/secure/attachment/12459043/hama-241.patch
======================================================================
======================================================================
Pre-building trunk to determine trunk number
of release audit, javac, and Findbugs warnings.
======================================================================
======================================================================
======================================================================
======================================================================
Checking there are no @author tags in the patch.
======================================================================
======================================================================
There appear to be 0 @author tags in the patch.
======================================================================
======================================================================
Checking there are new or changed tests in the patch.
======================================================================
======================================================================
There appear to be 0 test files referenced in the patch.
======================================================================
======================================================================
Applying patch.
======================================================================
======================================================================
patching file src/java/org/apache/hama/bsp/GroomServer.java
Hunk #4 FAILED at 614.
1 out of 4 hunks FAILED -- saving rejects to file src/java/org/apache/hama/bsp/GroomServer.java.rej
patching file src/java/org/apache/hama/bsp/BSPPeer.java
patching file src/java/org/apache/hama/bsp/BSPTaskRunner.java
patching file src/java/org/apache/hama/util/ZNode.java
patching file src/examples/org/apache/hama/examples/PiEstimator.java
patching file src/examples/org/apache/hama/examples/ExampleDriver.java
PATCH APPLICATION FAILED
======================================================================
======================================================================
Adding comment to Jira.
======================================================================
======================================================================
-1 overall. Here are the results of testing the latest attachment
http://issues.apache.org/jira/secure/attachment/12459043/hama-241.patch
against trunk revision 1032467.
@author +1. The patch does not contain any @author tags.
tests included -1. The patch doesn't appear to include any new or modified tests.
Please justify why no tests are needed for this patch.
patch -1. The patch command could not apply the patch.
Console output: http://hudson.zones.apache.org/hudson/job/Hama-Patch/287/console
This message is automatically generated.
======================================================================
======================================================================
Finished build.
======================================================================
======================================================================
+ sleep 10
+ exit
[FINDBUGS] Collecting findbugs analysis files...
Archiving artifacts
Recording test results
No test report files were found. Configuration error?
Description set: HAMA-241