You are viewing a plain text version of this content. The canonical link for it is here.
Posted to builds@beam.apache.org by Apache Jenkins Server <je...@builds.apache.org> on 2023/12/12 08:45:19 UTC
Build failed in Jenkins: beam_PostCommit_Python38 #4921
See <https://ci-beam.apache.org/job/beam_PostCommit_Python38/4921/display/redirect>
Changes:
------------------------------------------
[...truncated 10.76 MB...]
timestamp {
seconds: 1702370694
nanos: 673193693
}
message: "Closing all cached gRPC state handlers."
log_location: "/usr/local/lib/python3.8/site-packages/apache_beam/runners/worker/sdk_worker.py:910"
thread: "MainThread"
INFO:root:severity: INFO
timestamp {
seconds: 1702370694
nanos: 673849821
}
message: "Done consuming work."
log_location: "/usr/local/lib/python3.8/site-packages/apache_beam/runners/worker/sdk_worker.py:290"
thread: "MainThread"
INFO:root:severity: INFO
timestamp {
seconds: 1702370694
nanos: 673952579
}
message: "Python sdk harness exiting."
log_location: "/usr/local/lib/python3.8/site-packages/apache_beam/runners/worker/sdk_worker_main.py:213"
thread: "MainThread"
7a14be0524c11f455f23e87c73368faa8719556f3ee54d4e87f7401792aaa4f8
INFO:apache_beam.runners.portability.local_job_service:Completed job in 26.921582221984863 seconds with state DONE.
INFO:root:Completed job in 26.921582221984863 seconds with state DONE.
INFO:apache_beam.runners.portability.portable_runner:Job state changed to DONE
> Task :sdks:python:test-suites:portable:py38:portableWordCountSparkRunnerBatch
INFO:apache_beam.runners.worker.worker_pool_main:Listening for workers at localhost:41433
INFO:apache_beam.runners.portability.fn_api_runner.translations:==================== <function pack_combiners at 0x7f81eba304c0> ====================
INFO:apache_beam.runners.portability.fn_api_runner.translations:==================== <function lift_combiners at 0x7f81eba30550> ====================
INFO:apache_beam.runners.portability.fn_api_runner.translations:==================== <function sort_stages at 0x7f81eba30ca0> ====================
INFO:apache_beam.utils.subprocess_server:Starting service with ('java' '-jar' '<https://ci-beam.apache.org/job/beam_PostCommit_Python38/ws/src/runners/spark/3/job-server/build/libs/beam-runners-spark-3-job-server-2.53.0-SNAPSHOT.jar'> '--spark-master-url' 'local[4]' '--artifacts-dir' '/tmp/beam-templ5wkl3xd/artifacts12wgz7od' '--job-port' '53487' '--artifact-port' '0' '--expansion-port' '0')
INFO:apache_beam.utils.subprocess_server:23/12/12 08:45:05 WARN software.amazon.awssdk.regions.internal.util.EC2MetadataUtils: Unable to retrieve the requested metadata.
INFO:apache_beam.utils.subprocess_server:23/12/12 08:45:06 INFO org.apache.beam.runners.jobsubmission.JobServerDriver: ArtifactStagingService started on localhost:46381
INFO:apache_beam.utils.subprocess_server:23/12/12 08:45:06 INFO org.apache.beam.runners.jobsubmission.JobServerDriver: Java ExpansionService started on localhost:38257
INFO:apache_beam.utils.subprocess_server:23/12/12 08:45:07 INFO org.apache.beam.runners.jobsubmission.JobServerDriver: JobService started on localhost:53487
INFO:apache_beam.utils.subprocess_server:23/12/12 08:45:07 INFO org.apache.beam.runners.jobsubmission.JobServerDriver: Job server now running, terminate with Ctrl+C
WARNING:root:Waiting for grpc channel to be ready at localhost:53487.
INFO:apache_beam.utils.subprocess_server:23/12/12 08:45:08 INFO org.apache.beam.runners.fnexecution.artifact.ArtifactStagingService: Staging artifacts for job_8acceca6-09cb-427c-9d8b-f4880d3b9d51.
INFO:apache_beam.utils.subprocess_server:23/12/12 08:45:08 INFO org.apache.beam.runners.fnexecution.artifact.ArtifactStagingService: Resolving artifacts for job_8acceca6-09cb-427c-9d8b-f4880d3b9d51.0:ref_Environment_default_environment_1.
INFO:apache_beam.utils.subprocess_server:23/12/12 08:45:08 INFO org.apache.beam.runners.fnexecution.artifact.ArtifactStagingService: Getting 1 artifacts for job_8acceca6-09cb-427c-9d8b-f4880d3b9d51.null.
INFO:apache_beam.utils.subprocess_server:23/12/12 08:45:08 INFO org.apache.beam.runners.fnexecution.artifact.ArtifactStagingService: Artifacts fully staged for job_8acceca6-09cb-427c-9d8b-f4880d3b9d51.
INFO:apache_beam.utils.subprocess_server:23/12/12 08:45:08 INFO org.apache.beam.runners.spark.SparkJobInvoker: Invoking job BeamApp-jenkins-1212084508-3b478bd5_3af78e46-341f-4aea-8025-c3e08e902e62
INFO:apache_beam.utils.subprocess_server:23/12/12 08:45:08 INFO org.apache.beam.runners.jobsubmission.JobInvocation: Starting job invocation BeamApp-jenkins-1212084508-3b478bd5_3af78e46-341f-4aea-8025-c3e08e902e62
INFO:apache_beam.runners.portability.portable_runner:Environment "LOOPBACK" has started a component necessary for the execution. Be sure to run the pipeline using
with Pipeline() as p:
p.apply(..)
This ensures that the pipeline finishes before this program exits.
INFO:apache_beam.runners.portability.portable_runner:Job state changed to STOPPED
INFO:apache_beam.runners.portability.portable_runner:Job state changed to STARTING
INFO:apache_beam.runners.portability.portable_runner:Job state changed to RUNNING
INFO:apache_beam.utils.subprocess_server:23/12/12 08:45:09 INFO org.apache.beam.runners.spark.translation.SparkContextFactory: Creating a brand new Spark Context.
INFO:apache_beam.utils.subprocess_server:23/12/12 08:45:09 WARN org.apache.hadoop.util.NativeCodeLoader: Unable to load native-hadoop library for your platform... using builtin-java classes where applicable
INFO:apache_beam.utils.subprocess_server:23/12/12 08:45:11 INFO org.sparkproject.jetty.util.log: Logging initialized @9129ms to org.sparkproject.jetty.util.log.Slf4jLog
INFO:apache_beam.utils.subprocess_server:23/12/12 08:45:11 INFO org.sparkproject.jetty.server.Server: jetty-9.4.44.v20210927; built: 2021-09-27T23:02:44.612Z; git: 8da83308eeca865e495e53ef315a249d63ba9332; jvm 1.8.0_392-8u392-ga-1~20.04-b08
INFO:apache_beam.utils.subprocess_server:23/12/12 08:45:11 INFO org.sparkproject.jetty.server.Server: Started @9264ms
INFO:apache_beam.utils.subprocess_server:23/12/12 08:45:11 INFO org.sparkproject.jetty.server.AbstractConnector: Started ServerConnector@3f6b71a2{HTTP/1.1, (http/1.1)}{127.0.0.1:4040}
INFO:apache_beam.utils.subprocess_server:23/12/12 08:45:11 INFO org.sparkproject.jetty.server.handler.ContextHandler: Started o.s.j.s.ServletContextHandler@10a2a9b1{/jobs,null,AVAILABLE,@Spark}
INFO:apache_beam.utils.subprocess_server:23/12/12 08:45:11 INFO org.sparkproject.jetty.server.handler.ContextHandler: Started o.s.j.s.ServletContextHandler@31de6834{/jobs/json,null,AVAILABLE,@Spark}
INFO:apache_beam.utils.subprocess_server:23/12/12 08:45:11 INFO org.sparkproject.jetty.server.handler.ContextHandler: Started o.s.j.s.ServletContextHandler@69b989{/jobs/job,null,AVAILABLE,@Spark}
INFO:apache_beam.utils.subprocess_server:23/12/12 08:45:11 INFO org.sparkproject.jetty.server.handler.ContextHandler: Started o.s.j.s.ServletContextHandler@4a1558f1{/jobs/job/json,null,AVAILABLE,@Spark}
INFO:apache_beam.utils.subprocess_server:23/12/12 08:45:11 INFO org.sparkproject.jetty.server.handler.ContextHandler: Started o.s.j.s.ServletContextHandler@41e71a34{/stages,null,AVAILABLE,@Spark}
INFO:apache_beam.utils.subprocess_server:23/12/12 08:45:11 INFO org.sparkproject.jetty.server.handler.ContextHandler: Started o.s.j.s.ServletContextHandler@4f71b504{/stages/json,null,AVAILABLE,@Spark}
INFO:apache_beam.utils.subprocess_server:23/12/12 08:45:11 INFO org.sparkproject.jetty.server.handler.ContextHandler: Started o.s.j.s.ServletContextHandler@59023afb{/stages/stage,null,AVAILABLE,@Spark}
INFO:apache_beam.utils.subprocess_server:23/12/12 08:45:11 INFO org.sparkproject.jetty.server.handler.ContextHandler: Started o.s.j.s.ServletContextHandler@2cf04db4{/stages/stage/json,null,AVAILABLE,@Spark}
INFO:apache_beam.utils.subprocess_server:23/12/12 08:45:11 INFO org.sparkproject.jetty.server.handler.ContextHandler: Started o.s.j.s.ServletContextHandler@347cf8aa{/stages/pool,null,AVAILABLE,@Spark}
INFO:apache_beam.utils.subprocess_server:23/12/12 08:45:11 INFO org.sparkproject.jetty.server.handler.ContextHandler: Started o.s.j.s.ServletContextHandler@159c235f{/stages/pool/json,null,AVAILABLE,@Spark}
INFO:apache_beam.utils.subprocess_server:23/12/12 08:45:11 INFO org.sparkproject.jetty.server.handler.ContextHandler: Started o.s.j.s.ServletContextHandler@387769{/storage,null,AVAILABLE,@Spark}
INFO:apache_beam.utils.subprocess_server:23/12/12 08:45:11 INFO org.sparkproject.jetty.server.handler.ContextHandler: Started o.s.j.s.ServletContextHandler@3587e27b{/storage/json,null,AVAILABLE,@Spark}
INFO:apache_beam.utils.subprocess_server:23/12/12 08:45:11 INFO org.sparkproject.jetty.server.handler.ContextHandler: Started o.s.j.s.ServletContextHandler@36b51056{/storage/rdd,null,AVAILABLE,@Spark}
INFO:apache_beam.utils.subprocess_server:23/12/12 08:45:11 INFO org.sparkproject.jetty.server.handler.ContextHandler: Started o.s.j.s.ServletContextHandler@508cd76d{/storage/rdd/json,null,AVAILABLE,@Spark}
INFO:apache_beam.utils.subprocess_server:23/12/12 08:45:11 INFO org.sparkproject.jetty.server.handler.ContextHandler: Started o.s.j.s.ServletContextHandler@169de9f0{/environment,null,AVAILABLE,@Spark}
INFO:apache_beam.utils.subprocess_server:23/12/12 08:45:11 INFO org.sparkproject.jetty.server.handler.ContextHandler: Started o.s.j.s.ServletContextHandler@69d4fbe7{/environment/json,null,AVAILABLE,@Spark}
INFO:apache_beam.utils.subprocess_server:23/12/12 08:45:11 INFO org.sparkproject.jetty.server.handler.ContextHandler: Started o.s.j.s.ServletContextHandler@3b18e66d{/executors,null,AVAILABLE,@Spark}
INFO:apache_beam.utils.subprocess_server:23/12/12 08:45:11 INFO org.sparkproject.jetty.server.handler.ContextHandler: Started o.s.j.s.ServletContextHandler@13a239a{/executors/json,null,AVAILABLE,@Spark}
INFO:apache_beam.utils.subprocess_server:23/12/12 08:45:11 INFO org.sparkproject.jetty.server.handler.ContextHandler: Started o.s.j.s.ServletContextHandler@252bc686{/executors/threadDump,null,AVAILABLE,@Spark}
INFO:apache_beam.utils.subprocess_server:23/12/12 08:45:11 INFO org.sparkproject.jetty.server.handler.ContextHandler: Started o.s.j.s.ServletContextHandler@458082df{/executors/threadDump/json,null,AVAILABLE,@Spark}
INFO:apache_beam.utils.subprocess_server:23/12/12 08:45:11 INFO org.sparkproject.jetty.server.handler.ContextHandler: Started o.s.j.s.ServletContextHandler@4607a0d{/static,null,AVAILABLE,@Spark}
INFO:apache_beam.utils.subprocess_server:23/12/12 08:45:11 INFO org.sparkproject.jetty.server.handler.ContextHandler: Started o.s.j.s.ServletContextHandler@4530a3a1{/,null,AVAILABLE,@Spark}
INFO:apache_beam.utils.subprocess_server:23/12/12 08:45:11 INFO org.sparkproject.jetty.server.handler.ContextHandler: Started o.s.j.s.ServletContextHandler@5055290f{/api,null,AVAILABLE,@Spark}
INFO:apache_beam.utils.subprocess_server:23/12/12 08:45:11 INFO org.sparkproject.jetty.server.handler.ContextHandler: Started o.s.j.s.ServletContextHandler@644df8a1{/jobs/job/kill,null,AVAILABLE,@Spark}
INFO:apache_beam.utils.subprocess_server:23/12/12 08:45:11 INFO org.sparkproject.jetty.server.handler.ContextHandler: Started o.s.j.s.ServletContextHandler@2e6d2e51{/stages/stage/kill,null,AVAILABLE,@Spark}
INFO:apache_beam.utils.subprocess_server:23/12/12 08:45:12 INFO org.sparkproject.jetty.server.handler.ContextHandler: Started o.s.j.s.ServletContextHandler@4a24ac85{/metrics/json,null,AVAILABLE,@Spark}
INFO:apache_beam.utils.subprocess_server:23/12/12 08:45:12 INFO org.apache.beam.runners.spark.metrics.MetricsAccumulator: Instantiated metrics accumulator: MetricQueryResults()
INFO:apache_beam.utils.subprocess_server:23/12/12 08:45:12 WARN software.amazon.awssdk.regions.internal.util.EC2MetadataUtils: Unable to retrieve the requested metadata.
INFO:apache_beam.utils.subprocess_server:23/12/12 08:45:12 INFO org.apache.beam.runners.spark.SparkPipelineRunner: Running job BeamApp-jenkins-1212084508-3b478bd5_3af78e46-341f-4aea-8025-c3e08e902e62 on Spark master local[4]
INFO:apache_beam.runners.worker.statecache:Creating state cache with size 104857600
INFO:apache_beam.runners.worker.sdk_worker:Creating insecure control channel for localhost:38907.
INFO:apache_beam.runners.worker.sdk_worker:Control channel established.
INFO:apache_beam.runners.worker.sdk_worker:Initializing SDKHarness with unbounded number of workers.
INFO:apache_beam.utils.subprocess_server:23/12/12 08:45:14 INFO org.apache.beam.runners.fnexecution.control.FnApiControlClientPoolService: Beam Fn Control client connected with id 1-1
INFO:apache_beam.utils.subprocess_server:23/12/12 08:45:14 INFO org.apache.beam.runners.fnexecution.control.FnApiControlClientPoolService: getProcessBundleDescriptor request with id 1-2
INFO:apache_beam.runners.worker.sdk_worker:Creating insecure state channel for localhost:42123.
INFO:apache_beam.runners.worker.sdk_worker:State channel established.
INFO:apache_beam.runners.worker.data_plane:Creating client data channel for localhost:40745
INFO:apache_beam.utils.subprocess_server:23/12/12 08:45:14 INFO org.apache.beam.runners.fnexecution.data.GrpcDataService: Beam Fn Data client connected.
INFO:apache_beam.utils.subprocess_server:23/12/12 08:45:14 INFO org.apache.beam.runners.fnexecution.control.FnApiControlClientPoolService: getProcessBundleDescriptor request with id 1-3
INFO:apache_beam.utils.subprocess_server:23/12/12 08:45:14 INFO org.apache.beam.runners.fnexecution.control.FnApiControlClientPoolService: getProcessBundleDescriptor request with id 1-4
INFO:apache_beam.utils.subprocess_server:23/12/12 08:45:14 INFO org.apache.beam.runners.fnexecution.control.FnApiControlClientPoolService: getProcessBundleDescriptor request with id 1-5
INFO:apache_beam.utils.subprocess_server:23/12/12 08:45:15 INFO org.apache.beam.runners.fnexecution.control.FnApiControlClientPoolService: getProcessBundleDescriptor request with id 1-7
INFO:apache_beam.utils.subprocess_server:23/12/12 08:45:15 INFO org.apache.beam.runners.fnexecution.control.FnApiControlClientPoolService: getProcessBundleDescriptor request with id 1-6
INFO:apache_beam.utils.subprocess_server:23/12/12 08:45:15 INFO org.apache.beam.runners.fnexecution.control.FnApiControlClientPoolService: getProcessBundleDescriptor request with id 1-9
INFO:apache_beam.utils.subprocess_server:23/12/12 08:45:15 INFO org.apache.beam.runners.fnexecution.control.FnApiControlClientPoolService: getProcessBundleDescriptor request with id 1-8
INFO:apache_beam.utils.subprocess_server:23/12/12 08:45:15 INFO org.apache.beam.runners.fnexecution.control.FnApiControlClientPoolService: getProcessBundleDescriptor request with id 1-13
INFO:apache_beam.utils.subprocess_server:23/12/12 08:45:15 INFO org.apache.beam.runners.fnexecution.control.FnApiControlClientPoolService: getProcessBundleDescriptor request with id 1-12
INFO:apache_beam.utils.subprocess_server:23/12/12 08:45:15 INFO org.apache.beam.runners.fnexecution.control.FnApiControlClientPoolService: getProcessBundleDescriptor request with id 1-10
INFO:apache_beam.utils.subprocess_server:23/12/12 08:45:15 INFO org.apache.beam.runners.fnexecution.control.FnApiControlClientPoolService: getProcessBundleDescriptor request with id 1-11
INFO:apache_beam.utils.subprocess_server:23/12/12 08:45:15 INFO org.apache.beam.runners.fnexecution.control.FnApiControlClientPoolService: getProcessBundleDescriptor request with id 1-14
INFO:apache_beam.utils.subprocess_server:23/12/12 08:45:15 INFO org.apache.beam.runners.fnexecution.control.FnApiControlClientPoolService: getProcessBundleDescriptor request with id 1-15
INFO:apache_beam.utils.subprocess_server:23/12/12 08:45:15 INFO org.apache.beam.runners.spark.SparkPipelineRunner: Job BeamApp-jenkins-1212084508-3b478bd5_3af78e46-341f-4aea-8025-c3e08e902e62: Pipeline translated successfully. Computing outputs
INFO:apache_beam.utils.subprocess_server:23/12/12 08:45:15 INFO org.apache.beam.runners.fnexecution.control.FnApiControlClientPoolService: getProcessBundleDescriptor request with id 1-16
INFO:apache_beam.io.filebasedsink:Starting finalize_write threads with num_shards: 4 (skipped: 0), batches: 4, num_threads: 4
INFO:apache_beam.io.filebasedsink:Renamed 4 shards in 0.01 seconds.
INFO:apache_beam.utils.subprocess_server:23/12/12 08:45:15 INFO org.apache.beam.runners.spark.SparkPipelineRunner: Job BeamApp-jenkins-1212084508-3b478bd5_3af78e46-341f-4aea-8025-c3e08e902e62 finished.
INFO:apache_beam.utils.subprocess_server:23/12/12 08:45:15 INFO org.sparkproject.jetty.server.AbstractConnector: Stopped Spark@3f6b71a2{HTTP/1.1, (http/1.1)}{127.0.0.1:4040}
INFO:apache_beam.runners.portability.portable_runner:Job state changed to DONE
Exception in thread read_state:
Traceback (most recent call last):
File "/usr/lib/python3.8/threading.py", line 932, in _bootstrap_inner
self.run()
File "/usr/lib/python3.8/threading.py", line 870, in run
self._target(*self._args, **self._kwargs)
File "<https://ci-beam.apache.org/job/beam_PostCommit_Python38/ws/src/sdks/python/apache_beam/runners/worker/sdk_worker.py",> line 1041, in pull_responses
for response in responses:
File "<https://ci-beam.apache.org/job/beam_PostCommit_Python38/ws/src/build/gradleenv/2022703442/lib/python3.8/site-packages/grpc/_channel.py",> line 540, in __next__
Exception in thread run_worker_1-1:
Traceback (most recent call last):
File "/usr/lib/python3.8/threading.py", line 932, in _bootstrap_inner
self.run()
File "/usr/lib/python3.8/threading.py", line 870, in run
self._target(*self._args, **self._kwargs)
File "<https://ci-beam.apache.org/job/beam_PostCommit_Python38/ws/src/sdks/python/apache_beam/runners/worker/sdk_worker.py",> line 265, in run
for work_request in self._control_stub.Control(get_responses()):
File "<https://ci-beam.apache.org/job/beam_PostCommit_Python38/ws/src/build/gradleenv/2022703442/lib/python3.8/site-packages/grpc/_channel.py",> line 540, in __next__
return self._next()
File "<https://ci-beam.apache.org/job/beam_PostCommit_Python38/ws/src/build/gradleenv/2022703442/lib/python3.8/site-packages/grpc/_channel.py",> line 966, in _next
return self._next()
File "<https://ci-beam.apache.org/job/beam_PostCommit_Python38/ws/src/build/gradleenv/2022703442/lib/python3.8/site-packages/grpc/_channel.py",> line 966, in _next
raise self
grpc._channel._MultiThreadedRendezvous: <_MultiThreadedRendezvous of RPC that terminated with:
status = StatusCode.UNAVAILABLE
details = "Socket closed"
debug_error_string = "UNKNOWN:Error received from peer ipv6:%5B::1%5D:42123 {grpc_message:"Socket closed", grpc_status:14, created_time:"2023-12-12T08:45:16.209096494+00:00"}"
>
ERROR:apache_beam.runners.worker.data_plane:Failed to read inputs in the data plane.
Traceback (most recent call last):
File "<https://ci-beam.apache.org/job/beam_PostCommit_Python38/ws/src/sdks/python/apache_beam/runners/worker/data_plane.py",> line 669, in _read_inputs
for elements in elements_iterator:
File "<https://ci-beam.apache.org/job/beam_PostCommit_Python38/ws/src/build/gradleenv/2022703442/lib/python3.8/site-packages/grpc/_channel.py",> line 540, in __next__
return self._next()
File "<https://ci-beam.apache.org/job/beam_PostCommit_Python38/ws/src/build/gradleenv/2022703442/lib/python3.8/site-packages/grpc/_channel.py",> line 966, in _next
raise self
grpc._channel._MultiThreadedRendezvous: <_MultiThreadedRendezvous of RPC that terminated with:
status = StatusCode.UNAVAILABLE
details = "recvmsg:Connection reset by peer"
debug_error_string = "UNKNOWN:Error received from peer ipv6:%5B::1%5D:40745 {grpc_message:"recvmsg:Connection reset by peer", grpc_status:14, created_time:"2023-12-12T08:45:16.209100439+00:00"}"
>
raise self
grpc._channel._MultiThreadedRendezvous: <_MultiThreadedRendezvous of RPC that terminated with:
status = StatusCode.UNAVAILABLE
details = "recvmsg:Connection reset by peer"
debug_error_string = "UNKNOWN:Error received from peer ipv6:%5B::1%5D:38907 {created_time:"2023-12-12T08:45:16.209131274+00:00", grpc_status:14, grpc_message:"recvmsg:Connection reset by peer"}"
>
Exception in thread read_grpc_client_inputs:
Traceback (most recent call last):
File "/usr/lib/python3.8/threading.py", line 932, in _bootstrap_inner
self.run()
File "/usr/lib/python3.8/threading.py", line 870, in run
self._target(*self._args, **self._kwargs)
File "<https://ci-beam.apache.org/job/beam_PostCommit_Python38/ws/src/sdks/python/apache_beam/runners/worker/data_plane.py",> line 686, in <lambda>
target=lambda: self._read_inputs(elements_iterator),
File "<https://ci-beam.apache.org/job/beam_PostCommit_Python38/ws/src/sdks/python/apache_beam/runners/worker/data_plane.py",> line 669, in _read_inputs
for elements in elements_iterator:
File "<https://ci-beam.apache.org/job/beam_PostCommit_Python38/ws/src/build/gradleenv/2022703442/lib/python3.8/site-packages/grpc/_channel.py",> line 540, in __next__
return self._next()
File "<https://ci-beam.apache.org/job/beam_PostCommit_Python38/ws/src/build/gradleenv/2022703442/lib/python3.8/site-packages/grpc/_channel.py",> line 966, in _next
raise self
grpc._channel._MultiThreadedRendezvous: <_MultiThreadedRendezvous of RPC that terminated with:
status = StatusCode.UNAVAILABLE
details = "recvmsg:Connection reset by peer"
debug_error_string = "UNKNOWN:Error received from peer ipv6:%5B::1%5D:40745 {grpc_message:"recvmsg:Connection reset by peer", grpc_status:14, created_time:"2023-12-12T08:45:16.209100439+00:00"}"
>
FAILURE: Build completed with 3 failures.
1: Task failed with an exception.
-----------
* Where:
Build file '<https://ci-beam.apache.org/job/beam_PostCommit_Python38/ws/src/sdks/python/build.gradle'> line: 97
* What went wrong:
Execution failed for task ':sdks:python:bdistPy38linux'.
> Process 'command 'sh'' finished with non-zero exit value 1
* Try:
> Run with --stacktrace option to get the stack trace.
> Run with --info or --debug option to get more log output.
> Get more help at https://help.gradle.org.
==============================================================================
2: Task failed with an exception.
-----------
* Where:
Script '<https://ci-beam.apache.org/job/beam_PostCommit_Python38/ws/src/sdks/python/test-suites/portable/common.gradle'> line: 326
* What went wrong:
Execution failed for task ':sdks:python:test-suites:portable:py38:postCommitPy38IT'.
> Process 'command 'sh'' finished with non-zero exit value 1
* Try:
> Run with --stacktrace option to get the stack trace.
> Run with --info or --debug option to get more log output.
> Get more help at https://help.gradle.org.
==============================================================================
3: Task failed with an exception.
-----------
* Where:
Script '<https://ci-beam.apache.org/job/beam_PostCommit_Python38/ws/src/sdks/python/test-suites/direct/common.gradle'> line: 52
* What went wrong:
Execution failed for task ':sdks:python:test-suites:direct:py38:postCommitIT'.
> Process 'command 'sh'' finished with non-zero exit value 1
* Try:
> Run with --stacktrace option to get the stack trace.
> Run with --info or --debug option to get more log output.
> Get more help at https://help.gradle.org.
==============================================================================
Deprecated Gradle features were used in this build, making it incompatible with Gradle 9.0.
You can use '--warning-mode all' to show the individual deprecation warnings and determine if they come from your own scripts or plugins.
For more on this, please refer to https://docs.gradle.org/8.4/userguide/command_line_interface.html#sec:command_line_warnings in the Gradle documentation.
BUILD FAILED in 29m 54s
221 actionable tasks: 156 executed, 61 from cache, 4 up-to-date
Publishing build scan...
https://ge.apache.org/s/df27hwxrwxvy2
Build step 'Invoke Gradle script' changed build result to FAILURE
Build step 'Invoke Gradle script' marked build as failure
---------------------------------------------------------------------
To unsubscribe, e-mail: builds-unsubscribe@beam.apache.org
For additional commands, e-mail: builds-help@beam.apache.org
Jenkins build is back to normal : beam_PostCommit_Python38 #4929
Posted by Apache Jenkins Server <je...@builds.apache.org>.
See <https://ci-beam.apache.org/job/beam_PostCommit_Python38/4929/display/redirect?page=changes>
---------------------------------------------------------------------
To unsubscribe, e-mail: builds-unsubscribe@beam.apache.org
For additional commands, e-mail: builds-help@beam.apache.org
Build failed in Jenkins: beam_PostCommit_Python38 #4928
Posted by Apache Jenkins Server <je...@builds.apache.org>.
See <https://ci-beam.apache.org/job/beam_PostCommit_Python38/4928/display/redirect>
Changes:
------------------------------------------
[...truncated 12.18 MB...]
log_location: "/usr/local/lib/python3.8/site-packages/apache_beam/runners/worker/sdk_worker.py:278"
thread: "MainThread"
INFO:root:severity: INFO
timestamp {
seconds: 1702521897
nanos: 994115114
}
message: "Closing all cached grpc data channels."
log_location: "/usr/local/lib/python3.8/site-packages/apache_beam/runners/worker/data_plane.py:820"
thread: "MainThread"
INFO:root:severity: INFO
timestamp {
seconds: 1702521897
nanos: 994179010
}
message: "Closing all cached gRPC state handlers."
log_location: "/usr/local/lib/python3.8/site-packages/apache_beam/runners/worker/sdk_worker.py:918"
thread: "MainThread"
INFO:root:severity: INFO
timestamp {
seconds: 1702521897
nanos: 994865655
}
message: "Done consuming work."
log_location: "/usr/local/lib/python3.8/site-packages/apache_beam/runners/worker/sdk_worker.py:290"
thread: "MainThread"
INFO:root:severity: INFO
timestamp {
seconds: 1702521897
nanos: 994969606
}
message: "Python sdk harness exiting."
log_location: "/usr/local/lib/python3.8/site-packages/apache_beam/runners/worker/sdk_worker_main.py:213"
thread: "MainThread"
0aaa6af4735bbabd15a5027167df55bb4368def70c273fa8a6004b8b93fa2825
INFO:apache_beam.runners.portability.local_job_service:Completed job in 33.045857429504395 seconds with state DONE.
INFO:root:Completed job in 33.045857429504395 seconds with state DONE.
INFO:apache_beam.runners.portability.portable_runner:Job state changed to DONE
> Task :sdks:python:test-suites:portable:py38:portableWordCountSparkRunnerBatch
INFO:apache_beam.runners.worker.worker_pool_main:Listening for workers at localhost:40515
INFO:apache_beam.runners.portability.fn_api_runner.translations:==================== <function pack_combiners at 0x7f8395db8790> ====================
INFO:apache_beam.runners.portability.fn_api_runner.translations:==================== <function lift_combiners at 0x7f8395db8820> ====================
INFO:apache_beam.runners.portability.fn_api_runner.translations:==================== <function sort_stages at 0x7f8395db8f70> ====================
INFO:apache_beam.utils.subprocess_server:Starting service with ('java' '-jar' '<https://ci-beam.apache.org/job/beam_PostCommit_Python38/ws/src/runners/spark/3/job-server/build/libs/beam-runners-spark-3-job-server-2.54.0-SNAPSHOT.jar'> '--spark-master-url' 'local[4]' '--artifacts-dir' '/tmp/beam-tempg_eio27s/artifacts0tgoy0md' '--job-port' '51401' '--artifact-port' '0' '--expansion-port' '0')
INFO:apache_beam.utils.subprocess_server:23/12/14 02:45:09 WARN software.amazon.awssdk.regions.internal.util.EC2MetadataUtils: Unable to retrieve the requested metadata.
INFO:apache_beam.utils.subprocess_server:23/12/14 02:45:09 INFO org.apache.beam.runners.jobsubmission.JobServerDriver: ArtifactStagingService started on localhost:33915
INFO:apache_beam.utils.subprocess_server:23/12/14 02:45:09 INFO org.apache.beam.runners.jobsubmission.JobServerDriver: Java ExpansionService started on localhost:33015
INFO:apache_beam.utils.subprocess_server:23/12/14 02:45:09 INFO org.apache.beam.runners.jobsubmission.JobServerDriver: JobService started on localhost:51401
INFO:apache_beam.utils.subprocess_server:23/12/14 02:45:09 INFO org.apache.beam.runners.jobsubmission.JobServerDriver: Job server now running, terminate with Ctrl+C
WARNING:root:Waiting for grpc channel to be ready at localhost:51401.
INFO:apache_beam.utils.subprocess_server:23/12/14 02:45:11 INFO org.apache.beam.runners.fnexecution.artifact.ArtifactStagingService: Staging artifacts for job_1f406d77-af26-40f7-8010-551718994301.
INFO:apache_beam.utils.subprocess_server:23/12/14 02:45:11 INFO org.apache.beam.runners.fnexecution.artifact.ArtifactStagingService: Resolving artifacts for job_1f406d77-af26-40f7-8010-551718994301.0:ref_Environment_default_environment_1.
INFO:apache_beam.utils.subprocess_server:23/12/14 02:45:11 INFO org.apache.beam.runners.fnexecution.artifact.ArtifactStagingService: Getting 1 artifacts for job_1f406d77-af26-40f7-8010-551718994301.null.
INFO:apache_beam.utils.subprocess_server:23/12/14 02:45:11 INFO org.apache.beam.runners.fnexecution.artifact.ArtifactStagingService: Artifacts fully staged for job_1f406d77-af26-40f7-8010-551718994301.
INFO:apache_beam.utils.subprocess_server:23/12/14 02:45:11 INFO org.apache.beam.runners.spark.SparkJobInvoker: Invoking job BeamApp-jenkins-1214024511-90a6d1fa_683a6656-d32f-4760-b52b-850f46f4757c
INFO:apache_beam.utils.subprocess_server:23/12/14 02:45:11 INFO org.apache.beam.runners.jobsubmission.JobInvocation: Starting job invocation BeamApp-jenkins-1214024511-90a6d1fa_683a6656-d32f-4760-b52b-850f46f4757c
INFO:apache_beam.runners.portability.portable_runner:Environment "LOOPBACK" has started a component necessary for the execution. Be sure to run the pipeline using
with Pipeline() as p:
p.apply(..)
This ensures that the pipeline finishes before this program exits.
INFO:apache_beam.runners.portability.portable_runner:Job state changed to STOPPED
INFO:apache_beam.runners.portability.portable_runner:Job state changed to STARTING
INFO:apache_beam.runners.portability.portable_runner:Job state changed to RUNNING
INFO:apache_beam.utils.subprocess_server:23/12/14 02:45:12 INFO org.apache.beam.runners.spark.translation.SparkContextFactory: Creating a brand new Spark Context.
INFO:apache_beam.utils.subprocess_server:23/12/14 02:45:12 WARN org.apache.hadoop.util.NativeCodeLoader: Unable to load native-hadoop library for your platform... using builtin-java classes where applicable
INFO:apache_beam.utils.subprocess_server:23/12/14 02:45:14 INFO org.sparkproject.jetty.util.log: Logging initialized @8468ms to org.sparkproject.jetty.util.log.Slf4jLog
INFO:apache_beam.utils.subprocess_server:23/12/14 02:45:14 INFO org.sparkproject.jetty.server.Server: jetty-9.4.44.v20210927; built: 2021-09-27T23:02:44.612Z; git: 8da83308eeca865e495e53ef315a249d63ba9332; jvm 1.8.0_392-8u392-ga-1~20.04-b08
INFO:apache_beam.utils.subprocess_server:23/12/14 02:45:14 INFO org.sparkproject.jetty.server.Server: Started @8595ms
INFO:apache_beam.utils.subprocess_server:23/12/14 02:45:14 INFO org.sparkproject.jetty.server.AbstractConnector: Started ServerConnector@569454b3{HTTP/1.1, (http/1.1)}{127.0.0.1:4040}
INFO:apache_beam.utils.subprocess_server:23/12/14 02:45:14 INFO org.sparkproject.jetty.server.handler.ContextHandler: Started o.s.j.s.ServletContextHandler@1d1a7fc8{/jobs,null,AVAILABLE,@Spark}
INFO:apache_beam.utils.subprocess_server:23/12/14 02:45:14 INFO org.sparkproject.jetty.server.handler.ContextHandler: Started o.s.j.s.ServletContextHandler@3e5ab91e{/jobs/json,null,AVAILABLE,@Spark}
INFO:apache_beam.utils.subprocess_server:23/12/14 02:45:14 INFO org.sparkproject.jetty.server.handler.ContextHandler: Started o.s.j.s.ServletContextHandler@66743c4a{/jobs/job,null,AVAILABLE,@Spark}
INFO:apache_beam.utils.subprocess_server:23/12/14 02:45:14 INFO org.sparkproject.jetty.server.handler.ContextHandler: Started o.s.j.s.ServletContextHandler@9ac6d87{/jobs/job/json,null,AVAILABLE,@Spark}
INFO:apache_beam.utils.subprocess_server:23/12/14 02:45:14 INFO org.sparkproject.jetty.server.handler.ContextHandler: Started o.s.j.s.ServletContextHandler@6e505392{/stages,null,AVAILABLE,@Spark}
INFO:apache_beam.utils.subprocess_server:23/12/14 02:45:14 INFO org.sparkproject.jetty.server.handler.ContextHandler: Started o.s.j.s.ServletContextHandler@179e798{/stages/json,null,AVAILABLE,@Spark}
INFO:apache_beam.utils.subprocess_server:23/12/14 02:45:14 INFO org.sparkproject.jetty.server.handler.ContextHandler: Started o.s.j.s.ServletContextHandler@4f328336{/stages/stage,null,AVAILABLE,@Spark}
INFO:apache_beam.utils.subprocess_server:23/12/14 02:45:14 INFO org.sparkproject.jetty.server.handler.ContextHandler: Started o.s.j.s.ServletContextHandler@1d765691{/stages/stage/json,null,AVAILABLE,@Spark}
INFO:apache_beam.utils.subprocess_server:23/12/14 02:45:14 INFO org.sparkproject.jetty.server.handler.ContextHandler: Started o.s.j.s.ServletContextHandler@8c28d0b{/stages/pool,null,AVAILABLE,@Spark}
INFO:apache_beam.utils.subprocess_server:23/12/14 02:45:14 INFO org.sparkproject.jetty.server.handler.ContextHandler: Started o.s.j.s.ServletContextHandler@536fcd6e{/stages/pool/json,null,AVAILABLE,@Spark}
INFO:apache_beam.utils.subprocess_server:23/12/14 02:45:14 INFO org.sparkproject.jetty.server.handler.ContextHandler: Started o.s.j.s.ServletContextHandler@74cdc49b{/storage,null,AVAILABLE,@Spark}
INFO:apache_beam.utils.subprocess_server:23/12/14 02:45:14 INFO org.sparkproject.jetty.server.handler.ContextHandler: Started o.s.j.s.ServletContextHandler@3379d1fc{/storage/json,null,AVAILABLE,@Spark}
INFO:apache_beam.utils.subprocess_server:23/12/14 02:45:14 INFO org.sparkproject.jetty.server.handler.ContextHandler: Started o.s.j.s.ServletContextHandler@1cf61d78{/storage/rdd,null,AVAILABLE,@Spark}
INFO:apache_beam.utils.subprocess_server:23/12/14 02:45:14 INFO org.sparkproject.jetty.server.handler.ContextHandler: Started o.s.j.s.ServletContextHandler@7cef0531{/storage/rdd/json,null,AVAILABLE,@Spark}
INFO:apache_beam.utils.subprocess_server:23/12/14 02:45:14 INFO org.sparkproject.jetty.server.handler.ContextHandler: Started o.s.j.s.ServletContextHandler@79b31486{/environment,null,AVAILABLE,@Spark}
INFO:apache_beam.utils.subprocess_server:23/12/14 02:45:14 INFO org.sparkproject.jetty.server.handler.ContextHandler: Started o.s.j.s.ServletContextHandler@5aa4ebd2{/environment/json,null,AVAILABLE,@Spark}
INFO:apache_beam.utils.subprocess_server:23/12/14 02:45:14 INFO org.sparkproject.jetty.server.handler.ContextHandler: Started o.s.j.s.ServletContextHandler@78e760d3{/executors,null,AVAILABLE,@Spark}
INFO:apache_beam.utils.subprocess_server:23/12/14 02:45:14 INFO org.sparkproject.jetty.server.handler.ContextHandler: Started o.s.j.s.ServletContextHandler@6e306c09{/executors/json,null,AVAILABLE,@Spark}
INFO:apache_beam.utils.subprocess_server:23/12/14 02:45:14 INFO org.sparkproject.jetty.server.handler.ContextHandler: Started o.s.j.s.ServletContextHandler@3e92bc49{/executors/threadDump,null,AVAILABLE,@Spark}
INFO:apache_beam.utils.subprocess_server:23/12/14 02:45:14 INFO org.sparkproject.jetty.server.handler.ContextHandler: Started o.s.j.s.ServletContextHandler@7fcacb71{/executors/threadDump/json,null,AVAILABLE,@Spark}
INFO:apache_beam.utils.subprocess_server:23/12/14 02:45:14 INFO org.sparkproject.jetty.server.handler.ContextHandler: Started o.s.j.s.ServletContextHandler@2c0f3c01{/static,null,AVAILABLE,@Spark}
INFO:apache_beam.utils.subprocess_server:23/12/14 02:45:14 INFO org.sparkproject.jetty.server.handler.ContextHandler: Started o.s.j.s.ServletContextHandler@5bdaff6c{/,null,AVAILABLE,@Spark}
INFO:apache_beam.utils.subprocess_server:23/12/14 02:45:14 INFO org.sparkproject.jetty.server.handler.ContextHandler: Started o.s.j.s.ServletContextHandler@22445120{/api,null,AVAILABLE,@Spark}
INFO:apache_beam.utils.subprocess_server:23/12/14 02:45:14 INFO org.sparkproject.jetty.server.handler.ContextHandler: Started o.s.j.s.ServletContextHandler@42cd2a31{/jobs/job/kill,null,AVAILABLE,@Spark}
INFO:apache_beam.utils.subprocess_server:23/12/14 02:45:14 INFO org.sparkproject.jetty.server.handler.ContextHandler: Started o.s.j.s.ServletContextHandler@3a3dbaa9{/stages/stage/kill,null,AVAILABLE,@Spark}
INFO:apache_beam.utils.subprocess_server:23/12/14 02:45:14 INFO org.sparkproject.jetty.server.handler.ContextHandler: Started o.s.j.s.ServletContextHandler@74f12df6{/metrics/json,null,AVAILABLE,@Spark}
INFO:apache_beam.utils.subprocess_server:23/12/14 02:45:14 INFO org.apache.beam.runners.spark.metrics.MetricsAccumulator: Instantiated metrics accumulator: MetricQueryResults()
INFO:apache_beam.utils.subprocess_server:23/12/14 02:45:14 WARN software.amazon.awssdk.regions.internal.util.EC2MetadataUtils: Unable to retrieve the requested metadata.
INFO:apache_beam.utils.subprocess_server:23/12/14 02:45:14 INFO org.apache.beam.runners.spark.SparkPipelineRunner: Running job BeamApp-jenkins-1214024511-90a6d1fa_683a6656-d32f-4760-b52b-850f46f4757c on Spark master local[4]
INFO:apache_beam.runners.worker.statecache:Creating state cache with size 104857600
INFO:apache_beam.runners.worker.sdk_worker:Creating insecure control channel for localhost:36039.
INFO:apache_beam.runners.worker.sdk_worker:Control channel established.
INFO:apache_beam.runners.worker.sdk_worker:Initializing SDKHarness with unbounded number of workers.
INFO:apache_beam.utils.subprocess_server:23/12/14 02:45:16 INFO org.apache.beam.runners.fnexecution.control.FnApiControlClientPoolService: Beam Fn Control client connected with id 1-1
INFO:apache_beam.utils.subprocess_server:23/12/14 02:45:16 INFO org.apache.beam.runners.fnexecution.control.FnApiControlClientPoolService: getProcessBundleDescriptor request with id 1-2
INFO:apache_beam.runners.worker.sdk_worker:Creating insecure state channel for localhost:33781.
INFO:apache_beam.runners.worker.sdk_worker:State channel established.
INFO:apache_beam.runners.worker.data_plane:Creating client data channel for localhost:40211
INFO:apache_beam.utils.subprocess_server:23/12/14 02:45:16 INFO org.apache.beam.runners.fnexecution.data.GrpcDataService: Beam Fn Data client connected.
INFO:apache_beam.utils.subprocess_server:23/12/14 02:45:16 INFO org.apache.beam.runners.fnexecution.control.FnApiControlClientPoolService: getProcessBundleDescriptor request with id 1-3
INFO:apache_beam.utils.subprocess_server:23/12/14 02:45:17 INFO org.apache.beam.runners.fnexecution.control.FnApiControlClientPoolService: getProcessBundleDescriptor request with id 1-4
INFO:apache_beam.utils.subprocess_server:23/12/14 02:45:17 INFO org.apache.beam.runners.fnexecution.control.FnApiControlClientPoolService: getProcessBundleDescriptor request with id 1-5
INFO:apache_beam.utils.subprocess_server:23/12/14 02:45:17 INFO org.apache.beam.runners.fnexecution.control.FnApiControlClientPoolService: getProcessBundleDescriptor request with id 1-9
INFO:apache_beam.utils.subprocess_server:23/12/14 02:45:17 INFO org.apache.beam.runners.fnexecution.control.FnApiControlClientPoolService: getProcessBundleDescriptor request with id 1-6
INFO:apache_beam.utils.subprocess_server:23/12/14 02:45:17 INFO org.apache.beam.runners.fnexecution.control.FnApiControlClientPoolService: getProcessBundleDescriptor request with id 1-8
INFO:apache_beam.utils.subprocess_server:23/12/14 02:45:17 INFO org.apache.beam.runners.fnexecution.control.FnApiControlClientPoolService: getProcessBundleDescriptor request with id 1-7
INFO:apache_beam.utils.subprocess_server:23/12/14 02:45:17 INFO org.apache.beam.runners.fnexecution.control.FnApiControlClientPoolService: getProcessBundleDescriptor request with id 1-10
INFO:apache_beam.utils.subprocess_server:23/12/14 02:45:17 INFO org.apache.beam.runners.fnexecution.control.FnApiControlClientPoolService: getProcessBundleDescriptor request with id 1-11
INFO:apache_beam.utils.subprocess_server:23/12/14 02:45:17 INFO org.apache.beam.runners.fnexecution.control.FnApiControlClientPoolService: getProcessBundleDescriptor request with id 1-12
INFO:apache_beam.utils.subprocess_server:23/12/14 02:45:17 INFO org.apache.beam.runners.fnexecution.control.FnApiControlClientPoolService: getProcessBundleDescriptor request with id 1-13
INFO:apache_beam.utils.subprocess_server:23/12/14 02:45:17 INFO org.apache.beam.runners.fnexecution.control.FnApiControlClientPoolService: getProcessBundleDescriptor request with id 1-14
INFO:apache_beam.utils.subprocess_server:23/12/14 02:45:17 INFO org.apache.beam.runners.fnexecution.control.FnApiControlClientPoolService: getProcessBundleDescriptor request with id 1-15
INFO:apache_beam.utils.subprocess_server:23/12/14 02:45:17 INFO org.apache.beam.runners.spark.SparkPipelineRunner: Job BeamApp-jenkins-1214024511-90a6d1fa_683a6656-d32f-4760-b52b-850f46f4757c: Pipeline translated successfully. Computing outputs
INFO:apache_beam.utils.subprocess_server:23/12/14 02:45:17 INFO org.apache.beam.runners.fnexecution.control.FnApiControlClientPoolService: getProcessBundleDescriptor request with id 1-16
INFO:apache_beam.io.filebasedsink:Starting finalize_write threads with num_shards: 4 (skipped: 0), batches: 4, num_threads: 4
INFO:apache_beam.io.filebasedsink:Renamed 4 shards in 0.01 seconds.
INFO:apache_beam.utils.subprocess_server:23/12/14 02:45:18 INFO org.apache.beam.runners.spark.SparkPipelineRunner: Job BeamApp-jenkins-1214024511-90a6d1fa_683a6656-d32f-4760-b52b-850f46f4757c finished.
INFO:apache_beam.utils.subprocess_server:23/12/14 02:45:18 INFO org.sparkproject.jetty.server.AbstractConnector: Stopped Spark@569454b3{HTTP/1.1, (http/1.1)}{127.0.0.1:4040}
INFO:apache_beam.runners.portability.portable_runner:Job state changed to DONE
Exception in thread read_state:
Traceback (most recent call last):
File "/usr/lib/python3.8/threading.py", line 932, in _bootstrap_inner
Exception in thread run_worker_1-1:
Traceback (most recent call last):
File "/usr/lib/python3.8/threading.py", line 932, in _bootstrap_inner
self.run()
File "/usr/lib/python3.8/threading.py", line 870, in run
ERROR:apache_beam.runners.worker.data_plane:Failed to read inputs in the data plane.
Traceback (most recent call last):
File "<https://ci-beam.apache.org/job/beam_PostCommit_Python38/ws/src/sdks/python/apache_beam/runners/worker/data_plane.py",> line 669, in _read_inputs
for elements in elements_iterator:
File "<https://ci-beam.apache.org/job/beam_PostCommit_Python38/ws/src/build/gradleenv/2022703442/lib/python3.8/site-packages/grpc/_channel.py",> line 540, in __next__
return self._next()
File "<https://ci-beam.apache.org/job/beam_PostCommit_Python38/ws/src/build/gradleenv/2022703442/lib/python3.8/site-packages/grpc/_channel.py",> line 966, in _next
raise self
grpc._channel._MultiThreadedRendezvous: <_MultiThreadedRendezvous of RPC that terminated with:
status = StatusCode.UNAVAILABLE
details = "Socket closed"
debug_error_string = "UNKNOWN:Error received from peer ipv6:%5B::1%5D:40211 {grpc_message:"Socket closed", grpc_status:14, created_time:"2023-12-14T02:45:18.585470029+00:00"}"
>
self.run()
File "/usr/lib/python3.8/threading.py", line 870, in run
self._target(*self._args, **self._kwargs)
File "<https://ci-beam.apache.org/job/beam_PostCommit_Python38/ws/src/sdks/python/apache_beam/runners/worker/sdk_worker.py",> line 265, in run
Exception in thread read_grpc_client_inputs:
Traceback (most recent call last):
File "/usr/lib/python3.8/threading.py", line 932, in _bootstrap_inner
self._target(*self._args, **self._kwargs)
File "<https://ci-beam.apache.org/job/beam_PostCommit_Python38/ws/src/sdks/python/apache_beam/runners/worker/sdk_worker.py",> line 1049, in pull_responses
self.run()
File "/usr/lib/python3.8/threading.py", line 870, in run
self._target(*self._args, **self._kwargs)
File "<https://ci-beam.apache.org/job/beam_PostCommit_Python38/ws/src/sdks/python/apache_beam/runners/worker/data_plane.py",> line 686, in <lambda>
for work_request in self._control_stub.Control(get_responses()):
File "<https://ci-beam.apache.org/job/beam_PostCommit_Python38/ws/src/build/gradleenv/2022703442/lib/python3.8/site-packages/grpc/_channel.py",> line 540, in __next__
target=lambda: self._read_inputs(elements_iterator),
File "<https://ci-beam.apache.org/job/beam_PostCommit_Python38/ws/src/sdks/python/apache_beam/runners/worker/data_plane.py",> line 669, in _read_inputs
for elements in elements_iterator:
File "<https://ci-beam.apache.org/job/beam_PostCommit_Python38/ws/src/build/gradleenv/2022703442/lib/python3.8/site-packages/grpc/_channel.py",> line 540, in __next__
return self._next()
File "<https://ci-beam.apache.org/job/beam_PostCommit_Python38/ws/src/build/gradleenv/2022703442/lib/python3.8/site-packages/grpc/_channel.py",> line 966, in _next
raise self
grpc._channel._MultiThreadedRendezvous: <_MultiThreadedRendezvous of RPC that terminated with:
status = StatusCode.UNAVAILABLE
details = "Socket closed"
debug_error_string = "UNKNOWN:Error received from peer ipv6:%5B::1%5D:40211 {grpc_message:"Socket closed", grpc_status:14, created_time:"2023-12-14T02:45:18.585470029+00:00"}"
>
for response in responses:
File "<https://ci-beam.apache.org/job/beam_PostCommit_Python38/ws/src/build/gradleenv/2022703442/lib/python3.8/site-packages/grpc/_channel.py",> line 540, in __next__
return self._next()
File "<https://ci-beam.apache.org/job/beam_PostCommit_Python38/ws/src/build/gradleenv/2022703442/lib/python3.8/site-packages/grpc/_channel.py",> line 966, in _next
return self._next()
File "<https://ci-beam.apache.org/job/beam_PostCommit_Python38/ws/src/build/gradleenv/2022703442/lib/python3.8/site-packages/grpc/_channel.py",> line 966, in _next
raise self
grpc._channel._MultiThreadedRendezvous: <_MultiThreadedRendezvous of RPC that terminated with:
status = StatusCode.UNAVAILABLE
details = "Socket closed"
debug_error_string = "UNKNOWN:Error received from peer ipv6:%5B::1%5D:36039 {created_time:"2023-12-14T02:45:18.58549894+00:00", grpc_status:14, grpc_message:"Socket closed"}"
>
raise self
grpc._channel._MultiThreadedRendezvous: <_MultiThreadedRendezvous of RPC that terminated with:
status = StatusCode.UNAVAILABLE
details = "Socket closed"
debug_error_string = "UNKNOWN:Error received from peer ipv6:%5B::1%5D:33781 {grpc_message:"Socket closed", grpc_status:14, created_time:"2023-12-14T02:45:18.58549508+00:00"}"
>
> Task :sdks:python:test-suites:portable:py38:postCommitPy38
FAILURE: Build completed with 2 failures.
1: Task failed with an exception.
-----------
* Where:
Build file '<https://ci-beam.apache.org/job/beam_PostCommit_Python38/ws/src/sdks/python/build.gradle'> line: 97
* What went wrong:
Execution failed for task ':sdks:python:bdistPy38linux'.
> Process 'command 'sh'' finished with non-zero exit value 1
* Try:
> Run with --stacktrace option to get the stack trace.
> Run with --info or --debug option to get more log output.
> Get more help at https://help.gradle.org.
==============================================================================
2: Task failed with an exception.
-----------
* Where:
Script '<https://ci-beam.apache.org/job/beam_PostCommit_Python38/ws/src/sdks/python/test-suites/direct/common.gradle'> line: 52
* What went wrong:
Execution failed for task ':sdks:python:test-suites:direct:py38:postCommitIT'.
> Process 'command 'sh'' finished with non-zero exit value 1
* Try:
> Run with --stacktrace option to get the stack trace.
> Run with --info or --debug option to get more log output.
> Get more help at https://help.gradle.org.
==============================================================================
Deprecated Gradle features were used in this build, making it incompatible with Gradle 9.0.
You can use '--warning-mode all' to show the individual deprecation warnings and determine if they come from your own scripts or plugins.
For more on this, please refer to https://docs.gradle.org/8.4/userguide/command_line_interface.html#sec:command_line_warnings in the Gradle documentation.
BUILD FAILED in 29m 55s
221 actionable tasks: 156 executed, 61 from cache, 4 up-to-date
Publishing build scan...
https://ge.apache.org/s/vyjwvxlzmozfy
Build step 'Invoke Gradle script' changed build result to FAILURE
Build step 'Invoke Gradle script' marked build as failure
---------------------------------------------------------------------
To unsubscribe, e-mail: builds-unsubscribe@beam.apache.org
For additional commands, e-mail: builds-help@beam.apache.org
Build failed in Jenkins: beam_PostCommit_Python38 #4927
Posted by Apache Jenkins Server <je...@builds.apache.org>.
See <https://ci-beam.apache.org/job/beam_PostCommit_Python38/4927/display/redirect>
Changes:
------------------------------------------
[...truncated 11.12 MB...]
f"<regionId>/{self.result.job_id()}?project=<projectId>")
if not self.result.has_job:
_LOGGER.error(consoleUrl)
raise IOError('Failed to get the Dataflow job id.')
start_time = time.time()
while time.time() - start_time <= timeout:
job_state = self.result.state
if self.result.is_in_terminal_state() or job_state == expected_state:
return job_state
time.sleep(5)
_LOGGER.error(consoleUrl)
> raise RuntimeError(
'Timeout after %d seconds while waiting for job %s '
'enters expected state %s. Current state is %s.' %
(timeout, self.result.job_id(), expected_state, self.result.state))
[1m[31mE RuntimeError: Timeout after 600 seconds while waiting for job 2023-12-13_13_57_54-2580360574575040826 enters expected state RUNNING. Current state is PENDING.[0m
[1m[31mapache_beam/runners/dataflow/test_dataflow_runner.py[0m:103: RuntimeError
[33mDuring handling of the above exception, another exception occurred:[0m
self = <apache_beam.transforms.external_it_test.ExternalTransformIT testMethod=test_job_python_from_python_it>
@pytest.mark.it_postcommit
def test_job_python_from_python_it(self):
@ptransform.PTransform.register_urn('simple', None)
class SimpleTransform(ptransform.PTransform):
def expand(self, pcoll):
return pcoll | beam.Map(lambda x: 'Simple(%s)' % x)
def to_runner_api_parameter(self, unused_context):
return 'simple', None
@staticmethod
def from_runner_api_parameter(_0, _1, _2):
return SimpleTransform()
pipeline = TestPipeline(is_integration_test=True)
res = (
pipeline
| beam.Create(['a', 'b'])
| beam.ExternalTransform(
'simple', None, expansion_service.ExpansionServiceServicer()))
assert_that(res, equal_to(['Simple(a)', 'Simple(b)']))
proto_pipeline, _ = pipeline.to_runner_api(return_context=True)
pipeline_from_proto = Pipeline.from_runner_api(
proto_pipeline, pipeline.runner, pipeline._options)
> pipeline_from_proto.run().wait_until_finish()
[1m[31mapache_beam/transforms/external_it_test.py[0m:62:
_ _ _ _ _ _ _ _ _ _ _ _ _ _ _ _ _ _ _ _ _ _ _ _ _ _ _ _ _ _ _ _ _ _ _ _ _ _ _ _
[1m[31mapache_beam/pipeline.py[0m:559: in run
return Pipeline.from_runner_api(
[1m[31mapache_beam/pipeline.py[0m:586: in run
return self.runner.run_pipeline(self, self._options)
[1m[31mapache_beam/runners/dataflow/test_dataflow_runner.py[0m:73: in run_pipeline
self.result.cancel()
[1m[31mapache_beam/runners/dataflow/dataflow_runner.py[0m:802: in cancel
if not self._runner.dataflow_client.modify_job_state(
[1m[31mapache_beam/utils/retry.py[0m:275: in wrapper
return fun(*args, **kwargs)
[1m[31mapache_beam/runners/dataflow/internal/apiclient.py[0m:895: in modify_job_state
self._client.projects_locations_jobs.Update(request)
[1m[31mapache_beam/runners/dataflow/internal/clients/dataflow/dataflow_v1b3_client.py[0m:877: in Update
return self._RunMethod(config, request, global_params=global_params)
[1m[31m../../build/gradleenv/-1734967051/lib/python3.8/site-packages/apitools/base/py/base_api.py[0m:731: in _RunMethod
return self.ProcessHttpResponse(method_config, http_response, request)
[1m[31m../../build/gradleenv/-1734967051/lib/python3.8/site-packages/apitools/base/py/base_api.py[0m:737: in ProcessHttpResponse
self.__ProcessHttpResponse(method_config, http_response, request))
_ _ _ _ _ _ _ _ _ _ _ _ _ _ _ _ _ _ _ _ _ _ _ _ _ _ _ _ _ _ _ _ _ _ _ _ _ _ _ _
self = <apache_beam.runners.dataflow.internal.clients.dataflow.dataflow_v1b3_client.DataflowV1b3.ProjectsLocationsJobsService object at 0x7f4f4a0ad100>
method_config = <ApiMethodInfo
relative_path: 'v1b3/projects/{projectId}/locations/{location}/jobs/{jobId}'
method_id: 'dataflow.pro...DataflowProjectsLocationsJobsUpdateRequest'
response_type_name: 'Job'
request_field: 'job'
supports_download: False>
http_response = Response(info={'vary': 'Origin, X-Origin, Referer', 'content-type': 'application/json; charset=UTF-8', 'date': 'Wed, 1...pis.com/v1b3/projects/apache-beam-testing/locations/us-central1/jobs/2023-12-13_13_57_54-2580360574575040826?alt=json')
request = <DataflowProjectsLocationsJobsUpdateRequest
job: <Job
requestedState: RequestedStateValueValuesEnum(JOB_STATE_CANCEL...iles: []>
jobId: '2023-12-13_13_57_54-2580360574575040826'
location: 'us-central1'
projectId: 'apache-beam-testing'>
def __ProcessHttpResponse(self, method_config, http_response, request):
"""Process the given http response."""
if http_response.status_code not in (http_client.OK,
http_client.CREATED,
http_client.NO_CONTENT):
> raise exceptions.HttpError.FromResponse(
http_response, method_config=method_config, request=request)
[1m[31mE apitools.base.py.exceptions.HttpBadRequestError: HttpError accessing <https://dataflow.googleapis.com/v1b3/projects/apache-beam-testing/locations/us-central1/jobs/2023-12-13_13_57_54-2580360574575040826?alt=json>: response: <{'vary': 'Origin, X-Origin, Referer', 'content-type': 'application/json; charset=UTF-8', 'date': 'Wed, 13 Dec 2023 22:07:58 GMT', 'server': 'ESF', 'cache-control': 'private', 'x-xss-protection': '0', 'x-frame-options': 'SAMEORIGIN', 'x-content-type-options': 'nosniff', 'transfer-encoding': 'chunked', 'status': '400', 'content-length': '315', '-content-encoding': 'gzip'}>, content <{[0m
[1m[31mE "error": {[0m
[1m[31mE "code": 400,[0m
[1m[31mE "message": "(af73b5bcc5daf3d8): Workflow modification failed. Causes: (b8b552dc64d45c13): Operation cancel not allowed for job 2023-12-13_13_57_54-2580360574575040826. Job is not yet ready for canceling. Please retry in a few minutes.",[0m
[1m[31mE "status": "FAILED_PRECONDITION"[0m
[1m[31mE }[0m
[1m[31mE }[0m
[1m[31mE >[0m
[1m[31m../../build/gradleenv/-1734967051/lib/python3.8/site-packages/apitools/base/py/base_api.py[0m:603: HttpBadRequestError
------------------------------ Captured log call -------------------------------
[33mWARNING [0m apache_beam.options.pipeline_options:pipeline_options.py:339 Unknown pipeline options received: --sleep_secs=20,--kms_key_name=projects/apache-beam-testing/locations/global/keyRings/beam-it/cryptoKeys/test. Ignore if flags are used for internal purposes.
[32mINFO [0m root:pipeline.py:196 Missing pipeline option (runner). Executing pipeline using the default runner: DirectRunner.
[32mINFO [0m apache_beam.runners.portability.stager:stager.py:322 Copying Beam SDK "<https://ci-beam.apache.org/job/beam_PostCommit_Python38/ws/src/sdks/python/build/apache_beam-2.54.0.dev0-cp38-cp38-manylinux_2_17_x86_64.manylinux2014_x86_64.whl"> to staging location.
[32mINFO [0m apache_beam.runners.dataflow.dataflow_runner:dataflow_runner.py:395 Pipeline has additional dependencies to be installed in SDK worker container, consider using the SDK container image pre-building workflow to avoid repetitive installations. Learn more on https://cloud.google.com/dataflow/docs/guides/using-custom-containers#prebuild
[32mINFO [0m root:environments.py:314 Using provided Python SDK container image: gcr.io/cloud-dataflow/v1beta3/beam_python3.8_sdk:beam-master-20231212
[32mINFO [0m root:environments.py:321 Python SDK container image set to "gcr.io/cloud-dataflow/v1beta3/beam_python3.8_sdk:beam-master-20231212" for Docker environment
[32mINFO [0m apache_beam.runners.portability.fn_api_runner.translations:translations.py:712 ==================== <function pack_combiners at 0x7f4f128c3af0> ====================
[32mINFO [0m apache_beam.runners.portability.fn_api_runner.translations:translations.py:712 ==================== <function sort_stages at 0x7f4f128c2310> ====================
[32mINFO [0m apache_beam.runners.dataflow.internal.apiclient:apiclient.py:673 Starting GCS upload to gs://temp-storage-for-end-to-end-tests/staging-it/beamapp-jenkins-1213215753-878472-s6cek1q5.1702504673.878627/apache_beam-2.54.0.dev0-cp38-cp38-manylinux_2_17_x86_64.manylinux2014_x86_64.whl...
[32mINFO [0m apache_beam.runners.dataflow.internal.apiclient:apiclient.py:683 Completed GCS upload to gs://temp-storage-for-end-to-end-tests/staging-it/beamapp-jenkins-1213215753-878472-s6cek1q5.1702504673.878627/apache_beam-2.54.0.dev0-cp38-cp38-manylinux_2_17_x86_64.manylinux2014_x86_64.whl in 0 seconds.
[32mINFO [0m apache_beam.runners.dataflow.internal.apiclient:apiclient.py:673 Starting GCS upload to gs://temp-storage-for-end-to-end-tests/staging-it/beamapp-jenkins-1213215753-878472-s6cek1q5.1702504673.878627/pipeline.pb...
[32mINFO [0m apache_beam.runners.dataflow.internal.apiclient:apiclient.py:683 Completed GCS upload to gs://temp-storage-for-end-to-end-tests/staging-it/beamapp-jenkins-1213215753-878472-s6cek1q5.1702504673.878627/pipeline.pb in 0 seconds.
[33mWARNING [0m apache_beam.options.pipeline_options:pipeline_options.py:339 Unknown pipeline options received: --sleep_secs=20,--kms_key_name=projects/apache-beam-testing/locations/global/keyRings/beam-it/cryptoKeys/test. Ignore if flags are used for internal purposes.
[33mWARNING [0m apache_beam.options.pipeline_options:pipeline_options.py:339 Unknown pipeline options received: --sleep_secs=20,--kms_key_name=projects/apache-beam-testing/locations/global/keyRings/beam-it/cryptoKeys/test. Ignore if flags are used for internal purposes.
[32mINFO [0m apache_beam.runners.dataflow.internal.apiclient:apiclient.py:854 Create job: <Job
clientRequestId: '20231213215753879518-3438'
createTime: '2023-12-13T21:57:55.097093Z'
currentStateTime: '1970-01-01T00:00:00Z'
id: '2023-12-13_13_57_54-2580360574575040826'
location: 'us-central1'
name: 'beamapp-jenkins-1213215753-878472-s6cek1q5'
projectId: 'apache-beam-testing'
stageStates: []
startTime: '2023-12-13T21:57:55.097093Z'
steps: []
tempFiles: []
type: TypeValueValuesEnum(JOB_TYPE_BATCH, 1)>
[32mINFO [0m apache_beam.runners.dataflow.internal.apiclient:apiclient.py:856 Created job with id: [2023-12-13_13_57_54-2580360574575040826]
[32mINFO [0m apache_beam.runners.dataflow.internal.apiclient:apiclient.py:857 Submitted job: 2023-12-13_13_57_54-2580360574575040826
[32mINFO [0m apache_beam.runners.dataflow.internal.apiclient:apiclient.py:858 To access the Dataflow monitoring console, please navigate to https://console.cloud.google.com/dataflow/jobs/us-central1/2023-12-13_13_57_54-2580360574575040826?project=apache-beam-testing
[32mINFO [0m apache_beam.runners.dataflow.test_dataflow_runner:test_dataflow_runner.py:58 Console log:
[32mINFO [0m apache_beam.runners.dataflow.test_dataflow_runner:test_dataflow_runner.py:59 https://console.cloud.google.com/dataflow/jobs/us-central1/2023-12-13_13_57_54-2580360574575040826?project=apache-beam-testing
[1m[31mERROR [0m apache_beam.runners.dataflow.test_dataflow_runner:test_dataflow_runner.py:102 Console URL: https://console.cloud.google.com/dataflow/<regionId>/2023-12-13_13_57_54-2580360574575040826?project=<projectId>
[33m=============================== warnings summary ===============================[0m
apache_beam/io/gcp/bigquery_read_it_test.py::ReadTests::test_native_source
<https://ci-beam.apache.org/job/beam_PostCommit_Python38/ws/src/sdks/python/apache_beam/io/gcp/bigquery_read_it_test.py>:170: BeamDeprecationWarning: BigQuerySource is deprecated since 2.25.0. Use ReadFromBigQuery instead.
beam.io.BigQuerySource(query=self.query, use_standard_sql=True)))
apache_beam/io/gcp/bigquery_test.py::PubSubBigQueryIT::test_file_loads
apache_beam/io/gcp/bigquery_test.py::PubSubBigQueryIT::test_streaming_inserts
apache_beam/examples/complete/game/game_stats_it_test.py::GameStatsIT::test_game_stats_it
apache_beam/examples/complete/game/leader_board_it_test.py::LeaderBoardIT::test_leader_board_it
apache_beam/examples/complete/game/hourly_team_score_it_test.py::HourlyTeamScoreIT::test_hourly_team_score_it
<https://ci-beam.apache.org/job/beam_PostCommit_Python38/ws/src/sdks/python/apache_beam/io/gcp/tests/utils.py>:63: PendingDeprecationWarning: Client.dataset is deprecated and will be removed in a future version. Use a string like 'my_project.my_dataset' or a cloud.google.bigquery.DatasetReference object, instead.
dataset_ref = client.dataset(unique_dataset_name, project=project)
apache_beam/examples/cookbook/bigquery_tornadoes_it_test.py::BigqueryTornadoesIT::test_bigquery_tornadoes_it
<https://ci-beam.apache.org/job/beam_PostCommit_Python38/ws/src/sdks/python/apache_beam/io/gcp/tests/utils.py>:100: PendingDeprecationWarning: Client.dataset is deprecated and will be removed in a future version. Use a string like 'my_project.my_dataset' or a cloud.google.bigquery.DatasetReference object, instead.
table_ref = client.dataset(dataset_id).table(table_id)
apache_beam/examples/dataframe/flight_delays_it_test.py::FlightDelaysTest::test_flight_delays
<https://ci-beam.apache.org/job/beam_PostCommit_Python38/ws/src/sdks/python/apache_beam/examples/dataframe/flight_delays.py>:47: FutureWarning: The default value of numeric_only in DataFrame.mean is deprecated. In a future version, it will default to False. In addition, specifying 'numeric_only=None' is deprecated. Select only valid columns or specify the value of numeric_only to silence this warning.
return airline_df[at_top_airports].mean()
apache_beam/io/gcp/bigquery_read_it_test.py::ReadNewTypesTests::test_native_source
<https://ci-beam.apache.org/job/beam_PostCommit_Python38/ws/src/sdks/python/apache_beam/io/gcp/bigquery_read_it_test.py>:706: BeamDeprecationWarning: BigQuerySource is deprecated since 2.25.0. Use ReadFromBigQuery instead.
beam.io.BigQuerySource(query=self.query, use_standard_sql=True)))
-- Docs: https://docs.pytest.org/en/stable/how-to/capture-warnings.html
- generated xml file: <https://ci-beam.apache.org/job/beam_PostCommit_Python38/ws/src/sdks/python/pytest_postCommitIT-df-py38.xml> -
[36m[1m=========================== short test summary info ============================[0m
[31mFAILED[0m apache_beam/io/gcp/bigquery_write_it_test.py::[1mBigQueryWriteIntegrationTests::test_big_query_write_without_schema[0m - apitools.base.py.exceptions.HttpBadRequestError: HttpError accessing <https://dataflow.googleapis.com/v1b3/projects/apache-beam-testing/locations/us-central1/jobs/2023-12-13_13_28_01-9307374806411550079?alt=json>: response: <{'vary': 'Origin, X-Origin, Referer', 'content-type': 'application/json; charset=UTF-8', 'date': 'Wed, 13 Dec 2023 21:38:06 GMT', 'server': 'ESF', 'cache-control': 'private', 'x-xss-protection': '0', 'x-frame-options': 'SAMEORIGIN', 'x-content-type-options': 'nosniff', 'transfer-encoding': 'chunked', 'status': '400', 'content-length': '315', '-content-encoding': 'gzip'}>, content <{
"error": {
"code": 400,
"message": "(ff2d340c54a70cc5): Workflow modification failed. Causes: (ab5fe8a3a3d69613): Operation cancel not allowed for job 2023-12-13_13_28_01-9307374806411550079. Job is not yet ready for canceling. Please retry in a few minutes.",
"status": "FAILED_PRECONDITION"
}
}
>
[31mFAILED[0m apache_beam/transforms/external_it_test.py::[1mExternalTransformIT::test_job_python_from_python_it[0m - apitools.base.py.exceptions.HttpBadRequestError: HttpError accessing <https://dataflow.googleapis.com/v1b3/projects/apache-beam-testing/locations/us-central1/jobs/2023-12-13_13_57_54-2580360574575040826?alt=json>: response: <{'vary': 'Origin, X-Origin, Referer', 'content-type': 'application/json; charset=UTF-8', 'date': 'Wed, 13 Dec 2023 22:07:58 GMT', 'server': 'ESF', 'cache-control': 'private', 'x-xss-protection': '0', 'x-frame-options': 'SAMEORIGIN', 'x-content-type-options': 'nosniff', 'transfer-encoding': 'chunked', 'status': '400', 'content-length': '315', '-content-encoding': 'gzip'}>, content <{
"error": {
"code": 400,
"message": "(af73b5bcc5daf3d8): Workflow modification failed. Causes: (b8b552dc64d45c13): Operation cancel not allowed for job 2023-12-13_13_57_54-2580360574575040826. Job is not yet ready for canceling. Please retry in a few minutes.",
"status": "FAILED_PRECONDITION"
}
}
>
[31m====== [31m[1m2 failed[0m, [32m81 passed[0m, [33m48 skipped[0m, [33m9 warnings[0m[31m in 6041.32s (1:40:41)[0m[31m =======[0m
> Task :sdks:python:test-suites:dataflow:py38:postCommitIT FAILED
FAILURE: Build completed with 3 failures.
1: Task failed with an exception.
-----------
* Where:
Script '<https://ci-beam.apache.org/job/beam_PostCommit_Python38/ws/src/sdks/python/test-suites/portable/common.gradle'> line: 326
* What went wrong:
Execution failed for task ':sdks:python:test-suites:portable:py38:postCommitPy38IT'.
> Process 'command 'sh'' finished with non-zero exit value 1
* Try:
> Run with --stacktrace option to get the stack trace.
> Run with --info or --debug option to get more log output.
> Get more help at https://help.gradle.org.
==============================================================================
2: Task failed with an exception.
-----------
* Where:
Script '<https://ci-beam.apache.org/job/beam_PostCommit_Python38/ws/src/sdks/python/test-suites/direct/common.gradle'> line: 52
* What went wrong:
Execution failed for task ':sdks:python:test-suites:direct:py38:postCommitIT'.
> Process 'command 'sh'' finished with non-zero exit value 1
* Try:
> Run with --stacktrace option to get the stack trace.
> Run with --info or --debug option to get more log output.
> Get more help at https://help.gradle.org.
==============================================================================
3: Task failed with an exception.
-----------
* Where:
Script '<https://ci-beam.apache.org/job/beam_PostCommit_Python38/ws/src/sdks/python/test-suites/dataflow/common.gradle'> line: 139
* What went wrong:
Execution failed for task ':sdks:python:test-suites:dataflow:py38:postCommitIT'.
> Process 'command 'sh'' finished with non-zero exit value 1
* Try:
> Run with --stacktrace option to get the stack trace.
> Run with --info or --debug option to get more log output.
> Get more help at https://help.gradle.org.
==============================================================================
Deprecated Gradle features were used in this build, making it incompatible with Gradle 9.0.
You can use '--warning-mode all' to show the individual deprecation warnings and determine if they come from your own scripts or plugins.
For more on this, please refer to https://docs.gradle.org/8.4/userguide/command_line_interface.html#sec:command_line_warnings in the Gradle documentation.
BUILD FAILED in 2h 28m 1s
224 actionable tasks: 170 executed, 50 from cache, 4 up-to-date
Publishing build scan...
https://ge.apache.org/s/j56cgm3kvspyo
Build step 'Invoke Gradle script' changed build result to FAILURE
Build step 'Invoke Gradle script' marked build as failure
---------------------------------------------------------------------
To unsubscribe, e-mail: builds-unsubscribe@beam.apache.org
For additional commands, e-mail: builds-help@beam.apache.org
Build failed in Jenkins: beam_PostCommit_Python38 #4926
Posted by Apache Jenkins Server <je...@builds.apache.org>.
See <https://ci-beam.apache.org/job/beam_PostCommit_Python38/4926/display/redirect>
Changes:
------------------------------------------
[...truncated 6.69 MB...]
target=lambda: self._read_inputs(elements_iterator),
File "<https://ci-beam.apache.org/job/beam_PostCommit_Python38/ws/src/sdks/python/apache_beam/runners/worker/data_plane.py",> line 669, in _read_inputs
for elements in elements_iterator:
File "<https://ci-beam.apache.org/job/beam_PostCommit_Python38/ws/src/build/gradleenv/2022703442/lib/python3.8/site-packages/grpc/_channel.py",> line 540, in __next__
return self._next()
File "<https://ci-beam.apache.org/job/beam_PostCommit_Python38/ws/src/build/gradleenv/2022703442/lib/python3.8/site-packages/grpc/_channel.py",> line 966, in _next
raise self
grpc._channel._MultiThreadedRendezvous: <_MultiThreadedRendezvous of RPC that terminated with:
status = StatusCode.CANCELLED
details = "Multiplexer hanging up"
debug_error_string = "UNKNOWN:Error received from peer ipv6:%5B::1%5D:45107 {created_time:"2023-12-13T14:43:32.416006005+00:00", grpc_status:1, grpc_message:"Multiplexer hanging up"}"
>
warnings.warn(pytest.PytestUnhandledThreadExceptionWarning(msg))
apache_beam/io/external/xlang_kafkaio_it_test.py::CrossLanguageKafkaIOTest::test_local_kafkaio_null_key
<https://ci-beam.apache.org/job/beam_PostCommit_Python38/ws/src/build/gradleenv/2022703442/lib/python3.8/site-packages/_pytest/threadexception.py>:73: PytestUnhandledThreadExceptionWarning: Exception in thread read_grpc_client_inputs
Traceback (most recent call last):
File "/usr/lib/python3.8/threading.py", line 932, in _bootstrap_inner
self.run()
File "/usr/lib/python3.8/threading.py", line 870, in run
self._target(*self._args, **self._kwargs)
File "<https://ci-beam.apache.org/job/beam_PostCommit_Python38/ws/src/sdks/python/apache_beam/runners/worker/data_plane.py",> line 686, in <lambda>
target=lambda: self._read_inputs(elements_iterator),
File "<https://ci-beam.apache.org/job/beam_PostCommit_Python38/ws/src/sdks/python/apache_beam/runners/worker/data_plane.py",> line 669, in _read_inputs
for elements in elements_iterator:
File "<https://ci-beam.apache.org/job/beam_PostCommit_Python38/ws/src/build/gradleenv/2022703442/lib/python3.8/site-packages/grpc/_channel.py",> line 540, in __next__
return self._next()
File "<https://ci-beam.apache.org/job/beam_PostCommit_Python38/ws/src/build/gradleenv/2022703442/lib/python3.8/site-packages/grpc/_channel.py",> line 966, in _next
raise self
grpc._channel._MultiThreadedRendezvous: <_MultiThreadedRendezvous of RPC that terminated with:
status = StatusCode.CANCELLED
details = "Multiplexer hanging up"
debug_error_string = "UNKNOWN:Error received from peer ipv6:%5B::1%5D:41391 {created_time:"2023-12-13T14:46:03.91309529+00:00", grpc_status:1, grpc_message:"Multiplexer hanging up"}"
>
warnings.warn(pytest.PytestUnhandledThreadExceptionWarning(msg))
apache_beam/io/external/xlang_kinesisio_it_test.py::CrossLanguageKinesisIOTest::test_kinesis_write
<https://ci-beam.apache.org/job/beam_PostCommit_Python38/ws/src/build/gradleenv/2022703442/lib/python3.8/site-packages/_pytest/threadexception.py>:73: PytestUnhandledThreadExceptionWarning: Exception in thread read_grpc_client_inputs
Traceback (most recent call last):
File "/usr/lib/python3.8/threading.py", line 932, in _bootstrap_inner
self.run()
File "/usr/lib/python3.8/threading.py", line 870, in run
self._target(*self._args, **self._kwargs)
File "<https://ci-beam.apache.org/job/beam_PostCommit_Python38/ws/src/sdks/python/apache_beam/runners/worker/data_plane.py",> line 686, in <lambda>
target=lambda: self._read_inputs(elements_iterator),
File "<https://ci-beam.apache.org/job/beam_PostCommit_Python38/ws/src/sdks/python/apache_beam/runners/worker/data_plane.py",> line 669, in _read_inputs
for elements in elements_iterator:
File "<https://ci-beam.apache.org/job/beam_PostCommit_Python38/ws/src/build/gradleenv/2022703442/lib/python3.8/site-packages/grpc/_channel.py",> line 540, in __next__
return self._next()
File "<https://ci-beam.apache.org/job/beam_PostCommit_Python38/ws/src/build/gradleenv/2022703442/lib/python3.8/site-packages/grpc/_channel.py",> line 966, in _next
raise self
grpc._channel._MultiThreadedRendezvous: <_MultiThreadedRendezvous of RPC that terminated with:
status = StatusCode.CANCELLED
details = "Multiplexer hanging up"
debug_error_string = "UNKNOWN:Error received from peer ipv6:%5B::1%5D:46775 {created_time:"2023-12-13T14:47:22.899570492+00:00", grpc_status:1, grpc_message:"Multiplexer hanging up"}"
>
warnings.warn(pytest.PytestUnhandledThreadExceptionWarning(msg))
-- Docs: https://docs.pytest.org/en/stable/how-to/capture-warnings.html
- generated xml file: <https://ci-beam.apache.org/job/beam_PostCommit_Python38/ws/src/sdks/python/pytest_postCommitIT-flink-py38.xml> -
=========================== short test summary info ============================
FAILED apache_beam/io/external/xlang_jdbcio_it_test.py::CrossLanguageJdbcIOTest::test_xlang_jdbc_write_read_0_postgres - RuntimeError: Pipeline BeamApp-jenkins-1213144312-e9c8d1a1_fe0f14b1-7fe6-4f2e-94cd-63ad0e1f4e1d failed in state FAILED: java.lang.RuntimeException: Error received from SDK harness for instruction 32: Traceback (most recent call last):
File "<https://ci-beam.apache.org/job/beam_PostCommit_Python38/ws/src/sdks/python/apache_beam/runners/worker/bundle_processor.py",> line 231, in process_encoded
decoded_value = self.windowed_coder_impl.decode_from_stream(
File "apache_beam/coders/coder_impl.py", line 1469, in apache_beam.coders.coder_impl.WindowedValueCoderImpl.decode_from_stream
def decode_from_stream(self, in_stream, nested):
File "apache_beam/coders/coder_impl.py", line 1488, in apache_beam.coders.coder_impl.WindowedValueCoderImpl.decode_from_stream
value = self._value_coder.decode_from_stream(in_stream, nested)
File "apache_beam/coders/coder_impl.py", line 1837, in apache_beam.coders.coder_impl.RowCoderImpl.decode_from_stream
item = component_coder.decode_from_stream(in_stream, True)
File "apache_beam/coders/coder_impl.py", line 1890, in apache_beam.coders.coder_impl.LogicalTypeCoderImpl.decode_from_stream
return self.logical_type.to_language_type(
File "<https://ci-beam.apache.org/job/beam_PostCommit_Python38/ws/src/sdks/python/apache_beam/typehints/schemas.py",> line 1000, in to_language_type
return DecimalLogicalType().to_language_type(value)
File "<https://ci-beam.apache.org/job/beam_PostCommit_Python38/ws/src/sdks/python/apache_beam/typehints/schemas.py",> line 962, in to_language_type
return decimal.Decimal(value.decode())
AttributeError: 'decimal.Decimal' object has no attribute 'decode'
The above exception was the direct cause of the following exception:
Traceback (most recent call last):
Traceback (most recent call last):
File "<https://ci-beam.apache.org/job/beam_PostCommit_Python38/ws/src/sdks/python/apache_beam/runners/worker/sdk_worker.py",> line 300, in _execute
File "<https://ci-beam.apache.org/job/beam_PostCommit_Python38/ws/src/sdks/python/apache_beam/runners/worker/bundle_processor.py",> line 231, in process_encoded
decoded_value = self.windowed_coder_impl.decode_from_stream(
File "apache_beam/coders/coder_impl.py", line 1469, in apache_beam.coders.coder_impl.WindowedValueCoderImpl.decode_from_stream
def decode_from_stream(self, in_stream, nested):
response = task()
File "<https://ci-beam.apache.org/job/beam_PostCommit_Python38/ws/src/sdks/python/apache_beam/runners/worker/sdk_worker.py",> line 375, in <lambda>
lambda: self.create_worker().do_instruction(request), request)
File "<https://ci-beam.apache.org/job/beam_PostCommit_Python38/ws/src/sdks/python/apache_beam/runners/worker/sdk_worker.py",> line 632, in do_instruction
return getattr(self, request_type)(
File "apache_beam/coders/coder_impl.py", line 1488, in apache_beam.coders.coder_impl.WindowedValueCoderImpl.decode_from_stream
value = self._value_coder.decode_from_stream(in_stream, nested)
File "<https://ci-beam.apache.org/job/beam_PostCommit_Python38/ws/src/sdks/python/apache_beam/runners/worker/sdk_worker.py",> line 670, in process_bundle
bundle_processor.process_bundle(instruction_id))
File "<https://ci-beam.apache.org/job/beam_PostCommit_Python38/ws/src/sdks/python/apache_beam/runners/worker/bundle_processor.py",> line 1113, in process_bundle
input_op_by_transform_id[element.transform_id].process_encoded(
File "<https://ci-beam.apache.org/job/beam_PostCommit_Python38/ws/src/sdks/python/apache_beam/runners/worker/bundle_processor.py",> line 234, in process_encoded
File "apache_beam/coders/coder_impl.py", line 1837, in apache_beam.coders.coder_impl.RowCoderImpl.decode_from_stream
raise ValueError(
ValueError: Error decoding input stream with coder WindowedValueCoder[RowCoder]
======= 1 failed, 19 passed, 7 skipped, 4 warnings in 734.38s (0:12:14) ========
item = component_coder.decode_from_stream(in_stream, True)
File "apache_beam/coders/coder_impl.py", line 1890, in apache_beam.coders.coder_impl.LogicalTypeCoderImpl.decode_from_stream
return self.logical_type.to_language_type(
File "<https://ci-beam.apache.org/job/beam_PostCommit_Python38/ws/src/sdks/python/apache_beam/typehints/schemas.py",> line 1000, in to_language_type
return DecimalLogicalType().to_language_type(value)
File "<https://ci-beam.apache.org/job/beam_PostCommit_Python38/ws/src/sdks/python/apache_beam/typehints/schemas.py",> line 962, in to_language_type
return decimal.Decimal(value.decode())
AttributeError: 'decimal.Decimal' object has no attribute 'decode'
The above exception was the direct cause of the following exception:
Traceback (most recent call last):
File "<https://ci-beam.apache.org/job/beam_PostCommit_Python38/ws/src/sdks/python/apache_beam/runners/worker/sdk_worker.py",> line 300, in _execute
response = task()
File "<https://ci-beam.apache.org/job/beam_PostCommit_Python38/ws/src/sdks/python/apache_beam/runners/worker/sdk_worker.py",> line 375, in <lambda>
lambda: self.create_worker().do_instruction(request), request)
File "<https://ci-beam.apache.org/job/beam_PostCommit_Python38/ws/src/sdks/python/apache_beam/runners/worker/sdk_worker.py",> line 632, in do_instruction
return getattr(self, request_type)(
File "<https://ci-beam.apache.org/job/beam_PostCommit_Python38/ws/src/sdks/python/apache_beam/runners/worker/sdk_worker.py",> line 670, in process_bundle
bundle_processor.process_bundle(instruction_id))
File "<https://ci-beam.apache.org/job/beam_PostCommit_Python38/ws/src/sdks/python/apache_beam/runners/worker/bundle_processor.py",> line 1113, in process_bundle
input_op_by_transform_id[element.transform_id].process_encoded(
File "<https://ci-beam.apache.org/job/beam_PostCommit_Python38/ws/src/sdks/python/apache_beam/runners/worker/bundle_processor.py",> line 234, in process_encoded
raise ValueError(
ValueError: Error decoding input stream with coder WindowedValueCoder[RowCoder]
Traceback (most recent call last):
File "<https://ci-beam.apache.org/job/beam_PostCommit_Python38/ws/src/sdks/python/apache_beam/runners/worker/bundle_processor.py",> line 231, in process_encoded
decoded_value = self.windowed_coder_impl.decode_from_stream(
File "apache_beam/coders/coder_impl.py", line 1469, in apache_beam.coders.coder_impl.WindowedValueCoderImpl.decode_from_stream
def decode_from_stream(self, in_stream, nested):
File "apache_beam/coders/coder_impl.py", line 1488, in apache_beam.coders.coder_impl.WindowedValueCoderImpl.decode_from_stream
value = self._value_coder.decode_from_stream(in_stream, nested)
File "apache_beam/coders/coder_impl.py", line 1837, in apache_beam.coders.coder_impl.RowCoderImpl.decode_from_stream
item = component_coder.decode_from_stream(in_stream, True)
File "apache_beam/coders/coder_impl.py", line 1890, in apache_beam.coders.coder_impl.LogicalTypeCoderImpl.decode_from_stream
return self.logical_type.to_language_type(
File "<https://ci-beam.apache.org/job/beam_PostCommit_Python38/ws/src/sdks/python/apache_beam/typehints/schemas.py",> line 1000, in to_language_type
return DecimalLogicalType().to_language_type(value)
File "<https://ci-beam.apache.org/job/beam_PostCommit_Python38/ws/src/sdks/python/apache_beam/typehints/schemas.py",> line 962, in to_language_type
return decimal.Decimal(value.decode())
AttributeError: 'decimal.Decimal' object has no attribute 'decode'
The above exception was the direct cause of the following exception:
Traceback (most recent call last):
File "<https://ci-beam.apache.org/job/beam_PostCommit_Python38/ws/src/sdks/python/apache_beam/runners/worker/sdk_worker.py",> line 300, in _execute
response = task()
File "<https://ci-beam.apache.org/job/beam_PostCommit_Python38/ws/src/sdks/python/apache_beam/runners/worker/sdk_worker.py",> line 375, in <lambda>
lambda: self.create_worker().do_instruction(request), request)
File "<https://ci-beam.apache.org/job/beam_PostCommit_Python38/ws/src/sdks/python/apache_beam/runners/worker/sdk_worker.py",> line 632, in do_instruction
return getattr(self, request_type)(
File "<https://ci-beam.apache.org/job/beam_PostCommit_Python38/ws/src/sdks/python/apache_beam/runners/worker/sdk_worker.py",> line 670, in process_bundle
bundle_processor.process_bundle(instruction_id))
File "<https://ci-beam.apache.org/job/beam_PostCommit_Python38/ws/src/sdks/python/apache_beam/runners/worker/bundle_processor.py",> line 1113, in process_bundle
input_op_by_transform_id[element.transform_id].process_encoded(
File "<https://ci-beam.apache.org/job/beam_PostCommit_Python38/ws/src/sdks/python/apache_beam/runners/worker/bundle_processor.py",> line 234, in process_encoded
raise ValueError(
ValueError: Error decoding input stream with coder WindowedValueCoder[RowCoder]
> Task :sdks:python:test-suites:portable:py38:postCommitPy38IT FAILED
> Task :sdks:python:test-suites:dataflow:py38:inferencePostCommitIT
> Task :sdks:python:test-suites:dataflow:py38:postCommitIT
2023-12-13 15:03:31.831460: I tensorflow/tsl/cuda/cudart_stub.cc:28] Could not find cuda drivers on your machine, GPU will not be used.
2023-12-13 15:03:31.831460: I tensorflow/tsl/cuda/cudart_stub.cc:28] Could not find cuda drivers on your machine, GPU will not be used.
2023-12-13 15:03:31.831458: I tensorflow/tsl/cuda/cudart_stub.cc:28] Could not find cuda drivers on your machine, GPU will not be used.
2023-12-13 15:03:31.895286: I tensorflow/tsl/cuda/cudart_stub.cc:28] Could not find cuda drivers on your machine, GPU will not be used.
2023-12-13 15:03:31.898656: I tensorflow/tsl/cuda/cudart_stub.cc:28] Could not find cuda drivers on your machine, GPU will not be used.
2023-12-13 15:03:31.898662: I tensorflow/tsl/cuda/cudart_stub.cc:28] Could not find cuda drivers on your machine, GPU will not be used.
2023-12-13 15:03:31.899416: I tensorflow/core/platform/cpu_feature_guard.cc:182] This TensorFlow binary is optimized to use available CPU instructions in performance-critical operations.
To enable the following instructions: AVX2 FMA, in other operations, rebuild TensorFlow with the appropriate compiler flags.
2023-12-13 15:03:31.899429: I tensorflow/tsl/cuda/cudart_stub.cc:28] Could not find cuda drivers on your machine, GPU will not be used.
2023-12-13 15:03:31.899440: I tensorflow/core/platform/cpu_feature_guard.cc:182] This TensorFlow binary is optimized to use available CPU instructions in performance-critical operations.
To enable the following instructions: AVX2 FMA, in other operations, rebuild TensorFlow with the appropriate compiler flags.
2023-12-13 15:03:31.900221: I tensorflow/core/platform/cpu_feature_guard.cc:182] This TensorFlow binary is optimized to use available CPU instructions in performance-critical operations.
To enable the following instructions: AVX2 FMA, in other operations, rebuild TensorFlow with the appropriate compiler flags.
2023-12-13 15:03:31.963535: I tensorflow/tsl/cuda/cudart_stub.cc:28] Could not find cuda drivers on your machine, GPU will not be used.
2023-12-13 15:03:31.964691: I tensorflow/tsl/cuda/cudart_stub.cc:28] Could not find cuda drivers on your machine, GPU will not be used.
2023-12-13 15:03:31.969203: I tensorflow/tsl/cuda/cudart_stub.cc:28] Could not find cuda drivers on your machine, GPU will not be used.
2023-12-13 15:03:31.975237: I tensorflow/tsl/cuda/cudart_stub.cc:28] Could not find cuda drivers on your machine, GPU will not be used.
2023-12-13 15:03:31.993423: I tensorflow/tsl/cuda/cudart_stub.cc:28] Could not find cuda drivers on your machine, GPU will not be used.
2023-12-13 15:03:31.994302: I tensorflow/core/platform/cpu_feature_guard.cc:182] This TensorFlow binary is optimized to use available CPU instructions in performance-critical operations.
To enable the following instructions: AVX2 FMA, in other operations, rebuild TensorFlow with the appropriate compiler flags.
2023-12-13 15:03:32.030212: I tensorflow/tsl/cuda/cudart_stub.cc:28] Could not find cuda drivers on your machine, GPU will not be used.
2023-12-13 15:03:32.030956: I tensorflow/core/platform/cpu_feature_guard.cc:182] This TensorFlow binary is optimized to use available CPU instructions in performance-critical operations.
To enable the following instructions: AVX2 FMA, in other operations, rebuild TensorFlow with the appropriate compiler flags.
2023-12-13 15:03:32.035725: I tensorflow/tsl/cuda/cudart_stub.cc:28] Could not find cuda drivers on your machine, GPU will not be used.
2023-12-13 15:03:32.036488: I tensorflow/core/platform/cpu_feature_guard.cc:182] This TensorFlow binary is optimized to use available CPU instructions in performance-critical operations.
To enable the following instructions: AVX2 FMA, in other operations, rebuild TensorFlow with the appropriate compiler flags.
2023-12-13 15:03:32.062859: I tensorflow/tsl/cuda/cudart_stub.cc:28] Could not find cuda drivers on your machine, GPU will not be used.
2023-12-13 15:03:32.063776: I tensorflow/core/platform/cpu_feature_guard.cc:182] This TensorFlow binary is optimized to use available CPU instructions in performance-critical operations.
To enable the following instructions: AVX2 FMA, in other operations, rebuild TensorFlow with the appropriate compiler flags.
2023-12-13 15:03:32.073548: I tensorflow/tsl/cuda/cudart_stub.cc:28] Could not find cuda drivers on your machine, GPU will not be used.
2023-12-13 15:03:32.074458: I tensorflow/core/platform/cpu_feature_guard.cc:182] This TensorFlow binary is optimized to use available CPU instructions in performance-critical operations.
To enable the following instructions: AVX2 FMA, in other operations, rebuild TensorFlow with the appropriate compiler flags.
2023-12-13 15:03:32.980836: W tensorflow/compiler/tf2tensorrt/utils/py_utils.cc:38] TF-TRT Warning: Could not find TensorRT
2023-12-13 15:03:32.988787: W tensorflow/compiler/tf2tensorrt/utils/py_utils.cc:38] TF-TRT Warning: Could not find TensorRT
2023-12-13 15:03:33.071105: W tensorflow/compiler/tf2tensorrt/utils/py_utils.cc:38] TF-TRT Warning: Could not find TensorRT
2023-12-13 15:03:33.101050: W tensorflow/compiler/tf2tensorrt/utils/py_utils.cc:38] TF-TRT Warning: Could not find TensorRT
2023-12-13 15:03:33.127927: W tensorflow/compiler/tf2tensorrt/utils/py_utils.cc:38] TF-TRT Warning: Could not find TensorRT
2023-12-13 15:03:33.321225: W tensorflow/compiler/tf2tensorrt/utils/py_utils.cc:38] TF-TRT Warning: Could not find TensorRT
2023-12-13 15:03:33.329892: W tensorflow/compiler/tf2tensorrt/utils/py_utils.cc:38] TF-TRT Warning: Could not find TensorRT
2023-12-13 15:03:33.668067: W tensorflow/compiler/tf2tensorrt/utils/py_utils.cc:38] TF-TRT Warning: Could not find TensorRT
<https://ci-beam.apache.org/job/beam_PostCommit_Python38/ws/src/build/gradleenv/-1734967051/bin/python3.8>: No module named build
warning: sdist: standard file not found: should have one of README, README.rst, README.txt, README.md
warning: check: missing required meta-data: url
warning: check: missing meta-data: either (author and author_email) or (maintainer and maintainer_email) must be supplied
FAILURE: Build failed with an exception.
* Where:
Script '<https://ci-beam.apache.org/job/beam_PostCommit_Python38/ws/src/sdks/python/test-suites/portable/common.gradle'> line: 326
* What went wrong:
Execution failed for task ':sdks:python:test-suites:portable:py38:postCommitPy38IT'.
> Process 'command 'sh'' finished with non-zero exit value 1
* Try:
> Run with --stacktrace option to get the stack trace.
> Run with --info or --debug option to get more log output.
> Get more help at https://help.gradle.org.
Deprecated Gradle features were used in this build, making it incompatible with Gradle 9.0.
You can use '--warning-mode all' to show the individual deprecation warnings and determine if they come from your own scripts or plugins.
For more on this, please refer to https://docs.gradle.org/8.4/userguide/command_line_interface.html#sec:command_line_warnings in the Gradle documentation.
BUILD FAILED in 2h 28m 59s
224 actionable tasks: 206 executed, 14 from cache, 4 up-to-date
Publishing build scan...
https://ge.apache.org/s/b53anyjbfln7m
Build step 'Invoke Gradle script' changed build result to FAILURE
Build step 'Invoke Gradle script' marked build as failure
---------------------------------------------------------------------
To unsubscribe, e-mail: builds-unsubscribe@beam.apache.org
For additional commands, e-mail: builds-help@beam.apache.org
Build failed in Jenkins: beam_PostCommit_Python38 #4925
Posted by Apache Jenkins Server <je...@builds.apache.org>.
See <https://ci-beam.apache.org/job/beam_PostCommit_Python38/4925/display/redirect?page=changes>
Changes:
[noreply] fix: optimize segment reader (#29694)
------------------------------------------
[...truncated 13.05 MB...]
[gw4] [33mSKIPPED[0m apache_beam/io/gcp/bigquery_file_loads_test.py::BigQueryFileLoadsIT::test_bqfl_streaming_with_copy_jobs
apache_beam/io/gcp/bigquery_file_loads_test.py::BigQueryFileLoadsIT::test_bqfl_streaming_with_dynamic_destinations
[gw4] [33mSKIPPED[0m apache_beam/io/gcp/bigquery_file_loads_test.py::BigQueryFileLoadsIT::test_bqfl_streaming_with_dynamic_destinations
apache_beam/io/gcp/bigquery_file_loads_test.py::BigQueryFileLoadsIT::test_multiple_destinations_transform
[gw1] [32mPASSED[0m apache_beam/io/gcp/gcsfilesystem_integration_test.py::GcsFileSystemIntegrationTest::test_rename
apache_beam/io/gcp/gcsfilesystem_integration_test.py::GcsFileSystemIntegrationTest::test_rename_error
[gw1] [32mPASSED[0m apache_beam/io/gcp/gcsfilesystem_integration_test.py::GcsFileSystemIntegrationTest::test_rename_error
apache_beam/ml/gcp/recommendations_ai_test_it.py::RecommendationAIIT::test_create_catalog_item
[gw0] [32mPASSED[0m apache_beam/io/gcp/bigquery_read_it_test.py::ReadTests::test_iobase_source
apache_beam/io/gcp/bigquery_read_it_test.py::ReadTests::test_native_source
[gw1] [32mPASSED[0m apache_beam/ml/gcp/recommendations_ai_test_it.py::RecommendationAIIT::test_create_catalog_item
apache_beam/ml/gcp/recommendations_ai_test_it.py::RecommendationAIIT::test_create_user_event
[gw6] [32mPASSED[0m apache_beam/io/gcp/bigquery_json_it_test.py::BigQueryJsonIT::test_direct_read
apache_beam/io/gcp/bigquery_json_it_test.py::BigQueryJsonIT::test_export_read
[gw2] [32mPASSED[0m apache_beam/io/gcp/bigquery_write_it_test.py::BigQueryWriteIntegrationTests::test_big_query_write
apache_beam/io/gcp/bigquery_write_it_test.py::BigQueryWriteIntegrationTests::test_big_query_write_insert_errors_reporting
[gw3] [32mPASSED[0m apache_beam/dataframe/io_it_test.py::ReadUsingReadGbqTests::test_ReadGbq
apache_beam/dataframe/io_it_test.py::ReadUsingReadGbqTests::test_ReadGbq_direct_read
[gw7] [32mPASSED[0m apache_beam/io/gcp/big_query_query_to_table_it_test.py::BigQueryQueryToTableIT::test_big_query_legacy_sql
apache_beam/io/gcp/big_query_query_to_table_it_test.py::BigQueryQueryToTableIT::test_big_query_new_types
[gw5] [32mPASSED[0m apache_beam/io/gcp/bigquery_test.py::BigQueryStreamingInsertTransformIntegrationTests::test_multiple_destinations_transform
apache_beam/io/gcp/bigquery_test.py::BigQueryStreamingInsertTransformIntegrationTests::test_value_provider_transform
[gw4] [32mPASSED[0m apache_beam/io/gcp/bigquery_file_loads_test.py::BigQueryFileLoadsIT::test_multiple_destinations_transform
apache_beam/io/gcp/bigquery_file_loads_test.py::BigQueryFileLoadsIT::test_one_job_fails_all_jobs_fail
[gw1] [32mPASSED[0m apache_beam/ml/gcp/recommendations_ai_test_it.py::RecommendationAIIT::test_create_user_event
apache_beam/ml/gcp/recommendations_ai_test_it.py::RecommendationAIIT::test_predict
[gw0] [32mPASSED[0m apache_beam/io/gcp/bigquery_read_it_test.py::ReadTests::test_native_source
apache_beam/io/gcp/bigquery_read_it_test.py::ReadTests::test_table_schema_retrieve
[gw2] [32mPASSED[0m apache_beam/io/gcp/bigquery_write_it_test.py::BigQueryWriteIntegrationTests::test_big_query_write_insert_errors_reporting
apache_beam/io/gcp/bigquery_write_it_test.py::BigQueryWriteIntegrationTests::test_big_query_write_insert_non_transient_api_call_error
[gw6] [32mPASSED[0m apache_beam/io/gcp/bigquery_json_it_test.py::BigQueryJsonIT::test_export_read
apache_beam/io/gcp/bigquery_json_it_test.py::BigQueryJsonIT::test_file_loads_write
[gw6] [32mPASSED[0m apache_beam/io/gcp/bigquery_json_it_test.py::BigQueryJsonIT::test_file_loads_write
apache_beam/io/gcp/bigquery_json_it_test.py::BigQueryJsonIT::test_query_read
[gw5] [32mPASSED[0m apache_beam/io/gcp/bigquery_test.py::BigQueryStreamingInsertTransformIntegrationTests::test_value_provider_transform
apache_beam/io/gcp/bigquery_test.py::PubSubBigQueryIT::test_file_loads
[gw7] [32mPASSED[0m apache_beam/io/gcp/big_query_query_to_table_it_test.py::BigQueryQueryToTableIT::test_big_query_new_types
apache_beam/io/gcp/big_query_query_to_table_it_test.py::BigQueryQueryToTableIT::test_big_query_new_types_avro
[gw3] [32mPASSED[0m apache_beam/dataframe/io_it_test.py::ReadUsingReadGbqTests::test_ReadGbq_direct_read
apache_beam/dataframe/io_it_test.py::ReadUsingReadGbqTests::test_ReadGbq_direct_read_with_project
[gw4] [32mPASSED[0m apache_beam/io/gcp/bigquery_file_loads_test.py::BigQueryFileLoadsIT::test_one_job_fails_all_jobs_fail
apache_beam/ml/inference/sklearn_inference_it_test.py::SklearnInference::test_sklearn_mnist_classification
[gw1] [32mPASSED[0m apache_beam/ml/gcp/recommendations_ai_test_it.py::RecommendationAIIT::test_predict
apache_beam/testing/test_stream_it_test.py::TestStreamIntegrationTests::test_basic_execution
[gw1] [33mSKIPPED[0m apache_beam/testing/test_stream_it_test.py::TestStreamIntegrationTests::test_basic_execution
apache_beam/testing/test_stream_it_test.py::TestStreamIntegrationTests::test_multiple_outputs
[gw1] [33mSKIPPED[0m apache_beam/testing/test_stream_it_test.py::TestStreamIntegrationTests::test_multiple_outputs
apache_beam/testing/test_stream_it_test.py::TestStreamIntegrationTests::test_multiple_outputs_with_watermark_advancement
[gw1] [33mSKIPPED[0m apache_beam/testing/test_stream_it_test.py::TestStreamIntegrationTests::test_multiple_outputs_with_watermark_advancement
apache_beam/io/gcp/bigquery_io_read_it_test.py::BigqueryIOReadIT::test_bigquery_read_1M_python
[gw0] [32mPASSED[0m apache_beam/io/gcp/bigquery_read_it_test.py::ReadTests::test_table_schema_retrieve
apache_beam/io/gcp/bigquery_read_it_test.py::ReadTests::test_table_schema_retrieve_specifying_only_table
[gw2] [32mPASSED[0m apache_beam/io/gcp/bigquery_write_it_test.py::BigQueryWriteIntegrationTests::test_big_query_write_insert_non_transient_api_call_error
apache_beam/io/gcp/bigquery_write_it_test.py::BigQueryWriteIntegrationTests::test_big_query_write_new_types
[gw6] [32mPASSED[0m apache_beam/io/gcp/bigquery_json_it_test.py::BigQueryJsonIT::test_query_read
apache_beam/io/gcp/bigquery_json_it_test.py::BigQueryJsonIT::test_streaming_inserts
[gw3] [32mPASSED[0m apache_beam/dataframe/io_it_test.py::ReadUsingReadGbqTests::test_ReadGbq_direct_read_with_project
apache_beam/dataframe/io_it_test.py::ReadUsingReadGbqTests::test_ReadGbq_export_with_project
[gw7] [32mPASSED[0m apache_beam/io/gcp/big_query_query_to_table_it_test.py::BigQueryQueryToTableIT::test_big_query_new_types_avro
apache_beam/io/gcp/big_query_query_to_table_it_test.py::BigQueryQueryToTableIT::test_big_query_standard_sql
[gw4] [32mPASSED[0m apache_beam/ml/inference/sklearn_inference_it_test.py::SklearnInference::test_sklearn_mnist_classification
apache_beam/ml/inference/sklearn_inference_it_test.py::SklearnInference::test_sklearn_mnist_classification_large_model
[gw1] [32mPASSED[0m apache_beam/io/gcp/bigquery_io_read_it_test.py::BigqueryIOReadIT::test_bigquery_read_1M_python
apache_beam/io/gcp/bigquery_io_read_it_test.py::BigqueryIOReadIT::test_bigquery_read_custom_1M_python
[gw2] [32mPASSED[0m apache_beam/io/gcp/bigquery_write_it_test.py::BigQueryWriteIntegrationTests::test_big_query_write_new_types
apache_beam/io/gcp/bigquery_write_it_test.py::BigQueryWriteIntegrationTests::test_big_query_write_schema_autodetect
[gw2] [33mSKIPPED[0m apache_beam/io/gcp/bigquery_write_it_test.py::BigQueryWriteIntegrationTests::test_big_query_write_schema_autodetect
apache_beam/io/gcp/bigquery_write_it_test.py::BigQueryWriteIntegrationTests::test_big_query_write_without_schema
[gw0] [32mPASSED[0m apache_beam/io/gcp/bigquery_read_it_test.py::ReadTests::test_table_schema_retrieve_specifying_only_table
apache_beam/io/gcp/bigquery_read_it_test.py::ReadTests::test_table_schema_retrieve_with_direct_read
[gw3] [32mPASSED[0m apache_beam/dataframe/io_it_test.py::ReadUsingReadGbqTests::test_ReadGbq_export_with_project
apache_beam/dataframe/io_it_test.py::ReadUsingReadGbqTests::test_ReadGbq_with_computation
[gw7] [32mPASSED[0m apache_beam/io/gcp/big_query_query_to_table_it_test.py::BigQueryQueryToTableIT::test_big_query_standard_sql
apache_beam/examples/dataframe/taxiride_it_test.py::TaxirideIT::test_aggregation
[gw4] [32mPASSED[0m apache_beam/ml/inference/sklearn_inference_it_test.py::SklearnInference::test_sklearn_mnist_classification_large_model
apache_beam/ml/inference/sklearn_inference_it_test.py::SklearnInference::test_sklearn_regression
[gw2] [32mPASSED[0m apache_beam/io/gcp/bigquery_write_it_test.py::BigQueryWriteIntegrationTests::test_big_query_write_without_schema
apache_beam/ml/gcp/cloud_dlp_it_test.py::CloudDLPIT::test_deidentification
[gw1] [32mPASSED[0m apache_beam/io/gcp/bigquery_io_read_it_test.py::BigqueryIOReadIT::test_bigquery_read_custom_1M_python
apache_beam/io/gcp/gcsio_integration_test.py::GcsIOIntegrationTest::test_batch_copy_and_delete
[gw0] [32mPASSED[0m apache_beam/io/gcp/bigquery_read_it_test.py::ReadTests::test_table_schema_retrieve_with_direct_read
apache_beam/io/gcp/bigquery_read_it_test.py::ReadUsingStorageApiTests::test_iobase_source
[gw1] [32mPASSED[0m apache_beam/io/gcp/gcsio_integration_test.py::GcsIOIntegrationTest::test_batch_copy_and_delete
apache_beam/io/gcp/gcsio_integration_test.py::GcsIOIntegrationTest::test_copy
[gw1] [32mPASSED[0m apache_beam/io/gcp/gcsio_integration_test.py::GcsIOIntegrationTest::test_copy
apache_beam/examples/streaming_wordcount_it_test.py::StreamingWordCountIT::test_streaming_wordcount_it
[gw6] [32mPASSED[0m apache_beam/io/gcp/bigquery_json_it_test.py::BigQueryJsonIT::test_streaming_inserts
apache_beam/examples/wordcount_it_test.py::WordCountIT::test_wordcount_impersonation_it
[gw3] [32mPASSED[0m apache_beam/dataframe/io_it_test.py::ReadUsingReadGbqTests::test_ReadGbq_with_computation
apache_beam/io/gcp/pubsub_integration_test.py::PubSubIntegrationTest::test_streaming_data_only
[gw5] [32mPASSED[0m apache_beam/io/gcp/bigquery_test.py::PubSubBigQueryIT::test_file_loads
apache_beam/io/gcp/bigquery_test.py::PubSubBigQueryIT::test_streaming_inserts
[gw4] [32mPASSED[0m apache_beam/ml/inference/sklearn_inference_it_test.py::SklearnInference::test_sklearn_regression
apache_beam/io/gcp/healthcare/dicomio_integration_test.py::DICOMIoIntegrationTest::test_dicom_search_instances
[gw7] [32mPASSED[0m apache_beam/examples/dataframe/taxiride_it_test.py::TaxirideIT::test_aggregation
apache_beam/examples/dataframe/taxiride_it_test.py::TaxirideIT::test_enrich
[gw2] [32mPASSED[0m apache_beam/ml/gcp/cloud_dlp_it_test.py::CloudDLPIT::test_deidentification
apache_beam/ml/gcp/cloud_dlp_it_test.py::CloudDLPIT::test_inspection
[gw0] [32mPASSED[0m apache_beam/io/gcp/bigquery_read_it_test.py::ReadUsingStorageApiTests::test_iobase_source
apache_beam/io/gcp/bigquery_read_it_test.py::ReadUsingStorageApiTests::test_iobase_source_with_column_selection
[gw6] [32mPASSED[0m apache_beam/examples/wordcount_it_test.py::WordCountIT::test_wordcount_impersonation_it
apache_beam/examples/wordcount_it_test.py::WordCountIT::test_wordcount_it
[gw4] [32mPASSED[0m apache_beam/io/gcp/healthcare/dicomio_integration_test.py::DICOMIoIntegrationTest::test_dicom_search_instances
apache_beam/io/gcp/healthcare/dicomio_integration_test.py::DICOMIoIntegrationTest::test_dicom_store_instance_from_gcs
[gw2] [32mPASSED[0m apache_beam/ml/gcp/cloud_dlp_it_test.py::CloudDLPIT::test_inspection
apache_beam/examples/streaming_wordcount_debugging_it_test.py::StreamingWordcountDebuggingIT::test_streaming_wordcount_debugging_it
[gw2] [33mSKIPPED[0m apache_beam/examples/streaming_wordcount_debugging_it_test.py::StreamingWordcountDebuggingIT::test_streaming_wordcount_debugging_it
apache_beam/examples/cookbook/datastore_wordcount_it_test.py::DatastoreWordCountIT::test_datastore_wordcount_it
[gw0] [32mPASSED[0m apache_beam/io/gcp/bigquery_read_it_test.py::ReadUsingStorageApiTests::test_iobase_source_with_column_selection
apache_beam/io/gcp/bigquery_read_it_test.py::ReadUsingStorageApiTests::test_iobase_source_with_column_selection_and_row_restriction
[gw6] [32mPASSED[0m apache_beam/examples/wordcount_it_test.py::WordCountIT::test_wordcount_it
apache_beam/examples/complete/game/hourly_team_score_it_test.py::HourlyTeamScoreIT::test_hourly_team_score_it
[gw3] [32mPASSED[0m apache_beam/io/gcp/pubsub_integration_test.py::PubSubIntegrationTest::test_streaming_data_only
apache_beam/io/gcp/pubsub_integration_test.py::PubSubIntegrationTest::test_streaming_with_attributes
[gw4] [32mPASSED[0m apache_beam/io/gcp/healthcare/dicomio_integration_test.py::DICOMIoIntegrationTest::test_dicom_store_instance_from_gcs
apache_beam/examples/complete/juliaset/juliaset/juliaset_test_it.py::JuliaSetTestIT::test_run_example_with_setup_file
[gw1] [32mPASSED[0m apache_beam/examples/streaming_wordcount_it_test.py::StreamingWordCountIT::test_streaming_wordcount_it
apache_beam/examples/complete/autocomplete_test.py::AutocompleteTest::test_autocomplete_it <https://ci-beam.apache.org/job/beam_PostCommit_Python38/ws/src/build/gradleenv/-1734967051/bin/python3.8>: No module named build
warning: sdist: standard file not found: should have one of README, README.rst, README.txt, README.md
warning: check: missing required meta-data: url
warning: check: missing meta-data: either (author and author_email) or (maintainer and maintainer_email) must be supplied
[gw2] [32mPASSED[0m apache_beam/examples/cookbook/datastore_wordcount_it_test.py::DatastoreWordCountIT::test_datastore_wordcount_it
apache_beam/io/fileio_test.py::MatchIntegrationTest::test_transform_on_gcs
[gw0] [32mPASSED[0m apache_beam/io/gcp/bigquery_read_it_test.py::ReadUsingStorageApiTests::test_iobase_source_with_column_selection_and_row_restriction
apache_beam/io/gcp/bigquery_read_it_test.py::ReadUsingStorageApiTests::test_iobase_source_with_column_selection_and_row_restriction_rows
[gw1] [32mPASSED[0m apache_beam/examples/complete/autocomplete_test.py::AutocompleteTest::test_autocomplete_it
apache_beam/examples/complete/game/game_stats_it_test.py::GameStatsIT::test_game_stats_it
[gw5] [32mPASSED[0m apache_beam/io/gcp/bigquery_test.py::PubSubBigQueryIT::test_streaming_inserts
apache_beam/io/gcp/bigquery_test.py::BigQueryFileLoadsIntegrationTests::test_avro_file_load
[gw4] [32mPASSED[0m apache_beam/examples/complete/juliaset/juliaset/juliaset_test_it.py::JuliaSetTestIT::test_run_example_with_setup_file
apache_beam/examples/inference/tfx_bsl/tfx_bsl_inference_it_test.py::TFXRunInferenceTests::test_tfx_run_inference_mobilenetv2
[gw4] [33mSKIPPED[0m apache_beam/examples/inference/tfx_bsl/tfx_bsl_inference_it_test.py::TFXRunInferenceTests::test_tfx_run_inference_mobilenetv2
apache_beam/ml/gcp/videointelligenceml_test_it.py::VideoIntelligenceMlTestIT::test_label_detection_with_video_context
[gw4] [33mSKIPPED[0m apache_beam/ml/gcp/videointelligenceml_test_it.py::VideoIntelligenceMlTestIT::test_label_detection_with_video_context
apache_beam/transforms/external_it_test.py::ExternalTransformIT::test_job_python_from_python_it
[gw2] [32mPASSED[0m apache_beam/io/fileio_test.py::MatchIntegrationTest::test_transform_on_gcs
apache_beam/io/parquetio_it_test.py::TestParquetIT::test_parquetio_it
[gw0] [32mPASSED[0m apache_beam/io/gcp/bigquery_read_it_test.py::ReadUsingStorageApiTests::test_iobase_source_with_column_selection_and_row_restriction_rows
apache_beam/io/gcp/bigquery_read_it_test.py::ReadUsingStorageApiTests::test_iobase_source_with_native_datetime
[gw7] [32mPASSED[0m apache_beam/examples/dataframe/taxiride_it_test.py::TaxirideIT::test_enrich
apache_beam/examples/fastavro_it_test.py::FastavroIT::test_avro_it
[gw3] [32mPASSED[0m apache_beam/io/gcp/pubsub_integration_test.py::PubSubIntegrationTest::test_streaming_with_attributes
apache_beam/examples/complete/game/leader_board_it_test.py::LeaderBoardIT::test_leader_board_it
[gw6] [32mPASSED[0m apache_beam/examples/complete/game/hourly_team_score_it_test.py::HourlyTeamScoreIT::test_hourly_team_score_it
apache_beam/examples/dataframe/flight_delays_it_test.py::FlightDelaysTest::test_flight_delays
[gw4] [32mPASSED[0m apache_beam/transforms/external_it_test.py::ExternalTransformIT::test_job_python_from_python_it
apache_beam/transforms/periodicsequence_it_test.py::PeriodicSequenceIT::test_periodicsequence_outputs_valid_watermarks_it
[gw4] [33mSKIPPED[0m apache_beam/transforms/periodicsequence_it_test.py::PeriodicSequenceIT::test_periodicsequence_outputs_valid_watermarks_it
[gw5] [32mPASSED[0m apache_beam/io/gcp/bigquery_test.py::BigQueryFileLoadsIntegrationTests::test_avro_file_load
apache_beam/examples/complete/game/user_score_it_test.py::UserScoreIT::test_user_score_it
[gw2] [32mPASSED[0m apache_beam/io/parquetio_it_test.py::TestParquetIT::test_parquetio_it
apache_beam/ml/inference/base_test.py::RunInferenceBaseTest::test_run_inference_with_side_inputin_streaming
[gw2] [33mSKIPPED[0m apache_beam/ml/inference/base_test.py::RunInferenceBaseTest::test_run_inference_with_side_inputin_streaming
[gw0] [32mPASSED[0m apache_beam/io/gcp/bigquery_read_it_test.py::ReadUsingStorageApiTests::test_iobase_source_with_native_datetime
apache_beam/io/gcp/bigquery_read_it_test.py::ReadUsingStorageApiTests::test_iobase_source_with_query
[gw6] [32mPASSED[0m apache_beam/examples/dataframe/flight_delays_it_test.py::FlightDelaysTest::test_flight_delays
apache_beam/io/gcp/datastore/v1new/datastore_write_it_test.py::DatastoreWriteIT::test_datastore_write_limit
[gw0] [32mPASSED[0m apache_beam/io/gcp/bigquery_read_it_test.py::ReadUsingStorageApiTests::test_iobase_source_with_query
apache_beam/io/gcp/bigquery_read_it_test.py::ReadUsingStorageApiTests::test_iobase_source_with_query_and_filters
[gw1] [32mPASSED[0m apache_beam/examples/complete/game/game_stats_it_test.py::GameStatsIT::test_game_stats_it
apache_beam/ml/gcp/visionml_test_it.py::VisionMlTestIT::test_text_detection_with_language_hint
[gw7] [32mPASSED[0m apache_beam/examples/fastavro_it_test.py::FastavroIT::test_avro_it
apache_beam/examples/cookbook/bigquery_tornadoes_it_test.py::BigqueryTornadoesIT::test_bigquery_tornadoes_it
[gw0] [32mPASSED[0m apache_beam/io/gcp/bigquery_read_it_test.py::ReadUsingStorageApiTests::test_iobase_source_with_query_and_filters
apache_beam/io/gcp/bigquery_read_it_test.py::ReadUsingStorageApiTests::test_iobase_source_with_row_restriction
[gw3] [32mPASSED[0m apache_beam/examples/complete/game/leader_board_it_test.py::LeaderBoardIT::test_leader_board_it
apache_beam/ml/gcp/naturallanguageml_test_it.py::NaturalLanguageMlTestIT::test_analyzing_syntax
[gw3] [33mSKIPPED[0m apache_beam/ml/gcp/naturallanguageml_test_it.py::NaturalLanguageMlTestIT::test_analyzing_syntax
[gw1] [32mPASSED[0m apache_beam/ml/gcp/visionml_test_it.py::VisionMlTestIT::test_text_detection_with_language_hint
apache_beam/ml/inference/onnx_inference_it_test.py::OnnxInference::test_onnx_run_inference_roberta_sentiment_classification
[gw1] [33mSKIPPED[0m apache_beam/ml/inference/onnx_inference_it_test.py::OnnxInference::test_onnx_run_inference_roberta_sentiment_classification
[gw5] [32mPASSED[0m apache_beam/examples/complete/game/user_score_it_test.py::UserScoreIT::test_user_score_it
apache_beam/runners/dataflow/dataflow_exercise_metrics_pipeline_test.py::ExerciseMetricsPipelineTest::test_metrics_it
[gw5] [33mSKIPPED[0m apache_beam/runners/dataflow/dataflow_exercise_metrics_pipeline_test.py::ExerciseMetricsPipelineTest::test_metrics_it
[gw7] [32mPASSED[0m apache_beam/examples/cookbook/bigquery_tornadoes_it_test.py::BigqueryTornadoesIT::test_bigquery_tornadoes_it
[gw0] [32mPASSED[0m apache_beam/io/gcp/bigquery_read_it_test.py::ReadUsingStorageApiTests::test_iobase_source_with_row_restriction
apache_beam/io/gcp/bigquery_read_it_test.py::ReadUsingStorageApiTests::test_iobase_source_with_very_selective_filters
[gw0] [32mPASSED[0m apache_beam/io/gcp/bigquery_read_it_test.py::ReadUsingStorageApiTests::test_iobase_source_with_very_selective_filters
apache_beam/io/gcp/bigquery_read_it_test.py::ReadNewTypesTests::test_iobase_source
[gw0] [32mPASSED[0m apache_beam/io/gcp/bigquery_read_it_test.py::ReadNewTypesTests::test_iobase_source
apache_beam/io/gcp/bigquery_read_it_test.py::ReadNewTypesTests::test_native_source
[gw6] [32mPASSED[0m apache_beam/io/gcp/datastore/v1new/datastore_write_it_test.py::DatastoreWriteIT::test_datastore_write_limit
[gw0] [32mPASSED[0m apache_beam/io/gcp/bigquery_read_it_test.py::ReadNewTypesTests::test_native_source
apache_beam/io/gcp/bigquery_read_it_test.py::ReadAllBQTests::test_read_queries
[gw0] [32mPASSED[0m apache_beam/io/gcp/bigquery_read_it_test.py::ReadAllBQTests::test_read_queries
apache_beam/io/gcp/bigquery_read_it_test.py::ReadInteractiveRunnerTests::test_read_in_interactive_runner
[gw0] [32mPASSED[0m apache_beam/io/gcp/bigquery_read_it_test.py::ReadInteractiveRunnerTests::test_read_in_interactive_runner
[33m=============================== warnings summary ===============================[0m
apache_beam/io/gcp/bigquery_read_it_test.py::ReadTests::test_native_source
<https://ci-beam.apache.org/job/beam_PostCommit_Python38/ws/src/sdks/python/apache_beam/io/gcp/bigquery_read_it_test.py>:170: BeamDeprecationWarning: BigQuerySource is deprecated since 2.25.0. Use ReadFromBigQuery instead.
beam.io.BigQuerySource(query=self.query, use_standard_sql=True)))
apache_beam/io/gcp/bigquery_test.py::PubSubBigQueryIT::test_file_loads
apache_beam/io/gcp/bigquery_test.py::PubSubBigQueryIT::test_streaming_inserts
apache_beam/examples/complete/game/hourly_team_score_it_test.py::HourlyTeamScoreIT::test_hourly_team_score_it
apache_beam/examples/complete/game/game_stats_it_test.py::GameStatsIT::test_game_stats_it
apache_beam/examples/complete/game/leader_board_it_test.py::LeaderBoardIT::test_leader_board_it
<https://ci-beam.apache.org/job/beam_PostCommit_Python38/ws/src/sdks/python/apache_beam/io/gcp/tests/utils.py>:63: PendingDeprecationWarning: Client.dataset is deprecated and will be removed in a future version. Use a string like 'my_project.my_dataset' or a cloud.google.bigquery.DatasetReference object, instead.
dataset_ref = client.dataset(unique_dataset_name, project=project)
apache_beam/examples/dataframe/flight_delays_it_test.py::FlightDelaysTest::test_flight_delays
<https://ci-beam.apache.org/job/beam_PostCommit_Python38/ws/src/sdks/python/apache_beam/examples/dataframe/flight_delays.py>:47: FutureWarning: The default value of numeric_only in DataFrame.mean is deprecated. In a future version, it will default to False. In addition, specifying 'numeric_only=None' is deprecated. Select only valid columns or specify the value of numeric_only to silence this warning.
return airline_df[at_top_airports].mean()
apache_beam/examples/cookbook/bigquery_tornadoes_it_test.py::BigqueryTornadoesIT::test_bigquery_tornadoes_it
<https://ci-beam.apache.org/job/beam_PostCommit_Python38/ws/src/sdks/python/apache_beam/io/gcp/tests/utils.py>:100: PendingDeprecationWarning: Client.dataset is deprecated and will be removed in a future version. Use a string like 'my_project.my_dataset' or a cloud.google.bigquery.DatasetReference object, instead.
table_ref = client.dataset(dataset_id).table(table_id)
apache_beam/io/gcp/bigquery_read_it_test.py::ReadNewTypesTests::test_native_source
<https://ci-beam.apache.org/job/beam_PostCommit_Python38/ws/src/sdks/python/apache_beam/io/gcp/bigquery_read_it_test.py>:706: BeamDeprecationWarning: BigQuerySource is deprecated since 2.25.0. Use ReadFromBigQuery instead.
beam.io.BigQuerySource(query=self.query, use_standard_sql=True)))
-- Docs: https://docs.pytest.org/en/stable/how-to/capture-warnings.html
- generated xml file: <https://ci-beam.apache.org/job/beam_PostCommit_Python38/ws/src/sdks/python/pytest_postCommitIT-df-py38.xml> -
[33m=========== [32m83 passed[0m, [33m[1m48 skipped[0m, [33m[1m9 warnings[0m[33m in 5812.83s (1:36:52)[0m[33m ============[0m
FAILURE: Build failed with an exception.
* Where:
Script '<https://ci-beam.apache.org/job/beam_PostCommit_Python38/ws/src/sdks/python/test-suites/portable/common.gradle'> line: 326
* What went wrong:
Execution failed for task ':sdks:python:test-suites:portable:py38:postCommitPy38IT'.
> Process 'command 'sh'' finished with non-zero exit value 1
* Try:
> Run with --stacktrace option to get the stack trace.
> Run with --info or --debug option to get more log output.
> Get more help at https://help.gradle.org.
Deprecated Gradle features were used in this build, making it incompatible with Gradle 9.0.
You can use '--warning-mode all' to show the individual deprecation warnings and determine if they come from your own scripts or plugins.
For more on this, please refer to https://docs.gradle.org/8.4/userguide/command_line_interface.html#sec:command_line_warnings in the Gradle documentation.
BUILD FAILED in 2h 22m 52s
224 actionable tasks: 159 executed, 61 from cache, 4 up-to-date
Publishing build scan...
https://ge.apache.org/s/cbvdjqlmavj3c
Build step 'Invoke Gradle script' changed build result to FAILURE
Build step 'Invoke Gradle script' marked build as failure
---------------------------------------------------------------------
To unsubscribe, e-mail: builds-unsubscribe@beam.apache.org
For additional commands, e-mail: builds-help@beam.apache.org
Build failed in Jenkins: beam_PostCommit_Python38 #4924
Posted by Apache Jenkins Server <je...@builds.apache.org>.
See <https://ci-beam.apache.org/job/beam_PostCommit_Python38/4924/display/redirect>
Changes:
------------------------------------------
[...truncated 13.12 MB...]
[gw1] [32mPASSED[0m apache_beam/io/gcp/bigquery_write_it_test.py::BigQueryWriteIntegrationTests::test_big_query_write
apache_beam/io/gcp/bigquery_write_it_test.py::BigQueryWriteIntegrationTests::test_big_query_write_insert_errors_reporting
[gw7] [32mPASSED[0m apache_beam/io/gcp/big_query_query_to_table_it_test.py::BigQueryQueryToTableIT::test_big_query_legacy_sql
apache_beam/io/gcp/big_query_query_to_table_it_test.py::BigQueryQueryToTableIT::test_big_query_new_types
[gw5] [32mPASSED[0m apache_beam/io/gcp/bigquery_file_loads_test.py::BigQueryFileLoadsIT::test_multiple_destinations_transform
apache_beam/io/gcp/bigquery_file_loads_test.py::BigQueryFileLoadsIT::test_one_job_fails_all_jobs_fail
[gw3] [32mPASSED[0m apache_beam/dataframe/io_it_test.py::ReadUsingReadGbqTests::test_ReadGbq_direct_read
apache_beam/dataframe/io_it_test.py::ReadUsingReadGbqTests::test_ReadGbq_direct_read_with_project
[gw4] [32mPASSED[0m apache_beam/io/gcp/bigquery_json_it_test.py::BigQueryJsonIT::test_export_read
apache_beam/io/gcp/bigquery_json_it_test.py::BigQueryJsonIT::test_file_loads_write
[gw4] [32mPASSED[0m apache_beam/io/gcp/bigquery_json_it_test.py::BigQueryJsonIT::test_file_loads_write
apache_beam/io/gcp/bigquery_json_it_test.py::BigQueryJsonIT::test_query_read
[gw6] [32mPASSED[0m apache_beam/io/gcp/bigquery_test.py::BigQueryStreamingInsertTransformIntegrationTests::test_value_provider_transform
apache_beam/io/gcp/bigquery_test.py::PubSubBigQueryIT::test_file_loads
[gw2] [32mPASSED[0m apache_beam/ml/gcp/recommendations_ai_test_it.py::RecommendationAIIT::test_create_user_event
apache_beam/ml/gcp/recommendations_ai_test_it.py::RecommendationAIIT::test_predict
[gw1] [32mPASSED[0m apache_beam/io/gcp/bigquery_write_it_test.py::BigQueryWriteIntegrationTests::test_big_query_write_insert_errors_reporting
apache_beam/io/gcp/bigquery_write_it_test.py::BigQueryWriteIntegrationTests::test_big_query_write_insert_non_transient_api_call_error
[gw7] [32mPASSED[0m apache_beam/io/gcp/big_query_query_to_table_it_test.py::BigQueryQueryToTableIT::test_big_query_new_types
apache_beam/io/gcp/big_query_query_to_table_it_test.py::BigQueryQueryToTableIT::test_big_query_new_types_avro
[gw0] [32mPASSED[0m apache_beam/io/gcp/bigquery_read_it_test.py::ReadTests::test_native_source
apache_beam/io/gcp/bigquery_read_it_test.py::ReadTests::test_table_schema_retrieve
[gw5] [32mPASSED[0m apache_beam/io/gcp/bigquery_file_loads_test.py::BigQueryFileLoadsIT::test_one_job_fails_all_jobs_fail
apache_beam/ml/inference/sklearn_inference_it_test.py::SklearnInference::test_sklearn_mnist_classification
[gw3] [32mPASSED[0m apache_beam/dataframe/io_it_test.py::ReadUsingReadGbqTests::test_ReadGbq_direct_read_with_project
apache_beam/dataframe/io_it_test.py::ReadUsingReadGbqTests::test_ReadGbq_export_with_project
[gw4] [32mPASSED[0m apache_beam/io/gcp/bigquery_json_it_test.py::BigQueryJsonIT::test_query_read
apache_beam/io/gcp/bigquery_json_it_test.py::BigQueryJsonIT::test_streaming_inserts
[gw2] [32mPASSED[0m apache_beam/ml/gcp/recommendations_ai_test_it.py::RecommendationAIIT::test_predict
apache_beam/testing/test_stream_it_test.py::TestStreamIntegrationTests::test_basic_execution
[gw2] [33mSKIPPED[0m apache_beam/testing/test_stream_it_test.py::TestStreamIntegrationTests::test_basic_execution
apache_beam/testing/test_stream_it_test.py::TestStreamIntegrationTests::test_multiple_outputs
[gw2] [33mSKIPPED[0m apache_beam/testing/test_stream_it_test.py::TestStreamIntegrationTests::test_multiple_outputs
apache_beam/testing/test_stream_it_test.py::TestStreamIntegrationTests::test_multiple_outputs_with_watermark_advancement
[gw2] [33mSKIPPED[0m apache_beam/testing/test_stream_it_test.py::TestStreamIntegrationTests::test_multiple_outputs_with_watermark_advancement
apache_beam/io/gcp/gcsio_integration_test.py::GcsIOIntegrationTest::test_batch_copy_and_delete
[gw2] [32mPASSED[0m apache_beam/io/gcp/gcsio_integration_test.py::GcsIOIntegrationTest::test_batch_copy_and_delete
apache_beam/io/gcp/gcsio_integration_test.py::GcsIOIntegrationTest::test_copy
[gw2] [32mPASSED[0m apache_beam/io/gcp/gcsio_integration_test.py::GcsIOIntegrationTest::test_copy
apache_beam/io/gcp/pubsub_integration_test.py::PubSubIntegrationTest::test_streaming_data_only
[gw1] [32mPASSED[0m apache_beam/io/gcp/bigquery_write_it_test.py::BigQueryWriteIntegrationTests::test_big_query_write_insert_non_transient_api_call_error
apache_beam/io/gcp/bigquery_write_it_test.py::BigQueryWriteIntegrationTests::test_big_query_write_new_types
[gw0] [32mPASSED[0m apache_beam/io/gcp/bigquery_read_it_test.py::ReadTests::test_table_schema_retrieve
apache_beam/io/gcp/bigquery_read_it_test.py::ReadTests::test_table_schema_retrieve_specifying_only_table
[gw7] [32mPASSED[0m apache_beam/io/gcp/big_query_query_to_table_it_test.py::BigQueryQueryToTableIT::test_big_query_new_types_avro
apache_beam/io/gcp/big_query_query_to_table_it_test.py::BigQueryQueryToTableIT::test_big_query_standard_sql
[gw5] [32mPASSED[0m apache_beam/ml/inference/sklearn_inference_it_test.py::SklearnInference::test_sklearn_mnist_classification
apache_beam/ml/inference/sklearn_inference_it_test.py::SklearnInference::test_sklearn_mnist_classification_large_model
[gw3] [32mPASSED[0m apache_beam/dataframe/io_it_test.py::ReadUsingReadGbqTests::test_ReadGbq_export_with_project
apache_beam/dataframe/io_it_test.py::ReadUsingReadGbqTests::test_ReadGbq_with_computation
[gw1] [32mPASSED[0m apache_beam/io/gcp/bigquery_write_it_test.py::BigQueryWriteIntegrationTests::test_big_query_write_new_types
apache_beam/io/gcp/bigquery_write_it_test.py::BigQueryWriteIntegrationTests::test_big_query_write_schema_autodetect
[gw1] [33mSKIPPED[0m apache_beam/io/gcp/bigquery_write_it_test.py::BigQueryWriteIntegrationTests::test_big_query_write_schema_autodetect
apache_beam/io/gcp/bigquery_write_it_test.py::BigQueryWriteIntegrationTests::test_big_query_write_without_schema
[gw0] [32mPASSED[0m apache_beam/io/gcp/bigquery_read_it_test.py::ReadTests::test_table_schema_retrieve_specifying_only_table
apache_beam/io/gcp/bigquery_read_it_test.py::ReadTests::test_table_schema_retrieve_with_direct_read
[gw7] [32mPASSED[0m apache_beam/io/gcp/big_query_query_to_table_it_test.py::BigQueryQueryToTableIT::test_big_query_standard_sql
apache_beam/examples/dataframe/taxiride_it_test.py::TaxirideIT::test_aggregation
[gw5] [32mPASSED[0m apache_beam/ml/inference/sklearn_inference_it_test.py::SklearnInference::test_sklearn_mnist_classification_large_model
apache_beam/ml/inference/sklearn_inference_it_test.py::SklearnInference::test_sklearn_regression
[gw3] [32mPASSED[0m apache_beam/dataframe/io_it_test.py::ReadUsingReadGbqTests::test_ReadGbq_with_computation
apache_beam/io/gcp/bigquery_io_read_it_test.py::BigqueryIOReadIT::test_bigquery_read_1M_python
[gw4] [32mPASSED[0m apache_beam/io/gcp/bigquery_json_it_test.py::BigQueryJsonIT::test_streaming_inserts
apache_beam/examples/wordcount_it_test.py::WordCountIT::test_wordcount_impersonation_it
[gw0] [32mPASSED[0m apache_beam/io/gcp/bigquery_read_it_test.py::ReadTests::test_table_schema_retrieve_with_direct_read
apache_beam/io/gcp/bigquery_read_it_test.py::ReadUsingStorageApiTests::test_iobase_source
[gw6] [32mPASSED[0m apache_beam/io/gcp/bigquery_test.py::PubSubBigQueryIT::test_file_loads
apache_beam/io/gcp/bigquery_test.py::PubSubBigQueryIT::test_streaming_inserts
[gw1] [32mPASSED[0m apache_beam/io/gcp/bigquery_write_it_test.py::BigQueryWriteIntegrationTests::test_big_query_write_without_schema
apache_beam/examples/fastavro_it_test.py::FastavroIT::test_avro_it
[gw2] [32mPASSED[0m apache_beam/io/gcp/pubsub_integration_test.py::PubSubIntegrationTest::test_streaming_data_only
apache_beam/io/gcp/pubsub_integration_test.py::PubSubIntegrationTest::test_streaming_with_attributes
[gw5] [32mPASSED[0m apache_beam/ml/inference/sklearn_inference_it_test.py::SklearnInference::test_sklearn_regression
apache_beam/ml/gcp/cloud_dlp_it_test.py::CloudDLPIT::test_deidentification
[gw7] [32mPASSED[0m apache_beam/examples/dataframe/taxiride_it_test.py::TaxirideIT::test_aggregation
apache_beam/examples/dataframe/taxiride_it_test.py::TaxirideIT::test_enrich
[gw3] [32mPASSED[0m apache_beam/io/gcp/bigquery_io_read_it_test.py::BigqueryIOReadIT::test_bigquery_read_1M_python
apache_beam/io/gcp/bigquery_io_read_it_test.py::BigqueryIOReadIT::test_bigquery_read_custom_1M_python
[gw0] [32mPASSED[0m apache_beam/io/gcp/bigquery_read_it_test.py::ReadUsingStorageApiTests::test_iobase_source
apache_beam/io/gcp/bigquery_read_it_test.py::ReadUsingStorageApiTests::test_iobase_source_with_column_selection
[gw4] [32mPASSED[0m apache_beam/examples/wordcount_it_test.py::WordCountIT::test_wordcount_impersonation_it
apache_beam/examples/wordcount_it_test.py::WordCountIT::test_wordcount_it
[gw5] [32mPASSED[0m apache_beam/ml/gcp/cloud_dlp_it_test.py::CloudDLPIT::test_deidentification
apache_beam/ml/gcp/cloud_dlp_it_test.py::CloudDLPIT::test_inspection
[gw3] [32mPASSED[0m apache_beam/io/gcp/bigquery_io_read_it_test.py::BigqueryIOReadIT::test_bigquery_read_custom_1M_python
apache_beam/examples/complete/autocomplete_test.py::AutocompleteTest::test_autocomplete_it
[gw0] [32mPASSED[0m apache_beam/io/gcp/bigquery_read_it_test.py::ReadUsingStorageApiTests::test_iobase_source_with_column_selection
apache_beam/io/gcp/bigquery_read_it_test.py::ReadUsingStorageApiTests::test_iobase_source_with_column_selection_and_row_restriction
[gw4] [32mPASSED[0m apache_beam/examples/wordcount_it_test.py::WordCountIT::test_wordcount_it
apache_beam/examples/complete/game/game_stats_it_test.py::GameStatsIT::test_game_stats_it
[gw2] [32mPASSED[0m apache_beam/io/gcp/pubsub_integration_test.py::PubSubIntegrationTest::test_streaming_with_attributes
apache_beam/io/gcp/healthcare/dicomio_integration_test.py::DICOMIoIntegrationTest::test_dicom_search_instances
[gw1] [32mPASSED[0m apache_beam/examples/fastavro_it_test.py::FastavroIT::test_avro_it
apache_beam/examples/streaming_wordcount_debugging_it_test.py::StreamingWordcountDebuggingIT::test_streaming_wordcount_debugging_it
[gw1] [33mSKIPPED[0m apache_beam/examples/streaming_wordcount_debugging_it_test.py::StreamingWordcountDebuggingIT::test_streaming_wordcount_debugging_it
apache_beam/examples/complete/game/leader_board_it_test.py::LeaderBoardIT::test_leader_board_it
[gw5] [32mPASSED[0m apache_beam/ml/gcp/cloud_dlp_it_test.py::CloudDLPIT::test_inspection
apache_beam/examples/complete/game/user_score_it_test.py::UserScoreIT::test_user_score_it
[gw3] [32mPASSED[0m apache_beam/examples/complete/autocomplete_test.py::AutocompleteTest::test_autocomplete_it
apache_beam/examples/cookbook/bigquery_tornadoes_it_test.py::BigqueryTornadoesIT::test_bigquery_tornadoes_it
[gw0] [32mPASSED[0m apache_beam/io/gcp/bigquery_read_it_test.py::ReadUsingStorageApiTests::test_iobase_source_with_column_selection_and_row_restriction
apache_beam/io/gcp/bigquery_read_it_test.py::ReadUsingStorageApiTests::test_iobase_source_with_column_selection_and_row_restriction_rows
[gw6] [32mPASSED[0m apache_beam/io/gcp/bigquery_test.py::PubSubBigQueryIT::test_streaming_inserts
apache_beam/io/gcp/bigquery_test.py::BigQueryFileLoadsIntegrationTests::test_avro_file_load
[gw2] [32mPASSED[0m apache_beam/io/gcp/healthcare/dicomio_integration_test.py::DICOMIoIntegrationTest::test_dicom_search_instances
apache_beam/io/gcp/healthcare/dicomio_integration_test.py::DICOMIoIntegrationTest::test_dicom_store_instance_from_gcs
[gw3] [32mPASSED[0m apache_beam/examples/cookbook/bigquery_tornadoes_it_test.py::BigqueryTornadoesIT::test_bigquery_tornadoes_it
apache_beam/examples/inference/tfx_bsl/tfx_bsl_inference_it_test.py::TFXRunInferenceTests::test_tfx_run_inference_mobilenetv2
[gw3] [33mSKIPPED[0m apache_beam/examples/inference/tfx_bsl/tfx_bsl_inference_it_test.py::TFXRunInferenceTests::test_tfx_run_inference_mobilenetv2
apache_beam/ml/gcp/visionml_test_it.py::VisionMlTestIT::test_text_detection_with_language_hint
[gw0] [32mPASSED[0m apache_beam/io/gcp/bigquery_read_it_test.py::ReadUsingStorageApiTests::test_iobase_source_with_column_selection_and_row_restriction_rows
apache_beam/io/gcp/bigquery_read_it_test.py::ReadUsingStorageApiTests::test_iobase_source_with_native_datetime
[gw2] [32mPASSED[0m apache_beam/io/gcp/healthcare/dicomio_integration_test.py::DICOMIoIntegrationTest::test_dicom_store_instance_from_gcs
apache_beam/io/parquetio_it_test.py::TestParquetIT::test_parquetio_it
[gw6] [32mPASSED[0m apache_beam/io/gcp/bigquery_test.py::BigQueryFileLoadsIntegrationTests::test_avro_file_load
apache_beam/examples/complete/game/hourly_team_score_it_test.py::HourlyTeamScoreIT::test_hourly_team_score_it
[gw1] [32mPASSED[0m apache_beam/examples/complete/game/leader_board_it_test.py::LeaderBoardIT::test_leader_board_it
apache_beam/io/gcp/datastore/v1new/datastore_write_it_test.py::DatastoreWriteIT::test_datastore_write_limit
[gw5] [32mPASSED[0m apache_beam/examples/complete/game/user_score_it_test.py::UserScoreIT::test_user_score_it
apache_beam/examples/dataframe/flight_delays_it_test.py::FlightDelaysTest::test_flight_delays
[gw7] [32mPASSED[0m apache_beam/examples/dataframe/taxiride_it_test.py::TaxirideIT::test_enrich
apache_beam/examples/streaming_wordcount_it_test.py::StreamingWordCountIT::test_streaming_wordcount_it
[gw4] [32mPASSED[0m apache_beam/examples/complete/game/game_stats_it_test.py::GameStatsIT::test_game_stats_it
apache_beam/examples/cookbook/datastore_wordcount_it_test.py::DatastoreWordCountIT::test_datastore_wordcount_it
[gw3] [32mPASSED[0m apache_beam/ml/gcp/visionml_test_it.py::VisionMlTestIT::test_text_detection_with_language_hint
apache_beam/runners/dataflow/dataflow_exercise_metrics_pipeline_test.py::ExerciseMetricsPipelineTest::test_metrics_it
[gw3] [33mSKIPPED[0m apache_beam/runners/dataflow/dataflow_exercise_metrics_pipeline_test.py::ExerciseMetricsPipelineTest::test_metrics_it
apache_beam/transforms/external_it_test.py::ExternalTransformIT::test_job_python_from_python_it
[gw0] [32mPASSED[0m apache_beam/io/gcp/bigquery_read_it_test.py::ReadUsingStorageApiTests::test_iobase_source_with_native_datetime
apache_beam/io/gcp/bigquery_read_it_test.py::ReadUsingStorageApiTests::test_iobase_source_with_query
[gw2] [32mPASSED[0m apache_beam/io/parquetio_it_test.py::TestParquetIT::test_parquetio_it
apache_beam/ml/inference/onnx_inference_it_test.py::OnnxInference::test_onnx_run_inference_roberta_sentiment_classification
[gw2] [33mSKIPPED[0m apache_beam/ml/inference/onnx_inference_it_test.py::OnnxInference::test_onnx_run_inference_roberta_sentiment_classification
apache_beam/transforms/periodicsequence_it_test.py::PeriodicSequenceIT::test_periodicsequence_outputs_valid_watermarks_it
[gw2] [33mSKIPPED[0m apache_beam/transforms/periodicsequence_it_test.py::PeriodicSequenceIT::test_periodicsequence_outputs_valid_watermarks_it
[gw5] [32mPASSED[0m apache_beam/examples/dataframe/flight_delays_it_test.py::FlightDelaysTest::test_flight_delays
apache_beam/ml/gcp/videointelligenceml_test_it.py::VideoIntelligenceMlTestIT::test_label_detection_with_video_context
[gw5] [33mSKIPPED[0m apache_beam/ml/gcp/videointelligenceml_test_it.py::VideoIntelligenceMlTestIT::test_label_detection_with_video_context
[gw4] [32mPASSED[0m apache_beam/examples/cookbook/datastore_wordcount_it_test.py::DatastoreWordCountIT::test_datastore_wordcount_it
apache_beam/io/fileio_test.py::MatchIntegrationTest::test_transform_on_gcs
[gw3] [32mPASSED[0m apache_beam/transforms/external_it_test.py::ExternalTransformIT::test_job_python_from_python_it
[gw0] [32mPASSED[0m apache_beam/io/gcp/bigquery_read_it_test.py::ReadUsingStorageApiTests::test_iobase_source_with_query
apache_beam/io/gcp/bigquery_read_it_test.py::ReadUsingStorageApiTests::test_iobase_source_with_query_and_filters
[gw4] [32mPASSED[0m apache_beam/io/fileio_test.py::MatchIntegrationTest::test_transform_on_gcs
[gw6] [32mPASSED[0m apache_beam/examples/complete/game/hourly_team_score_it_test.py::HourlyTeamScoreIT::test_hourly_team_score_it
apache_beam/ml/inference/base_test.py::RunInferenceBaseTest::test_run_inference_with_side_inputin_streaming
[gw6] [33mSKIPPED[0m apache_beam/ml/inference/base_test.py::RunInferenceBaseTest::test_run_inference_with_side_inputin_streaming
[gw0] [32mPASSED[0m apache_beam/io/gcp/bigquery_read_it_test.py::ReadUsingStorageApiTests::test_iobase_source_with_query_and_filters
apache_beam/io/gcp/bigquery_read_it_test.py::ReadUsingStorageApiTests::test_iobase_source_with_row_restriction
[gw7] [32mPASSED[0m apache_beam/examples/streaming_wordcount_it_test.py::StreamingWordCountIT::test_streaming_wordcount_it
apache_beam/examples/complete/juliaset/juliaset/juliaset_test_it.py::JuliaSetTestIT::test_run_example_with_setup_file <https://ci-beam.apache.org/job/beam_PostCommit_Python38/ws/src/build/gradleenv/-1734967051/bin/python3.8>: No module named build
warning: sdist: standard file not found: should have one of README, README.rst, README.txt, README.md
warning: check: missing required meta-data: url
warning: check: missing meta-data: either (author and author_email) or (maintainer and maintainer_email) must be supplied
[gw0] [32mPASSED[0m apache_beam/io/gcp/bigquery_read_it_test.py::ReadUsingStorageApiTests::test_iobase_source_with_row_restriction
apache_beam/io/gcp/bigquery_read_it_test.py::ReadUsingStorageApiTests::test_iobase_source_with_very_selective_filters
[gw7] [32mPASSED[0m apache_beam/examples/complete/juliaset/juliaset/juliaset_test_it.py::JuliaSetTestIT::test_run_example_with_setup_file
[gw0] [32mPASSED[0m apache_beam/io/gcp/bigquery_read_it_test.py::ReadUsingStorageApiTests::test_iobase_source_with_very_selective_filters
apache_beam/io/gcp/bigquery_read_it_test.py::ReadNewTypesTests::test_iobase_source
[gw1] [32mPASSED[0m apache_beam/io/gcp/datastore/v1new/datastore_write_it_test.py::DatastoreWriteIT::test_datastore_write_limit
apache_beam/ml/gcp/naturallanguageml_test_it.py::NaturalLanguageMlTestIT::test_analyzing_syntax
[gw1] [33mSKIPPED[0m apache_beam/ml/gcp/naturallanguageml_test_it.py::NaturalLanguageMlTestIT::test_analyzing_syntax
[gw0] [32mPASSED[0m apache_beam/io/gcp/bigquery_read_it_test.py::ReadNewTypesTests::test_iobase_source
apache_beam/io/gcp/bigquery_read_it_test.py::ReadNewTypesTests::test_native_source
[gw0] [32mPASSED[0m apache_beam/io/gcp/bigquery_read_it_test.py::ReadNewTypesTests::test_native_source
apache_beam/io/gcp/bigquery_read_it_test.py::ReadAllBQTests::test_read_queries
[gw0] [32mPASSED[0m apache_beam/io/gcp/bigquery_read_it_test.py::ReadAllBQTests::test_read_queries
apache_beam/io/gcp/bigquery_read_it_test.py::ReadInteractiveRunnerTests::test_read_in_interactive_runner
[gw0] [32mPASSED[0m apache_beam/io/gcp/bigquery_read_it_test.py::ReadInteractiveRunnerTests::test_read_in_interactive_runner
[33m=============================== warnings summary ===============================[0m
apache_beam/io/gcp/bigquery_read_it_test.py::ReadTests::test_native_source
<https://ci-beam.apache.org/job/beam_PostCommit_Python38/ws/src/sdks/python/apache_beam/io/gcp/bigquery_read_it_test.py>:170: BeamDeprecationWarning: BigQuerySource is deprecated since 2.25.0. Use ReadFromBigQuery instead.
beam.io.BigQuerySource(query=self.query, use_standard_sql=True)))
apache_beam/io/gcp/bigquery_test.py::PubSubBigQueryIT::test_file_loads
apache_beam/io/gcp/bigquery_test.py::PubSubBigQueryIT::test_streaming_inserts
apache_beam/examples/complete/game/leader_board_it_test.py::LeaderBoardIT::test_leader_board_it
apache_beam/examples/complete/game/game_stats_it_test.py::GameStatsIT::test_game_stats_it
apache_beam/examples/complete/game/hourly_team_score_it_test.py::HourlyTeamScoreIT::test_hourly_team_score_it
<https://ci-beam.apache.org/job/beam_PostCommit_Python38/ws/src/sdks/python/apache_beam/io/gcp/tests/utils.py>:63: PendingDeprecationWarning: Client.dataset is deprecated and will be removed in a future version. Use a string like 'my_project.my_dataset' or a cloud.google.bigquery.DatasetReference object, instead.
dataset_ref = client.dataset(unique_dataset_name, project=project)
apache_beam/examples/cookbook/bigquery_tornadoes_it_test.py::BigqueryTornadoesIT::test_bigquery_tornadoes_it
<https://ci-beam.apache.org/job/beam_PostCommit_Python38/ws/src/sdks/python/apache_beam/io/gcp/tests/utils.py>:100: PendingDeprecationWarning: Client.dataset is deprecated and will be removed in a future version. Use a string like 'my_project.my_dataset' or a cloud.google.bigquery.DatasetReference object, instead.
table_ref = client.dataset(dataset_id).table(table_id)
apache_beam/examples/dataframe/flight_delays_it_test.py::FlightDelaysTest::test_flight_delays
<https://ci-beam.apache.org/job/beam_PostCommit_Python38/ws/src/sdks/python/apache_beam/examples/dataframe/flight_delays.py>:47: FutureWarning: The default value of numeric_only in DataFrame.mean is deprecated. In a future version, it will default to False. In addition, specifying 'numeric_only=None' is deprecated. Select only valid columns or specify the value of numeric_only to silence this warning.
return airline_df[at_top_airports].mean()
apache_beam/io/gcp/bigquery_read_it_test.py::ReadNewTypesTests::test_native_source
<https://ci-beam.apache.org/job/beam_PostCommit_Python38/ws/src/sdks/python/apache_beam/io/gcp/bigquery_read_it_test.py>:706: BeamDeprecationWarning: BigQuerySource is deprecated since 2.25.0. Use ReadFromBigQuery instead.
beam.io.BigQuerySource(query=self.query, use_standard_sql=True)))
-- Docs: https://docs.pytest.org/en/stable/how-to/capture-warnings.html
- generated xml file: <https://ci-beam.apache.org/job/beam_PostCommit_Python38/ws/src/sdks/python/pytest_postCommitIT-df-py38.xml> -
[33m=========== [32m83 passed[0m, [33m[1m48 skipped[0m, [33m[1m9 warnings[0m[33m in 5966.09s (1:39:26)[0m[33m ============[0m
FAILURE: Build completed with 2 failures.
1: Task failed with an exception.
-----------
* Where:
Script '<https://ci-beam.apache.org/job/beam_PostCommit_Python38/ws/src/sdks/python/test-suites/portable/common.gradle'> line: 326
* What went wrong:
Execution failed for task ':sdks:python:test-suites:portable:py38:postCommitPy38IT'.
> Process 'command 'sh'' finished with non-zero exit value 1
* Try:
> Run with --stacktrace option to get the stack trace.
> Run with --info or --debug option to get more log output.
> Get more help at https://help.gradle.org.
==============================================================================
2: Task failed with an exception.
-----------
* Where:
Script '<https://ci-beam.apache.org/job/beam_PostCommit_Python38/ws/src/sdks/python/test-suites/direct/common.gradle'> line: 52
* What went wrong:
Execution failed for task ':sdks:python:test-suites:direct:py38:postCommitIT'.
> Process 'command 'sh'' finished with non-zero exit value 1
* Try:
> Run with --stacktrace option to get the stack trace.
> Run with --info or --debug option to get more log output.
> Get more help at https://help.gradle.org.
==============================================================================
Deprecated Gradle features were used in this build, making it incompatible with Gradle 9.0.
You can use '--warning-mode all' to show the individual deprecation warnings and determine if they come from your own scripts or plugins.
For more on this, please refer to https://docs.gradle.org/8.4/userguide/command_line_interface.html#sec:command_line_warnings in the Gradle documentation.
BUILD FAILED in 2h 26m 32s
224 actionable tasks: 159 executed, 61 from cache, 4 up-to-date
Publishing build scan...
https://ge.apache.org/s/whho47khca6ha
Build step 'Invoke Gradle script' changed build result to FAILURE
Build step 'Invoke Gradle script' marked build as failure
---------------------------------------------------------------------
To unsubscribe, e-mail: builds-unsubscribe@beam.apache.org
For additional commands, e-mail: builds-help@beam.apache.org
Build failed in Jenkins: beam_PostCommit_Python38 #4923
Posted by Apache Jenkins Server <je...@builds.apache.org>.
See <https://ci-beam.apache.org/job/beam_PostCommit_Python38/4923/display/redirect>
Changes:
------------------------------------------
[...truncated 12.53 MB...]
[gw1] [32mPASSED[0m apache_beam/io/gcp/bigquery_read_it_test.py::ReadTests::test_iobase_source
apache_beam/io/gcp/bigquery_read_it_test.py::ReadTests::test_native_source
[gw7] [32mPASSED[0m apache_beam/io/gcp/big_query_query_to_table_it_test.py::BigQueryQueryToTableIT::test_big_query_legacy_sql
apache_beam/io/gcp/big_query_query_to_table_it_test.py::BigQueryQueryToTableIT::test_big_query_new_types
[gw4] [32mPASSED[0m apache_beam/io/gcp/bigquery_file_loads_test.py::BigQueryFileLoadsIT::test_multiple_destinations_transform
apache_beam/io/gcp/bigquery_file_loads_test.py::BigQueryFileLoadsIT::test_one_job_fails_all_jobs_fail
[gw5] [32mPASSED[0m apache_beam/io/gcp/bigquery_json_it_test.py::BigQueryJsonIT::test_export_read
apache_beam/io/gcp/bigquery_json_it_test.py::BigQueryJsonIT::test_file_loads_write
[gw5] [32mPASSED[0m apache_beam/io/gcp/bigquery_json_it_test.py::BigQueryJsonIT::test_file_loads_write
apache_beam/io/gcp/bigquery_json_it_test.py::BigQueryJsonIT::test_query_read
[gw0] [32mPASSED[0m apache_beam/ml/gcp/recommendations_ai_test_it.py::RecommendationAIIT::test_create_user_event
apache_beam/ml/gcp/recommendations_ai_test_it.py::RecommendationAIIT::test_predict
[gw2] [32mPASSED[0m apache_beam/io/gcp/bigquery_write_it_test.py::BigQueryWriteIntegrationTests::test_big_query_write_insert_errors_reporting
apache_beam/io/gcp/bigquery_write_it_test.py::BigQueryWriteIntegrationTests::test_big_query_write_insert_non_transient_api_call_error
[gw3] [32mPASSED[0m apache_beam/dataframe/io_it_test.py::ReadUsingReadGbqTests::test_ReadGbq_direct_read
apache_beam/dataframe/io_it_test.py::ReadUsingReadGbqTests::test_ReadGbq_direct_read_with_project
[gw6] [32mPASSED[0m apache_beam/io/gcp/bigquery_test.py::BigQueryStreamingInsertTransformIntegrationTests::test_value_provider_transform
apache_beam/io/gcp/bigquery_test.py::PubSubBigQueryIT::test_file_loads
[gw1] [32mPASSED[0m apache_beam/io/gcp/bigquery_read_it_test.py::ReadTests::test_native_source
apache_beam/io/gcp/bigquery_read_it_test.py::ReadTests::test_table_schema_retrieve
[gw4] [32mPASSED[0m apache_beam/io/gcp/bigquery_file_loads_test.py::BigQueryFileLoadsIT::test_one_job_fails_all_jobs_fail
apache_beam/ml/inference/sklearn_inference_it_test.py::SklearnInference::test_sklearn_mnist_classification
[gw7] [32mPASSED[0m apache_beam/io/gcp/big_query_query_to_table_it_test.py::BigQueryQueryToTableIT::test_big_query_new_types
apache_beam/io/gcp/big_query_query_to_table_it_test.py::BigQueryQueryToTableIT::test_big_query_new_types_avro
[gw0] [32mPASSED[0m apache_beam/ml/gcp/recommendations_ai_test_it.py::RecommendationAIIT::test_predict
apache_beam/testing/test_stream_it_test.py::TestStreamIntegrationTests::test_basic_execution
[gw0] [33mSKIPPED[0m apache_beam/testing/test_stream_it_test.py::TestStreamIntegrationTests::test_basic_execution
apache_beam/testing/test_stream_it_test.py::TestStreamIntegrationTests::test_multiple_outputs
[gw0] [33mSKIPPED[0m apache_beam/testing/test_stream_it_test.py::TestStreamIntegrationTests::test_multiple_outputs
apache_beam/testing/test_stream_it_test.py::TestStreamIntegrationTests::test_multiple_outputs_with_watermark_advancement
[gw0] [33mSKIPPED[0m apache_beam/testing/test_stream_it_test.py::TestStreamIntegrationTests::test_multiple_outputs_with_watermark_advancement
apache_beam/io/gcp/bigquery_io_read_it_test.py::BigqueryIOReadIT::test_bigquery_read_1M_python
[gw2] [32mPASSED[0m apache_beam/io/gcp/bigquery_write_it_test.py::BigQueryWriteIntegrationTests::test_big_query_write_insert_non_transient_api_call_error
apache_beam/io/gcp/bigquery_write_it_test.py::BigQueryWriteIntegrationTests::test_big_query_write_new_types
[gw3] [32mPASSED[0m apache_beam/dataframe/io_it_test.py::ReadUsingReadGbqTests::test_ReadGbq_direct_read_with_project
apache_beam/dataframe/io_it_test.py::ReadUsingReadGbqTests::test_ReadGbq_export_with_project
[gw1] [32mPASSED[0m apache_beam/io/gcp/bigquery_read_it_test.py::ReadTests::test_table_schema_retrieve
apache_beam/io/gcp/bigquery_read_it_test.py::ReadTests::test_table_schema_retrieve_specifying_only_table
[gw5] [32mPASSED[0m apache_beam/io/gcp/bigquery_json_it_test.py::BigQueryJsonIT::test_query_read
apache_beam/io/gcp/bigquery_json_it_test.py::BigQueryJsonIT::test_streaming_inserts
[gw4] [32mPASSED[0m apache_beam/ml/inference/sklearn_inference_it_test.py::SklearnInference::test_sklearn_mnist_classification
apache_beam/ml/inference/sklearn_inference_it_test.py::SklearnInference::test_sklearn_mnist_classification_large_model
[gw7] [32mPASSED[0m apache_beam/io/gcp/big_query_query_to_table_it_test.py::BigQueryQueryToTableIT::test_big_query_new_types_avro
apache_beam/io/gcp/big_query_query_to_table_it_test.py::BigQueryQueryToTableIT::test_big_query_standard_sql
[gw0] [32mPASSED[0m apache_beam/io/gcp/bigquery_io_read_it_test.py::BigqueryIOReadIT::test_bigquery_read_1M_python
apache_beam/io/gcp/bigquery_io_read_it_test.py::BigqueryIOReadIT::test_bigquery_read_custom_1M_python
[gw2] [32mPASSED[0m apache_beam/io/gcp/bigquery_write_it_test.py::BigQueryWriteIntegrationTests::test_big_query_write_new_types
apache_beam/io/gcp/bigquery_write_it_test.py::BigQueryWriteIntegrationTests::test_big_query_write_schema_autodetect
[gw2] [33mSKIPPED[0m apache_beam/io/gcp/bigquery_write_it_test.py::BigQueryWriteIntegrationTests::test_big_query_write_schema_autodetect
apache_beam/io/gcp/bigquery_write_it_test.py::BigQueryWriteIntegrationTests::test_big_query_write_without_schema
[gw3] [32mPASSED[0m apache_beam/dataframe/io_it_test.py::ReadUsingReadGbqTests::test_ReadGbq_export_with_project
apache_beam/dataframe/io_it_test.py::ReadUsingReadGbqTests::test_ReadGbq_with_computation
[gw1] [32mPASSED[0m apache_beam/io/gcp/bigquery_read_it_test.py::ReadTests::test_table_schema_retrieve_specifying_only_table
apache_beam/io/gcp/bigquery_read_it_test.py::ReadTests::test_table_schema_retrieve_with_direct_read
[gw4] [32mPASSED[0m apache_beam/ml/inference/sklearn_inference_it_test.py::SklearnInference::test_sklearn_mnist_classification_large_model
apache_beam/ml/inference/sklearn_inference_it_test.py::SklearnInference::test_sklearn_regression
[gw7] [32mPASSED[0m apache_beam/io/gcp/big_query_query_to_table_it_test.py::BigQueryQueryToTableIT::test_big_query_standard_sql
apache_beam/examples/dataframe/taxiride_it_test.py::TaxirideIT::test_aggregation
[gw0] [32mPASSED[0m apache_beam/io/gcp/bigquery_io_read_it_test.py::BigqueryIOReadIT::test_bigquery_read_custom_1M_python
apache_beam/io/gcp/gcsio_integration_test.py::GcsIOIntegrationTest::test_batch_copy_and_delete
[gw0] [32mPASSED[0m apache_beam/io/gcp/gcsio_integration_test.py::GcsIOIntegrationTest::test_batch_copy_and_delete
apache_beam/io/gcp/gcsio_integration_test.py::GcsIOIntegrationTest::test_copy
[gw0] [32mPASSED[0m apache_beam/io/gcp/gcsio_integration_test.py::GcsIOIntegrationTest::test_copy
apache_beam/examples/streaming_wordcount_debugging_it_test.py::StreamingWordcountDebuggingIT::test_streaming_wordcount_debugging_it
[gw0] [33mSKIPPED[0m apache_beam/examples/streaming_wordcount_debugging_it_test.py::StreamingWordcountDebuggingIT::test_streaming_wordcount_debugging_it
apache_beam/examples/streaming_wordcount_it_test.py::StreamingWordCountIT::test_streaming_wordcount_it
[gw2] [32mPASSED[0m apache_beam/io/gcp/bigquery_write_it_test.py::BigQueryWriteIntegrationTests::test_big_query_write_without_schema
apache_beam/ml/gcp/cloud_dlp_it_test.py::CloudDLPIT::test_deidentification
[gw5] [32mPASSED[0m apache_beam/io/gcp/bigquery_json_it_test.py::BigQueryJsonIT::test_streaming_inserts
apache_beam/examples/wordcount_it_test.py::WordCountIT::test_wordcount_impersonation_it
[gw3] [32mPASSED[0m apache_beam/dataframe/io_it_test.py::ReadUsingReadGbqTests::test_ReadGbq_with_computation
apache_beam/io/gcp/pubsub_integration_test.py::PubSubIntegrationTest::test_streaming_data_only
[gw1] [32mPASSED[0m apache_beam/io/gcp/bigquery_read_it_test.py::ReadTests::test_table_schema_retrieve_with_direct_read
apache_beam/io/gcp/bigquery_read_it_test.py::ReadUsingStorageApiTests::test_iobase_source
[gw6] [32mPASSED[0m apache_beam/io/gcp/bigquery_test.py::PubSubBigQueryIT::test_file_loads
apache_beam/io/gcp/bigquery_test.py::PubSubBigQueryIT::test_streaming_inserts
[gw4] [32mPASSED[0m apache_beam/ml/inference/sklearn_inference_it_test.py::SklearnInference::test_sklearn_regression
apache_beam/io/gcp/healthcare/dicomio_integration_test.py::DICOMIoIntegrationTest::test_dicom_search_instances
[gw2] [32mPASSED[0m apache_beam/ml/gcp/cloud_dlp_it_test.py::CloudDLPIT::test_deidentification
apache_beam/ml/gcp/cloud_dlp_it_test.py::CloudDLPIT::test_inspection
[gw7] [32mPASSED[0m apache_beam/examples/dataframe/taxiride_it_test.py::TaxirideIT::test_aggregation
apache_beam/examples/dataframe/taxiride_it_test.py::TaxirideIT::test_enrich
[gw1] [32mPASSED[0m apache_beam/io/gcp/bigquery_read_it_test.py::ReadUsingStorageApiTests::test_iobase_source
apache_beam/io/gcp/bigquery_read_it_test.py::ReadUsingStorageApiTests::test_iobase_source_with_column_selection
[gw5] [32mPASSED[0m apache_beam/examples/wordcount_it_test.py::WordCountIT::test_wordcount_impersonation_it
apache_beam/examples/wordcount_it_test.py::WordCountIT::test_wordcount_it
[gw4] [32mPASSED[0m apache_beam/io/gcp/healthcare/dicomio_integration_test.py::DICOMIoIntegrationTest::test_dicom_search_instances
apache_beam/io/gcp/healthcare/dicomio_integration_test.py::DICOMIoIntegrationTest::test_dicom_store_instance_from_gcs
[gw2] [32mPASSED[0m apache_beam/ml/gcp/cloud_dlp_it_test.py::CloudDLPIT::test_inspection
apache_beam/examples/complete/game/hourly_team_score_it_test.py::HourlyTeamScoreIT::test_hourly_team_score_it
[gw1] [32mPASSED[0m apache_beam/io/gcp/bigquery_read_it_test.py::ReadUsingStorageApiTests::test_iobase_source_with_column_selection
apache_beam/io/gcp/bigquery_read_it_test.py::ReadUsingStorageApiTests::test_iobase_source_with_column_selection_and_row_restriction
[gw4] [32mPASSED[0m apache_beam/io/gcp/healthcare/dicomio_integration_test.py::DICOMIoIntegrationTest::test_dicom_store_instance_from_gcs
apache_beam/examples/cookbook/bigquery_tornadoes_it_test.py::BigqueryTornadoesIT::test_bigquery_tornadoes_it
[gw5] [32mPASSED[0m apache_beam/examples/wordcount_it_test.py::WordCountIT::test_wordcount_it
apache_beam/examples/complete/game/leader_board_it_test.py::LeaderBoardIT::test_leader_board_it
[gw0] [32mPASSED[0m apache_beam/examples/streaming_wordcount_it_test.py::StreamingWordCountIT::test_streaming_wordcount_it
apache_beam/examples/complete/autocomplete_test.py::AutocompleteTest::test_autocomplete_it
[gw3] [32mPASSED[0m apache_beam/io/gcp/pubsub_integration_test.py::PubSubIntegrationTest::test_streaming_data_only
apache_beam/io/gcp/pubsub_integration_test.py::PubSubIntegrationTest::test_streaming_with_attributes
[gw1] [32mPASSED[0m apache_beam/io/gcp/bigquery_read_it_test.py::ReadUsingStorageApiTests::test_iobase_source_with_column_selection_and_row_restriction
apache_beam/io/gcp/bigquery_read_it_test.py::ReadUsingStorageApiTests::test_iobase_source_with_column_selection_and_row_restriction_rows
[gw4] [32mPASSED[0m apache_beam/examples/cookbook/bigquery_tornadoes_it_test.py::BigqueryTornadoesIT::test_bigquery_tornadoes_it
apache_beam/io/fileio_test.py::MatchIntegrationTest::test_transform_on_gcs
[gw0] [32mPASSED[0m apache_beam/examples/complete/autocomplete_test.py::AutocompleteTest::test_autocomplete_it
apache_beam/examples/complete/game/game_stats_it_test.py::GameStatsIT::test_game_stats_it
[gw6] [32mPASSED[0m apache_beam/io/gcp/bigquery_test.py::PubSubBigQueryIT::test_streaming_inserts
apache_beam/io/gcp/bigquery_test.py::BigQueryFileLoadsIntegrationTests::test_avro_file_load
[gw1] [32mPASSED[0m apache_beam/io/gcp/bigquery_read_it_test.py::ReadUsingStorageApiTests::test_iobase_source_with_column_selection_and_row_restriction_rows
apache_beam/io/gcp/bigquery_read_it_test.py::ReadUsingStorageApiTests::test_iobase_source_with_native_datetime
[gw2] [32mPASSED[0m apache_beam/examples/complete/game/hourly_team_score_it_test.py::HourlyTeamScoreIT::test_hourly_team_score_it
apache_beam/examples/cookbook/datastore_wordcount_it_test.py::DatastoreWordCountIT::test_datastore_wordcount_it
[gw4] [32mPASSED[0m apache_beam/io/fileio_test.py::MatchIntegrationTest::test_transform_on_gcs
apache_beam/io/gcp/datastore/v1new/datastore_write_it_test.py::DatastoreWriteIT::test_datastore_write_limit
[gw3] [32mPASSED[0m apache_beam/io/gcp/pubsub_integration_test.py::PubSubIntegrationTest::test_streaming_with_attributes
apache_beam/examples/complete/game/user_score_it_test.py::UserScoreIT::test_user_score_it
[gw6] [32mPASSED[0m apache_beam/io/gcp/bigquery_test.py::BigQueryFileLoadsIntegrationTests::test_avro_file_load
apache_beam/examples/complete/juliaset/juliaset/juliaset_test_it.py::JuliaSetTestIT::test_run_example_with_setup_file
[gw5] [32mPASSED[0m apache_beam/examples/complete/game/leader_board_it_test.py::LeaderBoardIT::test_leader_board_it
apache_beam/examples/inference/tfx_bsl/tfx_bsl_inference_it_test.py::TFXRunInferenceTests::test_tfx_run_inference_mobilenetv2
[gw5] [33mSKIPPED[0m apache_beam/examples/inference/tfx_bsl/tfx_bsl_inference_it_test.py::TFXRunInferenceTests::test_tfx_run_inference_mobilenetv2
apache_beam/ml/gcp/naturallanguageml_test_it.py::NaturalLanguageMlTestIT::test_analyzing_syntax
[gw5] [33mSKIPPED[0m apache_beam/ml/gcp/naturallanguageml_test_it.py::NaturalLanguageMlTestIT::test_analyzing_syntax <https://ci-beam.apache.org/job/beam_PostCommit_Python38/ws/src/build/gradleenv/-1734967051/bin/python3.8>: No module named build
warning: sdist: standard file not found: should have one of README, README.rst, README.txt, README.md
warning: check: missing required meta-data: url
warning: check: missing meta-data: either (author and author_email) or (maintainer and maintainer_email) must be supplied
[gw7] [32mPASSED[0m apache_beam/examples/dataframe/taxiride_it_test.py::TaxirideIT::test_enrich
apache_beam/examples/fastavro_it_test.py::FastavroIT::test_avro_it
[gw1] [32mPASSED[0m apache_beam/io/gcp/bigquery_read_it_test.py::ReadUsingStorageApiTests::test_iobase_source_with_native_datetime
apache_beam/io/gcp/bigquery_read_it_test.py::ReadUsingStorageApiTests::test_iobase_source_with_query
[gw2] [32mPASSED[0m apache_beam/examples/cookbook/datastore_wordcount_it_test.py::DatastoreWordCountIT::test_datastore_wordcount_it
apache_beam/io/parquetio_it_test.py::TestParquetIT::test_parquetio_it
[gw6] [32mPASSED[0m apache_beam/examples/complete/juliaset/juliaset/juliaset_test_it.py::JuliaSetTestIT::test_run_example_with_setup_file
apache_beam/runners/dataflow/dataflow_exercise_metrics_pipeline_test.py::ExerciseMetricsPipelineTest::test_metrics_it
[gw6] [33mSKIPPED[0m apache_beam/runners/dataflow/dataflow_exercise_metrics_pipeline_test.py::ExerciseMetricsPipelineTest::test_metrics_it
[gw0] [32mPASSED[0m apache_beam/examples/complete/game/game_stats_it_test.py::GameStatsIT::test_game_stats_it
apache_beam/ml/gcp/videointelligenceml_test_it.py::VideoIntelligenceMlTestIT::test_label_detection_with_video_context
[gw0] [33mSKIPPED[0m apache_beam/ml/gcp/videointelligenceml_test_it.py::VideoIntelligenceMlTestIT::test_label_detection_with_video_context
apache_beam/ml/inference/onnx_inference_it_test.py::OnnxInference::test_onnx_run_inference_roberta_sentiment_classification
[gw0] [33mSKIPPED[0m apache_beam/ml/inference/onnx_inference_it_test.py::OnnxInference::test_onnx_run_inference_roberta_sentiment_classification
[gw1] [32mPASSED[0m apache_beam/io/gcp/bigquery_read_it_test.py::ReadUsingStorageApiTests::test_iobase_source_with_query
apache_beam/io/gcp/bigquery_read_it_test.py::ReadUsingStorageApiTests::test_iobase_source_with_query_and_filters
[gw2] [32mPASSED[0m apache_beam/io/parquetio_it_test.py::TestParquetIT::test_parquetio_it
apache_beam/transforms/external_it_test.py::ExternalTransformIT::test_job_python_from_python_it
[gw7] [32mPASSED[0m apache_beam/examples/fastavro_it_test.py::FastavroIT::test_avro_it
apache_beam/examples/dataframe/flight_delays_it_test.py::FlightDelaysTest::test_flight_delays
[gw1] [32mPASSED[0m apache_beam/io/gcp/bigquery_read_it_test.py::ReadUsingStorageApiTests::test_iobase_source_with_query_and_filters
apache_beam/io/gcp/bigquery_read_it_test.py::ReadUsingStorageApiTests::test_iobase_source_with_row_restriction
[gw3] [32mPASSED[0m apache_beam/examples/complete/game/user_score_it_test.py::UserScoreIT::test_user_score_it
apache_beam/ml/gcp/visionml_test_it.py::VisionMlTestIT::test_text_detection_with_language_hint
[gw2] [32mPASSED[0m apache_beam/transforms/external_it_test.py::ExternalTransformIT::test_job_python_from_python_it
[gw3] [32mPASSED[0m apache_beam/ml/gcp/visionml_test_it.py::VisionMlTestIT::test_text_detection_with_language_hint
[gw1] [32mPASSED[0m apache_beam/io/gcp/bigquery_read_it_test.py::ReadUsingStorageApiTests::test_iobase_source_with_row_restriction
apache_beam/io/gcp/bigquery_read_it_test.py::ReadUsingStorageApiTests::test_iobase_source_with_very_selective_filters
[gw7] [32mPASSED[0m apache_beam/examples/dataframe/flight_delays_it_test.py::FlightDelaysTest::test_flight_delays
[gw1] [32mPASSED[0m apache_beam/io/gcp/bigquery_read_it_test.py::ReadUsingStorageApiTests::test_iobase_source_with_very_selective_filters
apache_beam/io/gcp/bigquery_read_it_test.py::ReadNewTypesTests::test_iobase_source
[gw4] [32mPASSED[0m apache_beam/io/gcp/datastore/v1new/datastore_write_it_test.py::DatastoreWriteIT::test_datastore_write_limit
apache_beam/ml/inference/base_test.py::RunInferenceBaseTest::test_run_inference_with_side_inputin_streaming
[gw4] [33mSKIPPED[0m apache_beam/ml/inference/base_test.py::RunInferenceBaseTest::test_run_inference_with_side_inputin_streaming
apache_beam/transforms/periodicsequence_it_test.py::PeriodicSequenceIT::test_periodicsequence_outputs_valid_watermarks_it
[gw4] [33mSKIPPED[0m apache_beam/transforms/periodicsequence_it_test.py::PeriodicSequenceIT::test_periodicsequence_outputs_valid_watermarks_it
[gw1] [32mPASSED[0m apache_beam/io/gcp/bigquery_read_it_test.py::ReadNewTypesTests::test_iobase_source
apache_beam/io/gcp/bigquery_read_it_test.py::ReadNewTypesTests::test_native_source
[gw1] [32mPASSED[0m apache_beam/io/gcp/bigquery_read_it_test.py::ReadNewTypesTests::test_native_source
apache_beam/io/gcp/bigquery_read_it_test.py::ReadAllBQTests::test_read_queries
[gw1] [32mPASSED[0m apache_beam/io/gcp/bigquery_read_it_test.py::ReadAllBQTests::test_read_queries
apache_beam/io/gcp/bigquery_read_it_test.py::ReadInteractiveRunnerTests::test_read_in_interactive_runner
[gw1] [32mPASSED[0m apache_beam/io/gcp/bigquery_read_it_test.py::ReadInteractiveRunnerTests::test_read_in_interactive_runner
[33m=============================== warnings summary ===============================[0m
apache_beam/io/gcp/bigquery_read_it_test.py::ReadTests::test_native_source
<https://ci-beam.apache.org/job/beam_PostCommit_Python38/ws/src/sdks/python/apache_beam/io/gcp/bigquery_read_it_test.py>:170: BeamDeprecationWarning: BigQuerySource is deprecated since 2.25.0. Use ReadFromBigQuery instead.
beam.io.BigQuerySource(query=self.query, use_standard_sql=True)))
apache_beam/io/gcp/bigquery_test.py::PubSubBigQueryIT::test_file_loads
apache_beam/io/gcp/bigquery_test.py::PubSubBigQueryIT::test_streaming_inserts
apache_beam/examples/complete/game/hourly_team_score_it_test.py::HourlyTeamScoreIT::test_hourly_team_score_it
apache_beam/examples/complete/game/leader_board_it_test.py::LeaderBoardIT::test_leader_board_it
apache_beam/examples/complete/game/game_stats_it_test.py::GameStatsIT::test_game_stats_it
<https://ci-beam.apache.org/job/beam_PostCommit_Python38/ws/src/sdks/python/apache_beam/io/gcp/tests/utils.py>:63: PendingDeprecationWarning: Client.dataset is deprecated and will be removed in a future version. Use a string like 'my_project.my_dataset' or a cloud.google.bigquery.DatasetReference object, instead.
dataset_ref = client.dataset(unique_dataset_name, project=project)
apache_beam/examples/cookbook/bigquery_tornadoes_it_test.py::BigqueryTornadoesIT::test_bigquery_tornadoes_it
<https://ci-beam.apache.org/job/beam_PostCommit_Python38/ws/src/sdks/python/apache_beam/io/gcp/tests/utils.py>:100: PendingDeprecationWarning: Client.dataset is deprecated and will be removed in a future version. Use a string like 'my_project.my_dataset' or a cloud.google.bigquery.DatasetReference object, instead.
table_ref = client.dataset(dataset_id).table(table_id)
apache_beam/examples/dataframe/flight_delays_it_test.py::FlightDelaysTest::test_flight_delays
<https://ci-beam.apache.org/job/beam_PostCommit_Python38/ws/src/sdks/python/apache_beam/examples/dataframe/flight_delays.py>:47: FutureWarning: The default value of numeric_only in DataFrame.mean is deprecated. In a future version, it will default to False. In addition, specifying 'numeric_only=None' is deprecated. Select only valid columns or specify the value of numeric_only to silence this warning.
return airline_df[at_top_airports].mean()
apache_beam/io/gcp/bigquery_read_it_test.py::ReadNewTypesTests::test_native_source
<https://ci-beam.apache.org/job/beam_PostCommit_Python38/ws/src/sdks/python/apache_beam/io/gcp/bigquery_read_it_test.py>:706: BeamDeprecationWarning: BigQuerySource is deprecated since 2.25.0. Use ReadFromBigQuery instead.
beam.io.BigQuerySource(query=self.query, use_standard_sql=True)))
-- Docs: https://docs.pytest.org/en/stable/how-to/capture-warnings.html
- generated xml file: <https://ci-beam.apache.org/job/beam_PostCommit_Python38/ws/src/sdks/python/pytest_postCommitIT-df-py38.xml> -
[33m=========== [32m83 passed[0m, [33m[1m48 skipped[0m, [33m[1m9 warnings[0m[33m in 6077.70s (1:41:17)[0m[33m ============[0m
FAILURE: Build completed with 2 failures.
1: Task failed with an exception.
-----------
* Where:
Script '<https://ci-beam.apache.org/job/beam_PostCommit_Python38/ws/src/sdks/python/test-suites/portable/common.gradle'> line: 326
* What went wrong:
Execution failed for task ':sdks:python:test-suites:portable:py38:postCommitPy38IT'.
> Process 'command 'sh'' finished with non-zero exit value 1
* Try:
> Run with --stacktrace option to get the stack trace.
> Run with --info or --debug option to get more log output.
> Get more help at https://help.gradle.org.
==============================================================================
2: Task failed with an exception.
-----------
* Where:
Script '<https://ci-beam.apache.org/job/beam_PostCommit_Python38/ws/src/sdks/python/test-suites/direct/common.gradle'> line: 52
* What went wrong:
Execution failed for task ':sdks:python:test-suites:direct:py38:postCommitIT'.
> Process 'command 'sh'' finished with non-zero exit value 1
* Try:
> Run with --stacktrace option to get the stack trace.
> Run with --info or --debug option to get more log output.
> Get more help at https://help.gradle.org.
==============================================================================
Deprecated Gradle features were used in this build, making it incompatible with Gradle 9.0.
You can use '--warning-mode all' to show the individual deprecation warnings and determine if they come from your own scripts or plugins.
For more on this, please refer to https://docs.gradle.org/8.4/userguide/command_line_interface.html#sec:command_line_warnings in the Gradle documentation.
BUILD FAILED in 2h 26m 22s
224 actionable tasks: 159 executed, 61 from cache, 4 up-to-date
Publishing build scan...
https://ge.apache.org/s/fgmr6sa5hlo6k
Build step 'Invoke Gradle script' changed build result to FAILURE
Build step 'Invoke Gradle script' marked build as failure
---------------------------------------------------------------------
To unsubscribe, e-mail: builds-unsubscribe@beam.apache.org
For additional commands, e-mail: builds-help@beam.apache.org
Build failed in Jenkins: beam_PostCommit_Python38 #4922
Posted by Apache Jenkins Server <je...@builds.apache.org>.
See <https://ci-beam.apache.org/job/beam_PostCommit_Python38/4922/display/redirect?page=changes>
Changes:
[noreply] Bump com.gradle.common-custom-user-data-gradle-plugin (#29632)
------------------------------------------
[...truncated 12.26 MB...]
self._target(*self._args, **self._kwargs)
File "<https://ci-beam.apache.org/job/beam_PostCommit_Python38/ws/src/sdks/python/apache_beam/runners/worker/data_plane.py",> line 686, in <lambda>
target=lambda: self._read_inputs(elements_iterator),
File "<https://ci-beam.apache.org/job/beam_PostCommit_Python38/ws/src/sdks/python/apache_beam/runners/worker/data_plane.py",> line 669, in _read_inputs
for elements in elements_iterator:
File "<https://ci-beam.apache.org/job/beam_PostCommit_Python38/ws/src/build/gradleenv/2022703442/lib/python3.8/site-packages/grpc/_channel.py",> line 540, in __next__
return self._next()
File "<https://ci-beam.apache.org/job/beam_PostCommit_Python38/ws/src/build/gradleenv/2022703442/lib/python3.8/site-packages/grpc/_channel.py",> line 966, in _next
raise self
grpc._channel._MultiThreadedRendezvous: <_MultiThreadedRendezvous of RPC that terminated with:
status = StatusCode.CANCELLED
details = "Multiplexer hanging up"
debug_error_string = "UNKNOWN:Error received from peer ipv6:%5B::1%5D:34981 {created_time:"2023-12-12T14:44:23.446210782+00:00", grpc_status:1, grpc_message:"Multiplexer hanging up"}"
>
warnings.warn(pytest.PytestUnhandledThreadExceptionWarning(msg))
apache_beam/io/external/xlang_jdbcio_it_test.py::CrossLanguageJdbcIOTest::test_xlang_jdbc_write_read_1_mysql
<https://ci-beam.apache.org/job/beam_PostCommit_Python38/ws/src/build/gradleenv/2022703442/lib/python3.8/site-packages/_pytest/threadexception.py>:73: PytestUnhandledThreadExceptionWarning: Exception in thread read_grpc_client_inputs
Traceback (most recent call last):
File "/usr/lib/python3.8/threading.py", line 932, in _bootstrap_inner
self.run()
File "/usr/lib/python3.8/threading.py", line 870, in run
self._target(*self._args, **self._kwargs)
File "<https://ci-beam.apache.org/job/beam_PostCommit_Python38/ws/src/sdks/python/apache_beam/runners/worker/data_plane.py",> line 686, in <lambda>
target=lambda: self._read_inputs(elements_iterator),
File "<https://ci-beam.apache.org/job/beam_PostCommit_Python38/ws/src/sdks/python/apache_beam/runners/worker/data_plane.py",> line 669, in _read_inputs
for elements in elements_iterator:
File "<https://ci-beam.apache.org/job/beam_PostCommit_Python38/ws/src/build/gradleenv/2022703442/lib/python3.8/site-packages/grpc/_channel.py",> line 540, in __next__
return self._next()
File "<https://ci-beam.apache.org/job/beam_PostCommit_Python38/ws/src/build/gradleenv/2022703442/lib/python3.8/site-packages/grpc/_channel.py",> line 966, in _next
raise self
grpc._channel._MultiThreadedRendezvous: <_MultiThreadedRendezvous of RPC that terminated with:
status = StatusCode.CANCELLED
details = "Multiplexer hanging up"
debug_error_string = "UNKNOWN:Error received from peer ipv6:%5B::1%5D:32781 {grpc_message:"Multiplexer hanging up", grpc_status:1, created_time:"2023-12-12T14:45:40.571054276+00:00"}"
>
warnings.warn(pytest.PytestUnhandledThreadExceptionWarning(msg))
apache_beam/io/external/xlang_kafkaio_it_test.py::CrossLanguageKafkaIOTest::test_local_kafkaio_null_key
<https://ci-beam.apache.org/job/beam_PostCommit_Python38/ws/src/build/gradleenv/2022703442/lib/python3.8/site-packages/_pytest/threadexception.py>:73: PytestUnhandledThreadExceptionWarning: Exception in thread read_grpc_client_inputs
Traceback (most recent call last):
File "/usr/lib/python3.8/threading.py", line 932, in _bootstrap_inner
self.run()
File "/usr/lib/python3.8/threading.py", line 870, in run
self._target(*self._args, **self._kwargs)
File "<https://ci-beam.apache.org/job/beam_PostCommit_Python38/ws/src/sdks/python/apache_beam/runners/worker/data_plane.py",> line 686, in <lambda>
target=lambda: self._read_inputs(elements_iterator),
File "<https://ci-beam.apache.org/job/beam_PostCommit_Python38/ws/src/sdks/python/apache_beam/runners/worker/data_plane.py",> line 669, in _read_inputs
for elements in elements_iterator:
File "<https://ci-beam.apache.org/job/beam_PostCommit_Python38/ws/src/build/gradleenv/2022703442/lib/python3.8/site-packages/grpc/_channel.py",> line 540, in __next__
return self._next()
File "<https://ci-beam.apache.org/job/beam_PostCommit_Python38/ws/src/build/gradleenv/2022703442/lib/python3.8/site-packages/grpc/_channel.py",> line 966, in _next
raise self
grpc._channel._MultiThreadedRendezvous: <_MultiThreadedRendezvous of RPC that terminated with:
status = StatusCode.CANCELLED
details = "Multiplexer hanging up"
debug_error_string = "UNKNOWN:Error received from peer ipv6:%5B::1%5D:41365 {grpc_message:"Multiplexer hanging up", grpc_status:1, created_time:"2023-12-12T14:47:00.611123408+00:00"}"
>
warnings.warn(pytest.PytestUnhandledThreadExceptionWarning(msg))
apache_beam/io/external/xlang_kafkaio_it_test.py::CrossLanguageKafkaIOTest::test_local_kafkaio_populated_key
<https://ci-beam.apache.org/job/beam_PostCommit_Python38/ws/src/build/gradleenv/2022703442/lib/python3.8/site-packages/_pytest/threadexception.py>:73: PytestUnhandledThreadExceptionWarning: Exception in thread read_grpc_client_inputs
Traceback (most recent call last):
File "/usr/lib/python3.8/threading.py", line 932, in _bootstrap_inner
self.run()
File "/usr/lib/python3.8/threading.py", line 870, in run
self._target(*self._args, **self._kwargs)
File "<https://ci-beam.apache.org/job/beam_PostCommit_Python38/ws/src/sdks/python/apache_beam/runners/worker/data_plane.py",> line 686, in <lambda>
target=lambda: self._read_inputs(elements_iterator),
File "<https://ci-beam.apache.org/job/beam_PostCommit_Python38/ws/src/sdks/python/apache_beam/runners/worker/data_plane.py",> line 669, in _read_inputs
for elements in elements_iterator:
File "<https://ci-beam.apache.org/job/beam_PostCommit_Python38/ws/src/build/gradleenv/2022703442/lib/python3.8/site-packages/grpc/_channel.py",> line 540, in __next__
return self._next()
File "<https://ci-beam.apache.org/job/beam_PostCommit_Python38/ws/src/build/gradleenv/2022703442/lib/python3.8/site-packages/grpc/_channel.py",> line 966, in _next
raise self
grpc._channel._MultiThreadedRendezvous: <_MultiThreadedRendezvous of RPC that terminated with:
status = StatusCode.CANCELLED
details = "Multiplexer hanging up"
debug_error_string = "UNKNOWN:Error received from peer ipv6:%5B::1%5D:37785 {grpc_message:"Multiplexer hanging up", grpc_status:1, created_time:"2023-12-12T14:47:24.115123478+00:00"}"
>
warnings.warn(pytest.PytestUnhandledThreadExceptionWarning(msg))
-- Docs: https://docs.pytest.org/en/stable/how-to/capture-warnings.html
- generated xml file: <https://ci-beam.apache.org/job/beam_PostCommit_Python38/ws/src/sdks/python/pytest_postCommitIT-flink-py38.xml> -
Traceback (most recent call last):
File "<https://ci-beam.apache.org/job/beam_PostCommit_Python38/ws/src/sdks/python/apache_beam/runners/worker/bundle_processor.py",> line 231, in process_encoded
=========================== short test summary info ============================
FAILED apache_beam/io/external/xlang_jdbcio_it_test.py::CrossLanguageJdbcIOTest::test_xlang_jdbc_write_read_0_postgres - RuntimeError: Pipeline BeamApp-jenkins-1212144401-f23101d1_ef1c2022-0af4-478c-a665-47057d025cb1 failed in state FAILED: java.lang.RuntimeException: Error received from SDK harness for instruction 30: Traceback (most recent call last):
decoded_value = self.windowed_coder_impl.decode_from_stream(
File "apache_beam/coders/coder_impl.py", line 1469, in apache_beam.coders.coder_impl.WindowedValueCoderImpl.decode_from_stream
def decode_from_stream(self, in_stream, nested):
File "apache_beam/coders/coder_impl.py", line 1488, in apache_beam.coders.coder_impl.WindowedValueCoderImpl.decode_from_stream
value = self._value_coder.decode_from_stream(in_stream, nested)
File "<https://ci-beam.apache.org/job/beam_PostCommit_Python38/ws/src/sdks/python/apache_beam/runners/worker/bundle_processor.py",> line 231, in process_encoded
decoded_value = self.windowed_coder_impl.decode_from_stream(
File "apache_beam/coders/coder_impl.py", line 1469, in apache_beam.coders.coder_impl.WindowedValueCoderImpl.decode_from_stream
def decode_from_stream(self, in_stream, nested):
File "apache_beam/coders/coder_impl.py", line 1837, in apache_beam.coders.coder_impl.RowCoderImpl.decode_from_stream
item = component_coder.decode_from_stream(in_stream, True)
File "apache_beam/coders/coder_impl.py", line 1890, in apache_beam.coders.coder_impl.LogicalTypeCoderImpl.decode_from_stream
return self.logical_type.to_language_type(
File "<https://ci-beam.apache.org/job/beam_PostCommit_Python38/ws/src/sdks/python/apache_beam/typehints/schemas.py",> line 1000, in to_language_type
File "apache_beam/coders/coder_impl.py", line 1488, in apache_beam.coders.coder_impl.WindowedValueCoderImpl.decode_from_stream
value = self._value_coder.decode_from_stream(in_stream, nested)
File "apache_beam/coders/coder_impl.py", line 1837, in apache_beam.coders.coder_impl.RowCoderImpl.decode_from_stream
item = component_coder.decode_from_stream(in_stream, True)
File "apache_beam/coders/coder_impl.py", line 1890, in apache_beam.coders.coder_impl.LogicalTypeCoderImpl.decode_from_stream
return self.logical_type.to_language_type(
File "<https://ci-beam.apache.org/job/beam_PostCommit_Python38/ws/src/sdks/python/apache_beam/typehints/schemas.py",> line 1000, in to_language_type
return DecimalLogicalType().to_language_type(value)
File "<https://ci-beam.apache.org/job/beam_PostCommit_Python38/ws/src/sdks/python/apache_beam/typehints/schemas.py",> line 962, in to_language_type
return DecimalLogicalType().to_language_type(value)
File "<https://ci-beam.apache.org/job/beam_PostCommit_Python38/ws/src/sdks/python/apache_beam/typehints/schemas.py",> line 962, in to_language_type
return decimal.Decimal(value.decode())
AttributeError: 'decimal.Decimal' object has no attribute 'decode'
The above exception was the direct cause of the following exception:
return decimal.Decimal(value.decode())
AttributeError: 'decimal.Decimal' object has no attribute 'decode'
The above exception was the direct cause of the following exception:
Traceback (most recent call last):
File "<https://ci-beam.apache.org/job/beam_PostCommit_Python38/ws/src/sdks/python/apache_beam/runners/worker/sdk_worker.py",> line 300, in _execute
response = task()
File "<https://ci-beam.apache.org/job/beam_PostCommit_Python38/ws/src/sdks/python/apache_beam/runners/worker/sdk_worker.py",> line 375, in <lambda>
lambda: self.create_worker().do_instruction(request), request)
File "<https://ci-beam.apache.org/job/beam_PostCommit_Python38/ws/src/sdks/python/apache_beam/runners/worker/sdk_worker.py",> line 631, in do_instruction
return getattr(self, request_type)(
File "<https://ci-beam.apache.org/job/beam_PostCommit_Python38/ws/src/sdks/python/apache_beam/runners/worker/sdk_worker.py",> line 669, in process_bundle
bundle_processor.process_bundle(instruction_id))
File "<https://ci-beam.apache.org/job/beam_PostCommit_Python38/ws/src/sdks/python/apache_beam/runners/worker/bundle_processor.py",> line 1113, in process_bundle
input_op_by_transform_id[element.transform_id].process_encoded(
File "<https://ci-beam.apache.org/job/beam_PostCommit_Python38/ws/src/sdks/python/apache_beam/runners/worker/bundle_processor.py",> line 234, in process_encoded
raise ValueError(
ValueError: Error decoding input stream with coder WindowedValueCoder[RowCoder]
Traceback (most recent call last):
File "<https://ci-beam.apache.org/job/beam_PostCommit_Python38/ws/src/sdks/python/apache_beam/runners/worker/sdk_worker.py",> line 300, in _execute
response = task()
File "<https://ci-beam.apache.org/job/beam_PostCommit_Python38/ws/src/sdks/python/apache_beam/runners/worker/sdk_worker.py",> line 375, in <lambda>
lambda: self.create_worker().do_instruction(request), request)
File "<https://ci-beam.apache.org/job/beam_PostCommit_Python38/ws/src/sdks/python/apache_beam/runners/worker/sdk_worker.py",> line 631, in do_instruction
return getattr(self, request_type)(
File "<https://ci-beam.apache.org/job/beam_PostCommit_Python38/ws/src/sdks/python/apache_beam/runners/worker/sdk_worker.py",> line 669, in process_bundle
bundle_processor.process_bundle(instruction_id))
File "<https://ci-beam.apache.org/job/beam_PostCommit_Python38/ws/src/sdks/python/apache_beam/runners/worker/bundle_processor.py",> line 1113, in process_bundle
input_op_by_transform_id[element.transform_id].process_encoded(
File "<https://ci-beam.apache.org/job/beam_PostCommit_Python38/ws/src/sdks/python/apache_beam/runners/worker/bundle_processor.py",> line 234, in process_encoded
raise ValueError(
ValueError: Error decoding input stream with coder WindowedValueCoder[RowCoder]
======= 1 failed, 19 passed, 7 skipped, 5 warnings in 650.00s (0:10:50) ========
> Task :sdks:python:test-suites:portable:py38:postCommitPy38IT FAILED
> Task :sdks:python:test-suites:dataflow:py38:vertexAIInferenceTest
[gw0] [32mPASSED[0m apache_beam/ml/inference/vertex_ai_inference_it_test.py::VertexAIInference::test_vertex_ai_run_flower_image_classification
- generated xml file: <https://ci-beam.apache.org/job/beam_PostCommit_Python38/ws/src/sdks/python/pytest_VertexAITests-df-py-py38.xml> -
[32m================== [32m[1m2 passed[0m, [33m15 skipped[0m[32m in 1428.05s (0:23:48)[0m[32m ==================[0m
> Task :sdks:python:test-suites:dataflow:py38:inferencePostCommitIT
> Task :sdks:python:test-suites:dataflow:py38:postCommitIT
2023-12-12 15:04:45.840429: I tensorflow/tsl/cuda/cudart_stub.cc:28] Could not find cuda drivers on your machine, GPU will not be used.
2023-12-12 15:04:45.840431: I tensorflow/tsl/cuda/cudart_stub.cc:28] Could not find cuda drivers on your machine, GPU will not be used.
2023-12-12 15:04:45.840429: I tensorflow/tsl/cuda/cudart_stub.cc:28] Could not find cuda drivers on your machine, GPU will not be used.
2023-12-12 15:04:45.840463: I tensorflow/tsl/cuda/cudart_stub.cc:28] Could not find cuda drivers on your machine, GPU will not be used.
2023-12-12 15:04:45.843293: I tensorflow/tsl/cuda/cudart_stub.cc:28] Could not find cuda drivers on your machine, GPU will not be used.
2023-12-12 15:04:45.940584: I tensorflow/tsl/cuda/cudart_stub.cc:28] Could not find cuda drivers on your machine, GPU will not be used.
2023-12-12 15:04:45.940584: I tensorflow/tsl/cuda/cudart_stub.cc:28] Could not find cuda drivers on your machine, GPU will not be used.
2023-12-12 15:04:45.940772: I tensorflow/tsl/cuda/cudart_stub.cc:28] Could not find cuda drivers on your machine, GPU will not be used.
2023-12-12 15:04:45.941355: I tensorflow/tsl/cuda/cudart_stub.cc:28] Could not find cuda drivers on your machine, GPU will not be used.
2023-12-12 15:04:45.941355: I tensorflow/tsl/cuda/cudart_stub.cc:28] Could not find cuda drivers on your machine, GPU will not be used.
2023-12-12 15:04:45.941499: I tensorflow/core/platform/cpu_feature_guard.cc:182] This TensorFlow binary is optimized to use available CPU instructions in performance-critical operations.
To enable the following instructions: AVX2 FMA, in other operations, rebuild TensorFlow with the appropriate compiler flags.
2023-12-12 15:04:45.941660: I tensorflow/core/platform/cpu_feature_guard.cc:182] This TensorFlow binary is optimized to use available CPU instructions in performance-critical operations.
To enable the following instructions: AVX2 FMA, in other operations, rebuild TensorFlow with the appropriate compiler flags.
2023-12-12 15:04:45.941662: I tensorflow/core/platform/cpu_feature_guard.cc:182] This TensorFlow binary is optimized to use available CPU instructions in performance-critical operations.
To enable the following instructions: AVX2 FMA, in other operations, rebuild TensorFlow with the appropriate compiler flags.
2023-12-12 15:04:45.942254: I tensorflow/core/platform/cpu_feature_guard.cc:182] This TensorFlow binary is optimized to use available CPU instructions in performance-critical operations.
To enable the following instructions: AVX2 FMA, in other operations, rebuild TensorFlow with the appropriate compiler flags.
2023-12-12 15:04:45.942365: I tensorflow/core/platform/cpu_feature_guard.cc:182] This TensorFlow binary is optimized to use available CPU instructions in performance-critical operations.
To enable the following instructions: AVX2 FMA, in other operations, rebuild TensorFlow with the appropriate compiler flags.
2023-12-12 15:04:45.954386: I tensorflow/tsl/cuda/cudart_stub.cc:28] Could not find cuda drivers on your machine, GPU will not be used.
2023-12-12 15:04:46.050674: I tensorflow/tsl/cuda/cudart_stub.cc:28] Could not find cuda drivers on your machine, GPU will not be used.
2023-12-12 15:04:46.052554: I tensorflow/tsl/cuda/cudart_stub.cc:28] Could not find cuda drivers on your machine, GPU will not be used.
2023-12-12 15:04:46.053575: I tensorflow/core/platform/cpu_feature_guard.cc:182] This TensorFlow binary is optimized to use available CPU instructions in performance-critical operations.
To enable the following instructions: AVX2 FMA, in other operations, rebuild TensorFlow with the appropriate compiler flags.
2023-12-12 15:04:46.149896: I tensorflow/tsl/cuda/cudart_stub.cc:28] Could not find cuda drivers on your machine, GPU will not be used.
2023-12-12 15:04:46.150918: I tensorflow/core/platform/cpu_feature_guard.cc:182] This TensorFlow binary is optimized to use available CPU instructions in performance-critical operations.
To enable the following instructions: AVX2 FMA, in other operations, rebuild TensorFlow with the appropriate compiler flags.
2023-12-12 15:04:46.212096: I tensorflow/tsl/cuda/cudart_stub.cc:28] Could not find cuda drivers on your machine, GPU will not be used.
2023-12-12 15:04:46.309725: I tensorflow/tsl/cuda/cudart_stub.cc:28] Could not find cuda drivers on your machine, GPU will not be used.
2023-12-12 15:04:46.310606: I tensorflow/core/platform/cpu_feature_guard.cc:182] This TensorFlow binary is optimized to use available CPU instructions in performance-critical operations.
To enable the following instructions: AVX2 FMA, in other operations, rebuild TensorFlow with the appropriate compiler flags.
2023-12-12 15:04:47.373063: W tensorflow/compiler/tf2tensorrt/utils/py_utils.cc:38] TF-TRT Warning: Could not find TensorRT
2023-12-12 15:04:47.471747: W tensorflow/compiler/tf2tensorrt/utils/py_utils.cc:38] TF-TRT Warning: Could not find TensorRT
2023-12-12 15:04:47.491777: W tensorflow/compiler/tf2tensorrt/utils/py_utils.cc:38] TF-TRT Warning: Could not find TensorRT
2023-12-12 15:04:47.518345: W tensorflow/compiler/tf2tensorrt/utils/py_utils.cc:38] TF-TRT Warning: Could not find TensorRT
2023-12-12 15:04:47.519068: W tensorflow/compiler/tf2tensorrt/utils/py_utils.cc:38] TF-TRT Warning: Could not find TensorRT
2023-12-12 15:04:47.571552: W tensorflow/compiler/tf2tensorrt/utils/py_utils.cc:38] TF-TRT Warning: Could not find TensorRT
2023-12-12 15:04:47.771605: W tensorflow/compiler/tf2tensorrt/utils/py_utils.cc:38] TF-TRT Warning: Could not find TensorRT
2023-12-12 15:04:47.951584: W tensorflow/compiler/tf2tensorrt/utils/py_utils.cc:38] TF-TRT Warning: Could not find TensorRT
<https://ci-beam.apache.org/job/beam_PostCommit_Python38/ws/src/build/gradleenv/-1734967051/bin/python3.8>: No module named build
warning: sdist: standard file not found: should have one of README, README.rst, README.txt, README.md
warning: check: missing required meta-data: url
warning: check: missing meta-data: either (author and author_email) or (maintainer and maintainer_email) must be supplied
FAILURE: Build failed with an exception.
* Where:
Script '<https://ci-beam.apache.org/job/beam_PostCommit_Python38/ws/src/sdks/python/test-suites/portable/common.gradle'> line: 326
* What went wrong:
Execution failed for task ':sdks:python:test-suites:portable:py38:postCommitPy38IT'.
> Process 'command 'sh'' finished with non-zero exit value 1
* Try:
> Run with --stacktrace option to get the stack trace.
> Run with --info or --debug option to get more log output.
> Get more help at https://help.gradle.org.
Deprecated Gradle features were used in this build, making it incompatible with Gradle 9.0.
You can use '--warning-mode all' to show the individual deprecation warnings and determine if they come from your own scripts or plugins.
For more on this, please refer to https://docs.gradle.org/8.4/userguide/command_line_interface.html#sec:command_line_warnings in the Gradle documentation.
BUILD FAILED in 2h 33m
224 actionable tasks: 206 executed, 14 from cache, 4 up-to-date
Publishing build scan...
https://ge.apache.org/s/fy3o6ggcgw66c
Build step 'Invoke Gradle script' changed build result to FAILURE
Build step 'Invoke Gradle script' marked build as failure
---------------------------------------------------------------------
To unsubscribe, e-mail: builds-unsubscribe@beam.apache.org
For additional commands, e-mail: builds-help@beam.apache.org