You are viewing a plain text version of this content. The canonical link for it is here.
Posted to builds@cassandra.apache.org by Apache Jenkins Server <je...@builds.apache.org> on 2026/04/12 07:04:49 UTC

Build complete: Cassandra-4.1 #645 [UNSTABLE] 5e2468bf59581bcae9a55b4c3277dff2f8727a26

-------------------------------------------------------------------------------
Build Cassandra-4.1 #645 Still Unstable
URL: https://ci-cassandra.apache.org/job/Cassandra-4.1/645/
-------------------------------------------------------------------------------
Changes:
[Patrick McFadin] Remove duplicate paragraph in storage_engine.adoc

[Patrick McFadin] Fix broken linkage in Material View docs


-------------------------------------------------------------------------------
Failed Tests:
9 tests failed.
FAILED:  dtest-novnode.materialized_views_test.TestMaterializedViews.test_complex_mv_select_statements
FAILED:  dtest-novnode.cql_tracing_test.TestCqlTracing.test_tracing_simple
FAILED:  dtest-offheap.auth_test.TestAuthUnavailable.test_authentication_through_cache_handle_unavailable
FAILED:  dtest-upgrade.upgrade_tests.cql_tests.TestCQLNodes3RF3_Upgrade_indev_4_0_x_To_indev_4_1_x.test_internal_application_error_on_select
FAILED:  dtest.materialized_views_test.TestMaterializedViews.test_gcgs_validation
FAILED:  org.apache.cassandra.db.compaction.CompactionsCQLTest.testIndexedReaderRT-compression
FAILED:  dtest-novnode.materialized_views_test.TestMaterializedViews.test_gcgs_validation
FAILED:  dtest-novnode.materialized_views_test.TestMaterializedViews.test_drop_with_stopped_build
FAILED:  org.apache.cassandra.distributed.upgrade.MixedModeReadTest.mixedModeReadColumnSubsetDigestCheck

-------------------------------------------------------------------------------
For complete test report and logs see https://nightlies.apache.org/cassandra/Cassandra-4.1/645/