You are viewing a plain text version of this content. The canonical link for it is here.
Posted to yarn-dev@hadoop.apache.org by Apache Jenkins Server <je...@builds.apache.org> on 2015/01/21 00:06:57 UTC

Failed: YARN-2731 PreCommit Build #6368

Jira: https://issues.apache.org/jira/browse/YARN-2731
Build: https://builds.apache.org/job/PreCommit-YARN-Build/6368/

###################################################################################
########################## LAST 60 LINES OF THE CONSOLE ###########################
[...truncated 3204 lines...]
{color:red}-1 overall{color}.  Here are the results of testing the latest attachment 
  http://issues.apache.org/jira/secure/attachment/12676492/YARN-2731.patch
  against trunk revision dd0228b.

    {color:green}+1 @author{color}.  The patch does not contain any @author tags.

    {color:red}-1 tests included{color}.  The patch doesn't appear to include any new or modified tests.
                        Please justify why no new tests are needed for this patch.
                        Also please list what manual steps were performed to verify this patch.

    {color:green}+1 javac{color}.  The applied patch does not increase the total number of javac compiler warnings.

    {color:green}+1 javadoc{color}.  There were no new javadoc warning messages.

    {color:green}+1 eclipse:eclipse{color}.  The patch built with eclipse:eclipse.

    {color:green}+1 findbugs{color}.  The patch does not introduce any new Findbugs (version 2.0.3) warnings.

    {color:green}+1 release audit{color}.  The applied patch does not increase the total number of release audit warnings.

    {color:green}+1 core tests{color}.  The patch passed unit tests in hadoop-yarn-project/hadoop-yarn/hadoop-yarn-common.

Test results: https://builds.apache.org/job/PreCommit-YARN-Build/6368//testReport/
Console output: https://builds.apache.org/job/PreCommit-YARN-Build/6368//console

This message is automatically generated.


======================================================================
======================================================================
    Adding comment to Jira.
======================================================================
======================================================================


Comment added.
f4fa795b900da18c1b79dbadb0c43e702da88e81 logged out


======================================================================
======================================================================
    Finished build.
======================================================================
======================================================================


Build step 'Execute shell' marked build as failure
Archiving artifacts
Sending artifact delta relative to PreCommit-YARN-Build #6366
Archived 35 artifacts
Archive block size is 32768
Received 2 blocks and 9733064 bytes
Compression is 0.7%
Took 2.7 sec
[description-setter] Could not determine description.
Recording test results
Publish JUnit test result report is waiting for a checkpoint on PreCommit-YARN-Build #6367
Email was triggered for: Failure
Sending email for trigger: Failure



###################################################################################
############################## FAILED TESTS (if any) ##############################
All tests passed

Success: YARN-3075 PreCommit Build #6377

Posted by Apache Jenkins Server <je...@builds.apache.org>.
Jira: https://issues.apache.org/jira/browse/YARN-3075
Build: https://builds.apache.org/job/PreCommit-YARN-Build/6377/

###################################################################################
########################## LAST 60 LINES OF THE CONSOLE ###########################
[...truncated 3199 lines...]




{color:green}+1 overall{color}.  Here are the results of testing the latest attachment 
  http://issues.apache.org/jira/secure/attachment/12693627/YARN-3075.001.patch
  against trunk revision 4271554.

    {color:green}+1 @author{color}.  The patch does not contain any @author tags.

    {color:green}+1 tests included{color}.  The patch appears to include 3 new or modified test files.

    {color:green}+1 javac{color}.  The applied patch does not increase the total number of javac compiler warnings.

    {color:green}+1 javadoc{color}.  There were no new javadoc warning messages.

    {color:green}+1 eclipse:eclipse{color}.  The patch built with eclipse:eclipse.

    {color:green}+1 findbugs{color}.  The patch does not introduce any new Findbugs (version 2.0.3) warnings.

    {color:green}+1 release audit{color}.  The applied patch does not increase the total number of release audit warnings.

    {color:green}+1 core tests{color}.  The patch passed unit tests in hadoop-yarn-project/hadoop-yarn/hadoop-yarn-common.

Test results: https://builds.apache.org/job/PreCommit-YARN-Build/6377//testReport/
Console output: https://builds.apache.org/job/PreCommit-YARN-Build/6377//console

This message is automatically generated.


======================================================================
======================================================================
    Adding comment to Jira.
======================================================================
======================================================================


Comment added.
ceb3a64c8e9d038de73896ab53cd35f402fd6ebf logged out


======================================================================
======================================================================
    Finished build.
======================================================================
======================================================================


Archiving artifacts
Sending artifact delta relative to PreCommit-YARN-Build #6366
Archived 15 artifacts
Archive block size is 32768
Received 52 blocks and 7162151 bytes
Compression is 19.2%
Took 1.5 sec
Description set: YARN-3075
Recording test results
Email was triggered for: Success
Sending email for trigger: Success



###################################################################################
############################## FAILED TESTS (if any) ##############################
All tests passed

Failed: YARN-3079 PreCommit Build #6376

Posted by Apache Jenkins Server <je...@builds.apache.org>.
Jira: https://issues.apache.org/jira/browse/YARN-3079
Build: https://builds.apache.org/job/PreCommit-YARN-Build/6376/

###################################################################################
########################## LAST 60 LINES OF THE CONSOLE ###########################
[...truncated 3299 lines...]


{color:red}-1 overall{color}.  Here are the results of testing the latest attachment 
  http://issues.apache.org/jira/secure/attachment/12693628/YARN-3079.001.patch
  against trunk revision 4271554.

    {color:green}+1 @author{color}.  The patch does not contain any @author tags.

    {color:green}+1 tests included{color}.  The patch appears to include 1 new or modified test files.

    {color:green}+1 javac{color}.  The applied patch does not increase the total number of javac compiler warnings.

    {color:green}+1 javadoc{color}.  There were no new javadoc warning messages.

    {color:green}+1 eclipse:eclipse{color}.  The patch built with eclipse:eclipse.

    {color:red}-1 findbugs{color}.  The patch appears to introduce 4 new Findbugs (version 2.0.3) warnings.

    {color:green}+1 release audit{color}.  The applied patch does not increase the total number of release audit warnings.

    {color:green}+1 core tests{color}.  The patch passed unit tests in hadoop-yarn-project/hadoop-yarn/hadoop-yarn-server/hadoop-yarn-server-resourcemanager.

Test results: https://builds.apache.org/job/PreCommit-YARN-Build/6376//testReport/
Findbugs warnings: https://builds.apache.org/job/PreCommit-YARN-Build/6376//artifact/patchprocess/newPatchFindbugsWarningshadoop-yarn-server-resourcemanager.html
Console output: https://builds.apache.org/job/PreCommit-YARN-Build/6376//console

This message is automatically generated.


======================================================================
======================================================================
    Adding comment to Jira.
======================================================================
======================================================================


Comment added.
b012e6c0cf69c85e259d4b18e949128451b6c244 logged out


======================================================================
======================================================================
    Finished build.
======================================================================
======================================================================


Build step 'Execute shell' marked build as failure
Archiving artifacts
Sending artifact delta relative to PreCommit-YARN-Build #6366
Archived 15 artifacts
Archive block size is 32768
Received 236 blocks and 1184501 bytes
Compression is 86.7%
Took 1 sec
[description-setter] Could not determine description.
Recording test results
Email was triggered for: Failure
Sending email for trigger: Failure



###################################################################################
############################## FAILED TESTS (if any) ##############################
All tests passed

Failed: YARN-3079 PreCommit Build #6375

Posted by Apache Jenkins Server <je...@builds.apache.org>.
Jira: https://issues.apache.org/jira/browse/YARN-3079
Build: https://builds.apache.org/job/PreCommit-YARN-Build/6375/

###################################################################################
########################## LAST 60 LINES OF THE CONSOLE ###########################
[...truncated 3309 lines...]
{color:red}-1 overall{color}.  Here are the results of testing the latest attachment 
  http://issues.apache.org/jira/secure/attachment/12693547/YARN-3079.001.patch
  against trunk revision 6b17eb9.

    {color:green}+1 @author{color}.  The patch does not contain any @author tags.

    {color:green}+1 tests included{color}.  The patch appears to include 1 new or modified test files.

    {color:green}+1 javac{color}.  The applied patch does not increase the total number of javac compiler warnings.

    {color:green}+1 javadoc{color}.  There were no new javadoc warning messages.

    {color:green}+1 eclipse:eclipse{color}.  The patch built with eclipse:eclipse.

    {color:red}-1 findbugs{color}.  The patch appears to introduce 4 new Findbugs (version 2.0.3) warnings.

    {color:green}+1 release audit{color}.  The applied patch does not increase the total number of release audit warnings.

    {color:red}-1 core tests{color}.  The patch failed these unit tests in hadoop-yarn-project/hadoop-yarn/hadoop-yarn-server/hadoop-yarn-server-resourcemanager:

                  org.apache.hadoop.yarn.server.resourcemanager.TestApplicationCleanup

Test results: https://builds.apache.org/job/PreCommit-YARN-Build/6375//testReport/
Findbugs warnings: https://builds.apache.org/job/PreCommit-YARN-Build/6375//artifact/patchprocess/newPatchFindbugsWarningshadoop-yarn-server-resourcemanager.html
Console output: https://builds.apache.org/job/PreCommit-YARN-Build/6375//console

This message is automatically generated.


======================================================================
======================================================================
    Adding comment to Jira.
======================================================================
======================================================================


Comment added.
2124b5bc92a6b2cbc8e22596ea8dc8ffcd6cb243 logged out


======================================================================
======================================================================
    Finished build.
======================================================================
======================================================================


Build step 'Execute shell' marked build as failure
Archiving artifacts
Sending artifact delta relative to PreCommit-YARN-Build #6366
Archived 15 artifacts
Archive block size is 32768
Received 55 blocks and 7115207 bytes
Compression is 20.2%
Took 1.9 sec
[description-setter] Could not determine description.
Recording test results
Email was triggered for: Failure
Sending email for trigger: Failure



###################################################################################
############################## FAILED TESTS (if any) ##############################
1 tests failed.
REGRESSION:  org.apache.hadoop.yarn.server.resourcemanager.TestApplicationCleanup.testAppCleanup

Error Message:
Failed to load class: [org.apache.hadoop.yarn.api.protocolrecords.impl.pb.FinishApplicationMasterRequestPBImpl]

Stack Trace:
org.apache.hadoop.yarn.exceptions.YarnRuntimeException: Failed to load class: [org.apache.hadoop.yarn.api.protocolrecords.impl.pb.FinishApplicationMasterRequestPBImpl]
	at org.apache.hadoop.conf.Configuration.getClassByName(Configuration.java:2022)
	at org.apache.hadoop.yarn.factories.impl.pb.RecordFactoryPBImpl.newRecordInstance(RecordFactoryPBImpl.java:56)
	at org.apache.hadoop.yarn.util.Records.newRecord(Records.java:36)
	at org.apache.hadoop.yarn.api.protocolrecords.FinishApplicationMasterRequest.newInstance(FinishApplicationMasterRequest.java:52)
	at org.apache.hadoop.yarn.server.resourcemanager.MockAM.unregisterAppAttempt(MockAM.java:258)
	at org.apache.hadoop.yarn.server.resourcemanager.MockAM.unregisterAppAttempt(MockAM.java:253)
	at org.apache.hadoop.yarn.server.resourcemanager.TestApplicationCleanup.testAppCleanup(TestApplicationCleanup.java:119)



Failed: YARN-3079 PreCommit Build #6374

Posted by Apache Jenkins Server <je...@builds.apache.org>.
Jira: https://issues.apache.org/jira/browse/YARN-3079
Build: https://builds.apache.org/job/PreCommit-YARN-Build/6374/

###################################################################################
########################## LAST 60 LINES OF THE CONSOLE ###########################
[...truncated 3297 lines...]
{color:red}-1 overall{color}.  Here are the results of testing the latest attachment 
  http://issues.apache.org/jira/secure/attachment/12693539/YARN-3079.000.patch
  against trunk revision 6b17eb9.

    {color:green}+1 @author{color}.  The patch does not contain any @author tags.

    {color:red}-1 tests included{color}.  The patch doesn't appear to include any new or modified tests.
                        Please justify why no new tests are needed for this patch.
                        Also please list what manual steps were performed to verify this patch.

    {color:green}+1 javac{color}.  The applied patch does not increase the total number of javac compiler warnings.

    {color:green}+1 javadoc{color}.  There were no new javadoc warning messages.

    {color:green}+1 eclipse:eclipse{color}.  The patch built with eclipse:eclipse.

    {color:red}-1 findbugs{color}.  The patch appears to introduce 4 new Findbugs (version 2.0.3) warnings.

    {color:green}+1 release audit{color}.  The applied patch does not increase the total number of release audit warnings.

    {color:green}+1 core tests{color}.  The patch passed unit tests in hadoop-yarn-project/hadoop-yarn/hadoop-yarn-server/hadoop-yarn-server-resourcemanager.

Test results: https://builds.apache.org/job/PreCommit-YARN-Build/6374//testReport/
Findbugs warnings: https://builds.apache.org/job/PreCommit-YARN-Build/6374//artifact/patchprocess/newPatchFindbugsWarningshadoop-yarn-server-resourcemanager.html
Console output: https://builds.apache.org/job/PreCommit-YARN-Build/6374//console

This message is automatically generated.


======================================================================
======================================================================
    Adding comment to Jira.
======================================================================
======================================================================


Comment added.
3e1ace18ac9d7381262093843425eab6d24d558c logged out


======================================================================
======================================================================
    Finished build.
======================================================================
======================================================================


Build step 'Execute shell' marked build as failure
Archiving artifacts
Sending artifact delta relative to PreCommit-YARN-Build #6366
Archived 15 artifacts
Archive block size is 32768
Received 239 blocks and 1085770 bytes
Compression is 87.8%
Took 1.1 sec
[description-setter] Could not determine description.
Recording test results
Email was triggered for: Failure
Sending email for trigger: Failure



###################################################################################
############################## FAILED TESTS (if any) ##############################
All tests passed

Failed: YARN-3057 PreCommit Build #6373

Posted by Apache Jenkins Server <je...@builds.apache.org>.
Jira: https://issues.apache.org/jira/browse/YARN-3057
Build: https://builds.apache.org/job/PreCommit-YARN-Build/6373/

###################################################################################
########################## LAST 60 LINES OF THE CONSOLE ###########################
[...truncated 3012 lines...]
awk: cannot open /home/jenkins/jenkins-slave/workspace/PreCommit-YARN-Build@2/../patchprocess/testrun_hadoop-yarn-server-resourcemanager.txt (No such file or directory)
/home/jenkins/jenkins-slave/workspace/PreCommit-YARN-Build@2




{color:red}-1 overall{color}.  Here are the results of testing the latest attachment 
  http://issues.apache.org/jira/secure/attachment/12693533/YARN-3057.patch
  against trunk revision 6b17eb9.

    {color:green}+1 @author{color}.  The patch does not contain any @author tags.

    {color:green}+1 tests included{color}.  The patch appears to include 1 new or modified test files.

    {color:green}+1 javac{color}.  The applied patch does not increase the total number of javac compiler warnings.

    {color:green}+1 javadoc{color}.  There were no new javadoc warning messages.

    {color:green}+1 eclipse:eclipse{color}.  The patch built with eclipse:eclipse.

    {color:green}+1 findbugs{color}.  The patch does not introduce any new Findbugs (version 2.0.3) warnings.

    {color:green}+1 release audit{color}.  The applied patch does not increase the total number of release audit warnings.

    {color:red}-1 core tests{color}.  The patch failed these unit tests in hadoop-yarn-project/hadoop-yarn/hadoop-yarn-server/hadoop-yarn-server-resourcemanager:

                  org.apache.hadoop.yarn.server.resourcemanager.webapp.TestRMWebServicesAppsModification
                  org.apache.hadoop.yarn.server.resourcemanager.scheduler.fair.TestAllocationFileLoaderService

Test results: https://builds.apache.org/job/PreCommit-YARN-Build/6373//testReport/
Console output: https://builds.apache.org/job/PreCommit-YARN-Build/6373//console

This message is automatically generated.


======================================================================
======================================================================
    Adding comment to Jira.
======================================================================
======================================================================


Comment added.
d29bd15e6ff2e79e97819872807c2c533075dea6 logged out


======================================================================
======================================================================
    Finished build.
======================================================================
======================================================================


Build step 'Execute shell' marked build as failure
Archiving artifacts
[description-setter] Could not determine description.
Recording test results
Email was triggered for: Failure
Sending email for trigger: Failure



###################################################################################
############################## FAILED TESTS (if any) ##############################
10 tests failed.
REGRESSION:  org.apache.hadoop.yarn.server.resourcemanager.scheduler.fair.TestAllocationFileLoaderService.testGetAllocationFileFromClasspath

Error Message:
null

Stack Trace:
java.lang.AssertionError: null
	at org.junit.Assert.fail(Assert.java:86)
	at org.junit.Assert.assertTrue(Assert.java:41)
	at org.junit.Assert.assertTrue(Assert.java:52)
	at org.apache.hadoop.yarn.server.resourcemanager.scheduler.fair.TestAllocationFileLoaderService.testGetAllocationFileFromClasspath(TestAllocationFileLoaderService.java:66)


REGRESSION:  org.apache.hadoop.yarn.server.resourcemanager.webapp.TestRMWebServicesAppsModification.testAppMove[3]

Error Message:
Guice creation errors:

1) An exception was caught and reported. Message: java.util.zip.ZipException: invalid block type
  at com.google.inject.internal.InjectorShell$Builder.build(InjectorShell.java:133)

1 error

Stack Trace:
com.google.inject.CreationException: Guice creation errors:

1) An exception was caught and reported. Message: java.util.zip.ZipException: invalid block type
  at com.google.inject.internal.InjectorShell$Builder.build(InjectorShell.java:133)

1 error
	at java.util.zip.InflaterInputStream.read(InflaterInputStream.java:164)
	at java.util.zip.InflaterInputStream.read(InflaterInputStream.java:122)
	at java.io.FilterInputStream.read(FilterInputStream.java:83)
	at org.apache.xerces.impl.XMLEntityManager$RewindableInputStream.read(Unknown Source)
	at org.apache.xerces.impl.XMLEntityManager.setupCurrentEntity(Unknown Source)
	at org.apache.xerces.impl.XMLVersionDetector.determineDocVersion(Unknown Source)
	at org.apache.xerces.parsers.XML11Configuration.parse(Unknown Source)
	at org.apache.xerces.parsers.XML11Configuration.parse(Unknown Source)
	at org.apache.xerces.parsers.XMLParser.parse(Unknown Source)
	at org.apache.xerces.parsers.DOMParser.parse(Unknown Source)
	at org.apache.xerces.jaxp.DocumentBuilderImpl.parse(Unknown Source)
	at javax.xml.parsers.DocumentBuilder.parse(DocumentBuilder.java:150)
	at org.apache.hadoop.conf.Configuration.parse(Configuration.java:2396)
	at org.apache.hadoop.conf.Configuration.parse(Configuration.java:2384)
	at org.apache.hadoop.conf.Configuration.loadResource(Configuration.java:2455)
	at org.apache.hadoop.conf.Configuration.loadResources(Configuration.java:2408)
	at org.apache.hadoop.conf.Configuration.getProps(Configuration.java:2325)
	at org.apache.hadoop.conf.Configuration.set(Configuration.java:1064)
	at org.apache.hadoop.conf.Configuration.set(Configuration.java:1036)
	at org.apache.hadoop.conf.Configuration.setBoolean(Configuration.java:1374)
	at org.apache.hadoop.yarn.server.resourcemanager.webapp.TestRMWebServicesAppsModification$4.configureServlets(TestRMWebServicesAppsModification.java:256)
	at com.google.inject.servlet.ServletModule.configure(ServletModule.java:53)
	at com.google.inject.AbstractModule.configure(AbstractModule.java:59)
	at com.google.inject.spi.Elements$RecordingBinder.install(Elements.java:223)
	at com.google.inject.spi.Elements.getElements(Elements.java:101)
	at com.google.inject.internal.InjectorShell$Builder.build(InjectorShell.java:133)
	at com.google.inject.internal.InternalInjectorCreator.build(InternalInjectorCreator.java:103)
	at com.google.inject.Guice.createInjector(Guice.java:95)
	at com.google.inject.Guice.createInjector(Guice.java:72)
	at com.google.inject.Guice.createInjector(Guice.java:62)
	at org.apache.hadoop.yarn.server.resourcemanager.webapp.TestRMWebServicesAppsModification.getSimpleAuthInjectorFair(TestRMWebServicesAppsModification.java:252)
	at org.apache.hadoop.yarn.server.resourcemanager.webapp.TestRMWebServicesAppsModification.<init>(TestRMWebServicesAppsModification.java:299)


REGRESSION:  org.apache.hadoop.yarn.server.resourcemanager.webapp.TestRMWebServicesAppsModification.testSingleAppKill[3]

Error Message:
java.net.BindException: Address already in use

Stack Trace:
com.sun.jersey.test.framework.spi.container.TestContainerException: java.net.BindException: Address already in use
	at sun.nio.ch.Net.bind0(Native Method)
	at sun.nio.ch.Net.bind(Net.java:444)
	at sun.nio.ch.Net.bind(Net.java:436)
	at sun.nio.ch.ServerSocketChannelImpl.bind(ServerSocketChannelImpl.java:214)
	at sun.nio.ch.ServerSocketAdaptor.bind(ServerSocketAdaptor.java:74)
	at org.glassfish.grizzly.nio.transport.TCPNIOTransport.bind(TCPNIOTransport.java:413)
	at org.glassfish.grizzly.nio.transport.TCPNIOTransport.bind(TCPNIOTransport.java:384)
	at org.glassfish.grizzly.nio.transport.TCPNIOTransport.bind(TCPNIOTransport.java:375)
	at org.glassfish.grizzly.http.server.NetworkListener.start(NetworkListener.java:549)
	at org.glassfish.grizzly.http.server.HttpServer.start(HttpServer.java:255)
	at com.sun.jersey.api.container.grizzly2.GrizzlyServerFactory.createHttpServer(GrizzlyServerFactory.java:326)
	at com.sun.jersey.api.container.grizzly2.GrizzlyServerFactory.createHttpServer(GrizzlyServerFactory.java:343)
	at com.sun.jersey.test.framework.spi.container.grizzly2.web.GrizzlyWebTestContainerFactory$GrizzlyWebTestContainer.instantiateGrizzlyWebServer(GrizzlyWebTestContainerFactory.java:219)
	at com.sun.jersey.test.framework.spi.container.grizzly2.web.GrizzlyWebTestContainerFactory$GrizzlyWebTestContainer.<init>(GrizzlyWebTestContainerFactory.java:129)
	at com.sun.jersey.test.framework.spi.container.grizzly2.web.GrizzlyWebTestContainerFactory$GrizzlyWebTestContainer.<init>(GrizzlyWebTestContainerFactory.java:86)
	at com.sun.jersey.test.framework.spi.container.grizzly2.web.GrizzlyWebTestContainerFactory.create(GrizzlyWebTestContainerFactory.java:79)
	at com.sun.jersey.test.framework.JerseyTest.getContainer(JerseyTest.java:342)
	at com.sun.jersey.test.framework.JerseyTest.<init>(JerseyTest.java:217)
	at org.apache.hadoop.yarn.webapp.JerseyTestBase.<init>(JerseyTestBase.java:27)
	at org.apache.hadoop.yarn.server.resourcemanager.webapp.TestRMWebServicesAppsModification.<init>(TestRMWebServicesAppsModification.java:277)


REGRESSION:  org.apache.hadoop.yarn.server.resourcemanager.webapp.TestRMWebServicesAppsModification.testSingleAppKillInvalidState[3]

Error Message:
java.net.BindException: Address already in use

Stack Trace:
com.sun.jersey.test.framework.spi.container.TestContainerException: java.net.BindException: Address already in use
	at sun.nio.ch.Net.bind0(Native Method)
	at sun.nio.ch.Net.bind(Net.java:444)
	at sun.nio.ch.Net.bind(Net.java:436)
	at sun.nio.ch.ServerSocketChannelImpl.bind(ServerSocketChannelImpl.java:214)
	at sun.nio.ch.ServerSocketAdaptor.bind(ServerSocketAdaptor.java:74)
	at org.glassfish.grizzly.nio.transport.TCPNIOTransport.bind(TCPNIOTransport.java:413)
	at org.glassfish.grizzly.nio.transport.TCPNIOTransport.bind(TCPNIOTransport.java:384)
	at org.glassfish.grizzly.nio.transport.TCPNIOTransport.bind(TCPNIOTransport.java:375)
	at org.glassfish.grizzly.http.server.NetworkListener.start(NetworkListener.java:549)
	at org.glassfish.grizzly.http.server.HttpServer.start(HttpServer.java:255)
	at com.sun.jersey.api.container.grizzly2.GrizzlyServerFactory.createHttpServer(GrizzlyServerFactory.java:326)
	at com.sun.jersey.api.container.grizzly2.GrizzlyServerFactory.createHttpServer(GrizzlyServerFactory.java:343)
	at com.sun.jersey.test.framework.spi.container.grizzly2.web.GrizzlyWebTestContainerFactory$GrizzlyWebTestContainer.instantiateGrizzlyWebServer(GrizzlyWebTestContainerFactory.java:219)
	at com.sun.jersey.test.framework.spi.container.grizzly2.web.GrizzlyWebTestContainerFactory$GrizzlyWebTestContainer.<init>(GrizzlyWebTestContainerFactory.java:129)
	at com.sun.jersey.test.framework.spi.container.grizzly2.web.GrizzlyWebTestContainerFactory$GrizzlyWebTestContainer.<init>(GrizzlyWebTestContainerFactory.java:86)
	at com.sun.jersey.test.framework.spi.container.grizzly2.web.GrizzlyWebTestContainerFactory.create(GrizzlyWebTestContainerFactory.java:79)
	at com.sun.jersey.test.framework.JerseyTest.getContainer(JerseyTest.java:342)
	at com.sun.jersey.test.framework.JerseyTest.<init>(JerseyTest.java:217)
	at org.apache.hadoop.yarn.webapp.JerseyTestBase.<init>(JerseyTestBase.java:27)
	at org.apache.hadoop.yarn.server.resourcemanager.webapp.TestRMWebServicesAppsModification.<init>(TestRMWebServicesAppsModification.java:277)


REGRESSION:  org.apache.hadoop.yarn.server.resourcemanager.webapp.TestRMWebServicesAppsModification.testSingleAppKillUnauthorized[3]

Error Message:
java.net.BindException: Address already in use

Stack Trace:
com.sun.jersey.test.framework.spi.container.TestContainerException: java.net.BindException: Address already in use
	at sun.nio.ch.Net.bind0(Native Method)
	at sun.nio.ch.Net.bind(Net.java:444)
	at sun.nio.ch.Net.bind(Net.java:436)
	at sun.nio.ch.ServerSocketChannelImpl.bind(ServerSocketChannelImpl.java:214)
	at sun.nio.ch.ServerSocketAdaptor.bind(ServerSocketAdaptor.java:74)
	at org.glassfish.grizzly.nio.transport.TCPNIOTransport.bind(TCPNIOTransport.java:413)
	at org.glassfish.grizzly.nio.transport.TCPNIOTransport.bind(TCPNIOTransport.java:384)
	at org.glassfish.grizzly.nio.transport.TCPNIOTransport.bind(TCPNIOTransport.java:375)
	at org.glassfish.grizzly.http.server.NetworkListener.start(NetworkListener.java:549)
	at org.glassfish.grizzly.http.server.HttpServer.start(HttpServer.java:255)
	at com.sun.jersey.api.container.grizzly2.GrizzlyServerFactory.createHttpServer(GrizzlyServerFactory.java:326)
	at com.sun.jersey.api.container.grizzly2.GrizzlyServerFactory.createHttpServer(GrizzlyServerFactory.java:343)
	at com.sun.jersey.test.framework.spi.container.grizzly2.web.GrizzlyWebTestContainerFactory$GrizzlyWebTestContainer.instantiateGrizzlyWebServer(GrizzlyWebTestContainerFactory.java:219)
	at com.sun.jersey.test.framework.spi.container.grizzly2.web.GrizzlyWebTestContainerFactory$GrizzlyWebTestContainer.<init>(GrizzlyWebTestContainerFactory.java:129)
	at com.sun.jersey.test.framework.spi.container.grizzly2.web.GrizzlyWebTestContainerFactory$GrizzlyWebTestContainer.<init>(GrizzlyWebTestContainerFactory.java:86)
	at com.sun.jersey.test.framework.spi.container.grizzly2.web.GrizzlyWebTestContainerFactory.create(GrizzlyWebTestContainerFactory.java:79)
	at com.sun.jersey.test.framework.JerseyTest.getContainer(JerseyTest.java:342)
	at com.sun.jersey.test.framework.JerseyTest.<init>(JerseyTest.java:217)
	at org.apache.hadoop.yarn.webapp.JerseyTestBase.<init>(JerseyTestBase.java:27)
	at org.apache.hadoop.yarn.server.resourcemanager.webapp.TestRMWebServicesAppsModification.<init>(TestRMWebServicesAppsModification.java:277)


REGRESSION:  org.apache.hadoop.yarn.server.resourcemanager.webapp.TestRMWebServicesAppsModification.testGetNewApplication[3]

Error Message:
java.net.BindException: Address already in use

Stack Trace:
com.sun.jersey.test.framework.spi.container.TestContainerException: java.net.BindException: Address already in use
	at sun.nio.ch.Net.bind0(Native Method)
	at sun.nio.ch.Net.bind(Net.java:444)
	at sun.nio.ch.Net.bind(Net.java:436)
	at sun.nio.ch.ServerSocketChannelImpl.bind(ServerSocketChannelImpl.java:214)
	at sun.nio.ch.ServerSocketAdaptor.bind(ServerSocketAdaptor.java:74)
	at org.glassfish.grizzly.nio.transport.TCPNIOTransport.bind(TCPNIOTransport.java:413)
	at org.glassfish.grizzly.nio.transport.TCPNIOTransport.bind(TCPNIOTransport.java:384)
	at org.glassfish.grizzly.nio.transport.TCPNIOTransport.bind(TCPNIOTransport.java:375)
	at org.glassfish.grizzly.http.server.NetworkListener.start(NetworkListener.java:549)
	at org.glassfish.grizzly.http.server.HttpServer.start(HttpServer.java:255)
	at com.sun.jersey.api.container.grizzly2.GrizzlyServerFactory.createHttpServer(GrizzlyServerFactory.java:326)
	at com.sun.jersey.api.container.grizzly2.GrizzlyServerFactory.createHttpServer(GrizzlyServerFactory.java:343)
	at com.sun.jersey.test.framework.spi.container.grizzly2.web.GrizzlyWebTestContainerFactory$GrizzlyWebTestContainer.instantiateGrizzlyWebServer(GrizzlyWebTestContainerFactory.java:219)
	at com.sun.jersey.test.framework.spi.container.grizzly2.web.GrizzlyWebTestContainerFactory$GrizzlyWebTestContainer.<init>(GrizzlyWebTestContainerFactory.java:129)
	at com.sun.jersey.test.framework.spi.container.grizzly2.web.GrizzlyWebTestContainerFactory$GrizzlyWebTestContainer.<init>(GrizzlyWebTestContainerFactory.java:86)
	at com.sun.jersey.test.framework.spi.container.grizzly2.web.GrizzlyWebTestContainerFactory.create(GrizzlyWebTestContainerFactory.java:79)
	at com.sun.jersey.test.framework.JerseyTest.getContainer(JerseyTest.java:342)
	at com.sun.jersey.test.framework.JerseyTest.<init>(JerseyTest.java:217)
	at org.apache.hadoop.yarn.webapp.JerseyTestBase.<init>(JerseyTestBase.java:27)
	at org.apache.hadoop.yarn.server.resourcemanager.webapp.TestRMWebServicesAppsModification.<init>(TestRMWebServicesAppsModification.java:277)


REGRESSION:  org.apache.hadoop.yarn.server.resourcemanager.webapp.TestRMWebServicesAppsModification.testSingleAppKillInvalidId[3]

Error Message:
java.net.BindException: Address already in use

Stack Trace:
com.sun.jersey.test.framework.spi.container.TestContainerException: java.net.BindException: Address already in use
	at sun.nio.ch.Net.bind0(Native Method)
	at sun.nio.ch.Net.bind(Net.java:444)
	at sun.nio.ch.Net.bind(Net.java:436)
	at sun.nio.ch.ServerSocketChannelImpl.bind(ServerSocketChannelImpl.java:214)
	at sun.nio.ch.ServerSocketAdaptor.bind(ServerSocketAdaptor.java:74)
	at org.glassfish.grizzly.nio.transport.TCPNIOTransport.bind(TCPNIOTransport.java:413)
	at org.glassfish.grizzly.nio.transport.TCPNIOTransport.bind(TCPNIOTransport.java:384)
	at org.glassfish.grizzly.nio.transport.TCPNIOTransport.bind(TCPNIOTransport.java:375)
	at org.glassfish.grizzly.http.server.NetworkListener.start(NetworkListener.java:549)
	at org.glassfish.grizzly.http.server.HttpServer.start(HttpServer.java:255)
	at com.sun.jersey.api.container.grizzly2.GrizzlyServerFactory.createHttpServer(GrizzlyServerFactory.java:326)
	at com.sun.jersey.api.container.grizzly2.GrizzlyServerFactory.createHttpServer(GrizzlyServerFactory.java:343)
	at com.sun.jersey.test.framework.spi.container.grizzly2.web.GrizzlyWebTestContainerFactory$GrizzlyWebTestContainer.instantiateGrizzlyWebServer(GrizzlyWebTestContainerFactory.java:219)
	at com.sun.jersey.test.framework.spi.container.grizzly2.web.GrizzlyWebTestContainerFactory$GrizzlyWebTestContainer.<init>(GrizzlyWebTestContainerFactory.java:129)
	at com.sun.jersey.test.framework.spi.container.grizzly2.web.GrizzlyWebTestContainerFactory$GrizzlyWebTestContainer.<init>(GrizzlyWebTestContainerFactory.java:86)
	at com.sun.jersey.test.framework.spi.container.grizzly2.web.GrizzlyWebTestContainerFactory.create(GrizzlyWebTestContainerFactory.java:79)
	at com.sun.jersey.test.framework.JerseyTest.getContainer(JerseyTest.java:342)
	at com.sun.jersey.test.framework.JerseyTest.<init>(JerseyTest.java:217)
	at org.apache.hadoop.yarn.webapp.JerseyTestBase.<init>(JerseyTestBase.java:27)
	at org.apache.hadoop.yarn.server.resourcemanager.webapp.TestRMWebServicesAppsModification.<init>(TestRMWebServicesAppsModification.java:277)


REGRESSION:  org.apache.hadoop.yarn.server.resourcemanager.webapp.TestRMWebServicesAppsModification.testSingleAppState[3]

Error Message:
java.net.BindException: Address already in use

Stack Trace:
com.sun.jersey.test.framework.spi.container.TestContainerException: java.net.BindException: Address already in use
	at sun.nio.ch.Net.bind0(Native Method)
	at sun.nio.ch.Net.bind(Net.java:444)
	at sun.nio.ch.Net.bind(Net.java:436)
	at sun.nio.ch.ServerSocketChannelImpl.bind(ServerSocketChannelImpl.java:214)
	at sun.nio.ch.ServerSocketAdaptor.bind(ServerSocketAdaptor.java:74)
	at org.glassfish.grizzly.nio.transport.TCPNIOTransport.bind(TCPNIOTransport.java:413)
	at org.glassfish.grizzly.nio.transport.TCPNIOTransport.bind(TCPNIOTransport.java:384)
	at org.glassfish.grizzly.nio.transport.TCPNIOTransport.bind(TCPNIOTransport.java:375)
	at org.glassfish.grizzly.http.server.NetworkListener.start(NetworkListener.java:549)
	at org.glassfish.grizzly.http.server.HttpServer.start(HttpServer.java:255)
	at com.sun.jersey.api.container.grizzly2.GrizzlyServerFactory.createHttpServer(GrizzlyServerFactory.java:326)
	at com.sun.jersey.api.container.grizzly2.GrizzlyServerFactory.createHttpServer(GrizzlyServerFactory.java:343)
	at com.sun.jersey.test.framework.spi.container.grizzly2.web.GrizzlyWebTestContainerFactory$GrizzlyWebTestContainer.instantiateGrizzlyWebServer(GrizzlyWebTestContainerFactory.java:219)
	at com.sun.jersey.test.framework.spi.container.grizzly2.web.GrizzlyWebTestContainerFactory$GrizzlyWebTestContainer.<init>(GrizzlyWebTestContainerFactory.java:129)
	at com.sun.jersey.test.framework.spi.container.grizzly2.web.GrizzlyWebTestContainerFactory$GrizzlyWebTestContainer.<init>(GrizzlyWebTestContainerFactory.java:86)
	at com.sun.jersey.test.framework.spi.container.grizzly2.web.GrizzlyWebTestContainerFactory.create(GrizzlyWebTestContainerFactory.java:79)
	at com.sun.jersey.test.framework.JerseyTest.getContainer(JerseyTest.java:342)
	at com.sun.jersey.test.framework.JerseyTest.<init>(JerseyTest.java:217)
	at org.apache.hadoop.yarn.webapp.JerseyTestBase.<init>(JerseyTestBase.java:27)
	at org.apache.hadoop.yarn.server.resourcemanager.webapp.TestRMWebServicesAppsModification.<init>(TestRMWebServicesAppsModification.java:277)


REGRESSION:  org.apache.hadoop.yarn.server.resourcemanager.webapp.TestRMWebServicesAppsModification.testGetNewApplicationAndSubmit[3]

Error Message:
java.net.BindException: Address already in use

Stack Trace:
com.sun.jersey.test.framework.spi.container.TestContainerException: java.net.BindException: Address already in use
	at sun.nio.ch.Net.bind0(Native Method)
	at sun.nio.ch.Net.bind(Net.java:444)
	at sun.nio.ch.Net.bind(Net.java:436)
	at sun.nio.ch.ServerSocketChannelImpl.bind(ServerSocketChannelImpl.java:214)
	at sun.nio.ch.ServerSocketAdaptor.bind(ServerSocketAdaptor.java:74)
	at org.glassfish.grizzly.nio.transport.TCPNIOTransport.bind(TCPNIOTransport.java:413)
	at org.glassfish.grizzly.nio.transport.TCPNIOTransport.bind(TCPNIOTransport.java:384)
	at org.glassfish.grizzly.nio.transport.TCPNIOTransport.bind(TCPNIOTransport.java:375)
	at org.glassfish.grizzly.http.server.NetworkListener.start(NetworkListener.java:549)
	at org.glassfish.grizzly.http.server.HttpServer.start(HttpServer.java:255)
	at com.sun.jersey.api.container.grizzly2.GrizzlyServerFactory.createHttpServer(GrizzlyServerFactory.java:326)
	at com.sun.jersey.api.container.grizzly2.GrizzlyServerFactory.createHttpServer(GrizzlyServerFactory.java:343)
	at com.sun.jersey.test.framework.spi.container.grizzly2.web.GrizzlyWebTestContainerFactory$GrizzlyWebTestContainer.instantiateGrizzlyWebServer(GrizzlyWebTestContainerFactory.java:219)
	at com.sun.jersey.test.framework.spi.container.grizzly2.web.GrizzlyWebTestContainerFactory$GrizzlyWebTestContainer.<init>(GrizzlyWebTestContainerFactory.java:129)
	at com.sun.jersey.test.framework.spi.container.grizzly2.web.GrizzlyWebTestContainerFactory$GrizzlyWebTestContainer.<init>(GrizzlyWebTestContainerFactory.java:86)
	at com.sun.jersey.test.framework.spi.container.grizzly2.web.GrizzlyWebTestContainerFactory.create(GrizzlyWebTestContainerFactory.java:79)
	at com.sun.jersey.test.framework.JerseyTest.getContainer(JerseyTest.java:342)
	at com.sun.jersey.test.framework.JerseyTest.<init>(JerseyTest.java:217)
	at org.apache.hadoop.yarn.webapp.JerseyTestBase.<init>(JerseyTestBase.java:27)
	at org.apache.hadoop.yarn.server.resourcemanager.webapp.TestRMWebServicesAppsModification.<init>(TestRMWebServicesAppsModification.java:277)


REGRESSION:  org.apache.hadoop.yarn.server.resourcemanager.webapp.TestRMWebServicesAppsModification.testAppSubmitBadJsonAndXML[3]

Error Message:
java.net.BindException: Address already in use

Stack Trace:
com.sun.jersey.test.framework.spi.container.TestContainerException: java.net.BindException: Address already in use
	at sun.nio.ch.Net.bind0(Native Method)
	at sun.nio.ch.Net.bind(Net.java:444)
	at sun.nio.ch.Net.bind(Net.java:436)
	at sun.nio.ch.ServerSocketChannelImpl.bind(ServerSocketChannelImpl.java:214)
	at sun.nio.ch.ServerSocketAdaptor.bind(ServerSocketAdaptor.java:74)
	at org.glassfish.grizzly.nio.transport.TCPNIOTransport.bind(TCPNIOTransport.java:413)
	at org.glassfish.grizzly.nio.transport.TCPNIOTransport.bind(TCPNIOTransport.java:384)
	at org.glassfish.grizzly.nio.transport.TCPNIOTransport.bind(TCPNIOTransport.java:375)
	at org.glassfish.grizzly.http.server.NetworkListener.start(NetworkListener.java:549)
	at org.glassfish.grizzly.http.server.HttpServer.start(HttpServer.java:255)
	at com.sun.jersey.api.container.grizzly2.GrizzlyServerFactory.createHttpServer(GrizzlyServerFactory.java:326)
	at com.sun.jersey.api.container.grizzly2.GrizzlyServerFactory.createHttpServer(GrizzlyServerFactory.java:343)
	at com.sun.jersey.test.framework.spi.container.grizzly2.web.GrizzlyWebTestContainerFactory$GrizzlyWebTestContainer.instantiateGrizzlyWebServer(GrizzlyWebTestContainerFactory.java:219)
	at com.sun.jersey.test.framework.spi.container.grizzly2.web.GrizzlyWebTestContainerFactory$GrizzlyWebTestContainer.<init>(GrizzlyWebTestContainerFactory.java:129)
	at com.sun.jersey.test.framework.spi.container.grizzly2.web.GrizzlyWebTestContainerFactory$GrizzlyWebTestContainer.<init>(GrizzlyWebTestContainerFactory.java:86)
	at com.sun.jersey.test.framework.spi.container.grizzly2.web.GrizzlyWebTestContainerFactory.create(GrizzlyWebTestContainerFactory.java:79)
	at com.sun.jersey.test.framework.JerseyTest.getContainer(JerseyTest.java:342)
	at com.sun.jersey.test.framework.JerseyTest.<init>(JerseyTest.java:217)
	at org.apache.hadoop.yarn.webapp.JerseyTestBase.<init>(JerseyTestBase.java:27)
	at org.apache.hadoop.yarn.server.resourcemanager.webapp.TestRMWebServicesAppsModification.<init>(TestRMWebServicesAppsModification.java:277)



Failed: YARN-3077 PreCommit Build #6372

Posted by Apache Jenkins Server <je...@builds.apache.org>.
Jira: https://issues.apache.org/jira/browse/YARN-3077
Build: https://builds.apache.org/job/PreCommit-YARN-Build/6372/

###################################################################################
########################## LAST 60 LINES OF THE CONSOLE ###########################
[...truncated 3463 lines...]
    {color:green}+1 tests included{color}.  The patch appears to include 1 new or modified test files.

      {color:red}-1 javac{color}.  The applied patch generated 1204 javac compiler warnings (more than the trunk's current 72 warnings).

    {color:red}-1 javadoc{color}.  The javadoc tool appears to have generated 48 warning messages.
        See https://builds.apache.org/job/PreCommit-YARN-Build/6372//artifact/patchprocess/diffJavadocWarnings.txt for details.

    {color:green}+1 eclipse:eclipse{color}.  The patch built with eclipse:eclipse.

    {color:green}+1 findbugs{color}.  The patch does not introduce any new Findbugs (version 2.0.3) warnings.

    {color:green}+1 release audit{color}.  The applied patch does not increase the total number of release audit warnings.

    {color:red}-1 core tests{color}.  The patch failed these unit tests in hadoop-yarn-project/hadoop-yarn/hadoop-yarn-server/hadoop-yarn-server-resourcemanager:

                  org.apache.hadoop.yarn.server.resourcemanager.TestMoveApplication
                  org.apache.hadoop.yarn.server.resourcemanager.TestWorkPreservingRMRestart

                                      The following test timeouts occurred in hadoop-yarn-project/hadoop-yarn/hadoop-yarn-server/hadoop-yarn-server-resourcemanager:

org.apache.hadoop.yarn.server.resourcemanager.scheduler.capacity.TestCapacitySchedulerQueueACLs

Test results: https://builds.apache.org/job/PreCommit-YARN-Build/6372//testReport/
Javac warnings: https://builds.apache.org/job/PreCommit-YARN-Build/6372//artifact/patchprocess/diffJavacWarnings.txt
Console output: https://builds.apache.org/job/PreCommit-YARN-Build/6372//console

This message is automatically generated.


======================================================================
======================================================================
    Adding comment to Jira.
======================================================================
======================================================================


Comment added.
cb35cdba4c1255551a51784635171b9b0ec8365d logged out


======================================================================
======================================================================
    Finished build.
======================================================================
======================================================================


Build step 'Execute shell' marked build as failure
Archiving artifacts
Sending artifact delta relative to PreCommit-YARN-Build #6366
Archived 16 artifacts
Archive block size is 32768
Received 2 blocks and 9233348 bytes
Compression is 0.7%
Took 2.3 sec
[description-setter] Could not determine description.
Recording test results
Email was triggered for: Failure
Sending email for trigger: Failure



###################################################################################
############################## FAILED TESTS (if any) ##############################
13 tests failed.
REGRESSION:  org.apache.hadoop.yarn.server.resourcemanager.TestMoveApplication.testMoveTooLate

Error Message:
Error starting http server

Stack Trace:
org.apache.hadoop.yarn.webapp.WebAppException: Error starting http server
	at sun.nio.ch.Net.bind0(Native Method)
	at sun.nio.ch.Net.bind(Net.java:444)
	at sun.nio.ch.Net.bind(Net.java:436)
	at sun.nio.ch.ServerSocketChannelImpl.bind(ServerSocketChannelImpl.java:214)
	at sun.nio.ch.ServerSocketAdaptor.bind(ServerSocketAdaptor.java:74)
	at org.mortbay.jetty.nio.SelectChannelConnector.open(SelectChannelConnector.java:216)
	at org.apache.hadoop.http.HttpServer2.openListeners(HttpServer2.java:807)
	at org.apache.hadoop.http.HttpServer2.start(HttpServer2.java:749)
	at org.apache.hadoop.yarn.webapp.WebApps$Builder.start(WebApps.java:273)
	at org.apache.hadoop.yarn.server.resourcemanager.ResourceManager.startWepApp(ResourceManager.java:975)
	at org.apache.hadoop.yarn.server.resourcemanager.ResourceManager.serviceStart(ResourceManager.java:1075)
	at org.apache.hadoop.service.AbstractService.start(AbstractService.java:193)
	at org.apache.hadoop.yarn.server.resourcemanager.TestMoveApplication.setUp(TestMoveApplication.java:59)


REGRESSION:  org.apache.hadoop.yarn.server.resourcemanager.TestMoveApplication.testMoveRejectedByPermissions

Error Message:
Error starting http server

Stack Trace:
org.apache.hadoop.yarn.webapp.WebAppException: Error starting http server
	at sun.nio.ch.Net.bind0(Native Method)
	at sun.nio.ch.Net.bind(Net.java:444)
	at sun.nio.ch.Net.bind(Net.java:436)
	at sun.nio.ch.ServerSocketChannelImpl.bind(ServerSocketChannelImpl.java:214)
	at sun.nio.ch.ServerSocketAdaptor.bind(ServerSocketAdaptor.java:74)
	at org.mortbay.jetty.nio.SelectChannelConnector.open(SelectChannelConnector.java:216)
	at org.apache.hadoop.http.HttpServer2.openListeners(HttpServer2.java:807)
	at org.apache.hadoop.http.HttpServer2.start(HttpServer2.java:749)
	at org.apache.hadoop.yarn.webapp.WebApps$Builder.start(WebApps.java:273)
	at org.apache.hadoop.yarn.server.resourcemanager.ResourceManager.startWepApp(ResourceManager.java:975)
	at org.apache.hadoop.yarn.server.resourcemanager.ResourceManager.serviceStart(ResourceManager.java:1075)
	at org.apache.hadoop.service.AbstractService.start(AbstractService.java:193)
	at org.apache.hadoop.yarn.server.resourcemanager.TestMoveApplication.setUp(TestMoveApplication.java:59)


REGRESSION:  org.apache.hadoop.yarn.server.resourcemanager.TestMoveApplication.testMoveSuccessful

Error Message:
Error starting http server

Stack Trace:
org.apache.hadoop.yarn.webapp.WebAppException: Error starting http server
	at sun.nio.ch.Net.bind0(Native Method)
	at sun.nio.ch.Net.bind(Net.java:444)
	at sun.nio.ch.Net.bind(Net.java:436)
	at sun.nio.ch.ServerSocketChannelImpl.bind(ServerSocketChannelImpl.java:214)
	at sun.nio.ch.ServerSocketAdaptor.bind(ServerSocketAdaptor.java:74)
	at org.mortbay.jetty.nio.SelectChannelConnector.open(SelectChannelConnector.java:216)
	at org.apache.hadoop.http.HttpServer2.openListeners(HttpServer2.java:807)
	at org.apache.hadoop.http.HttpServer2.start(HttpServer2.java:749)
	at org.apache.hadoop.yarn.webapp.WebApps$Builder.start(WebApps.java:273)
	at org.apache.hadoop.yarn.server.resourcemanager.ResourceManager.startWepApp(ResourceManager.java:975)
	at org.apache.hadoop.yarn.server.resourcemanager.ResourceManager.serviceStart(ResourceManager.java:1075)
	at org.apache.hadoop.service.AbstractService.start(AbstractService.java:193)
	at org.apache.hadoop.yarn.server.resourcemanager.TestMoveApplication.setUp(TestMoveApplication.java:59)


REGRESSION:  org.apache.hadoop.yarn.server.resourcemanager.TestMoveApplication.testMoveRejectedByScheduler

Error Message:
Error starting http server

Stack Trace:
org.apache.hadoop.yarn.webapp.WebAppException: Error starting http server
	at sun.nio.ch.Net.bind0(Native Method)
	at sun.nio.ch.Net.bind(Net.java:444)
	at sun.nio.ch.Net.bind(Net.java:436)
	at sun.nio.ch.ServerSocketChannelImpl.bind(ServerSocketChannelImpl.java:214)
	at sun.nio.ch.ServerSocketAdaptor.bind(ServerSocketAdaptor.java:74)
	at org.mortbay.jetty.nio.SelectChannelConnector.open(SelectChannelConnector.java:216)
	at org.apache.hadoop.http.HttpServer2.openListeners(HttpServer2.java:807)
	at org.apache.hadoop.http.HttpServer2.start(HttpServer2.java:749)
	at org.apache.hadoop.yarn.webapp.WebApps$Builder.start(WebApps.java:273)
	at org.apache.hadoop.yarn.server.resourcemanager.ResourceManager.startWepApp(ResourceManager.java:975)
	at org.apache.hadoop.yarn.server.resourcemanager.ResourceManager.serviceStart(ResourceManager.java:1075)
	at org.apache.hadoop.service.AbstractService.start(AbstractService.java:193)
	at org.apache.hadoop.yarn.server.resourcemanager.TestMoveApplication.setUp(TestMoveApplication.java:59)


REGRESSION:  org.apache.hadoop.yarn.server.resourcemanager.TestWorkPreservingRMRestart.testReleasedContainerNotRecovered[0]

Error Message:
Failed to load class: [org.apache.hadoop.yarn.api.protocolrecords.impl.pb.AllocateRequestPBImpl]

Stack Trace:
org.apache.hadoop.yarn.exceptions.YarnRuntimeException: Failed to load class: [org.apache.hadoop.yarn.api.protocolrecords.impl.pb.AllocateRequestPBImpl]
	at org.apache.hadoop.conf.Configuration.getClassByName(Configuration.java:2022)
	at org.apache.hadoop.yarn.factories.impl.pb.RecordFactoryPBImpl.newRecordInstance(RecordFactoryPBImpl.java:56)
	at org.apache.hadoop.yarn.util.Records.newRecord(Records.java:36)
	at org.apache.hadoop.yarn.api.protocolrecords.AllocateRequest.newInstance(AllocateRequest.java:75)
	at org.apache.hadoop.yarn.api.protocolrecords.AllocateRequest.newInstance(AllocateRequest.java:64)
	at org.apache.hadoop.yarn.server.resourcemanager.MockAM.allocate(MockAM.java:207)
	at org.apache.hadoop.yarn.server.resourcemanager.TestWorkPreservingRMRestart.testReleasedContainerNotRecovered(TestWorkPreservingRMRestart.java:866)


REGRESSION:  org.apache.hadoop.yarn.server.resourcemanager.TestWorkPreservingRMRestart.testAppFailedToRenewTokenOnRecovery[0]

Error Message:
org/apache/hadoop/yarn/security/client/RMDelegationTokenIdentifier$Renewer

Stack Trace:
java.lang.NoClassDefFoundError: org/apache/hadoop/yarn/security/client/RMDelegationTokenIdentifier$Renewer
	at java.net.URLClassLoader$1.run(URLClassLoader.java:366)
	at java.net.URLClassLoader$1.run(URLClassLoader.java:355)
	at java.security.AccessController.doPrivileged(Native Method)
	at java.net.URLClassLoader.findClass(URLClassLoader.java:354)
	at java.lang.ClassLoader.loadClass(ClassLoader.java:425)
	at sun.misc.Launcher$AppClassLoader.loadClass(Launcher.java:308)
	at java.lang.ClassLoader.loadClass(ClassLoader.java:358)
	at org.apache.hadoop.yarn.server.resourcemanager.TestRMRestart$TestSecurityMockRM.init(TestRMRestart.java:2027)
	at org.apache.hadoop.yarn.server.resourcemanager.MockRM.<init>(MockRM.java:108)
	at org.apache.hadoop.yarn.server.resourcemanager.TestRMRestart$TestSecurityMockRM.<init>(TestRMRestart.java:2021)
	at org.apache.hadoop.yarn.server.resourcemanager.TestWorkPreservingRMRestart.testAppFailedToRenewTokenOnRecovery(TestWorkPreservingRMRestart.java:1035)


REGRESSION:  org.apache.hadoop.yarn.server.resourcemanager.TestWorkPreservingRMRestart.testNewContainersNotAllocatedDuringSchedulerRecovery[0]

Error Message:
Failed to load class: [org.apache.hadoop.yarn.api.protocolrecords.impl.pb.AllocateRequestPBImpl]

Stack Trace:
org.apache.hadoop.yarn.exceptions.YarnRuntimeException: Failed to load class: [org.apache.hadoop.yarn.api.protocolrecords.impl.pb.AllocateRequestPBImpl]
	at org.apache.hadoop.conf.Configuration.getClassByName(Configuration.java:2022)
	at org.apache.hadoop.yarn.factories.impl.pb.RecordFactoryPBImpl.newRecordInstance(RecordFactoryPBImpl.java:56)
	at org.apache.hadoop.yarn.util.Records.newRecord(Records.java:36)
	at org.apache.hadoop.yarn.api.protocolrecords.AllocateRequest.newInstance(AllocateRequest.java:75)
	at org.apache.hadoop.yarn.api.protocolrecords.AllocateRequest.newInstance(AllocateRequest.java:64)
	at org.apache.hadoop.yarn.server.resourcemanager.MockAM.allocate(MockAM.java:207)
	at org.apache.hadoop.yarn.server.resourcemanager.MockAM.allocate(MockAM.java:156)
	at org.apache.hadoop.yarn.server.resourcemanager.MockAM.allocate(MockAM.java:147)
	at org.apache.hadoop.yarn.server.resourcemanager.TestWorkPreservingRMRestart.testNewContainersNotAllocatedDuringSchedulerRecovery(TestWorkPreservingRMRestart.java:965)


REGRESSION:  org.apache.hadoop.yarn.server.resourcemanager.TestWorkPreservingRMRestart.testReleasedContainerNotRecovered[1]

Error Message:
Failed to load class: [org.apache.hadoop.yarn.api.protocolrecords.impl.pb.AllocateRequestPBImpl]

Stack Trace:
org.apache.hadoop.yarn.exceptions.YarnRuntimeException: Failed to load class: [org.apache.hadoop.yarn.api.protocolrecords.impl.pb.AllocateRequestPBImpl]
	at org.apache.hadoop.conf.Configuration.getClassByName(Configuration.java:2022)
	at org.apache.hadoop.yarn.factories.impl.pb.RecordFactoryPBImpl.newRecordInstance(RecordFactoryPBImpl.java:56)
	at org.apache.hadoop.yarn.util.Records.newRecord(Records.java:36)
	at org.apache.hadoop.yarn.api.protocolrecords.AllocateRequest.newInstance(AllocateRequest.java:75)
	at org.apache.hadoop.yarn.api.protocolrecords.AllocateRequest.newInstance(AllocateRequest.java:64)
	at org.apache.hadoop.yarn.server.resourcemanager.MockAM.allocate(MockAM.java:207)
	at org.apache.hadoop.yarn.server.resourcemanager.TestWorkPreservingRMRestart.testReleasedContainerNotRecovered(TestWorkPreservingRMRestart.java:866)


REGRESSION:  org.apache.hadoop.yarn.server.resourcemanager.TestWorkPreservingRMRestart.testAppFailedToRenewTokenOnRecovery[1]

Error Message:
org/apache/hadoop/yarn/security/client/RMDelegationTokenIdentifier$Renewer

Stack Trace:
java.lang.NoClassDefFoundError: org/apache/hadoop/yarn/security/client/RMDelegationTokenIdentifier$Renewer
	at org.apache.hadoop.yarn.server.resourcemanager.TestRMRestart$TestSecurityMockRM.init(TestRMRestart.java:2027)
	at org.apache.hadoop.yarn.server.resourcemanager.MockRM.<init>(MockRM.java:108)
	at org.apache.hadoop.yarn.server.resourcemanager.TestRMRestart$TestSecurityMockRM.<init>(TestRMRestart.java:2021)
	at org.apache.hadoop.yarn.server.resourcemanager.TestWorkPreservingRMRestart.testAppFailedToRenewTokenOnRecovery(TestWorkPreservingRMRestart.java:1035)


REGRESSION:  org.apache.hadoop.yarn.server.resourcemanager.TestWorkPreservingRMRestart.testNewContainersNotAllocatedDuringSchedulerRecovery[1]

Error Message:
Failed to load class: [org.apache.hadoop.yarn.api.protocolrecords.impl.pb.AllocateRequestPBImpl]

Stack Trace:
org.apache.hadoop.yarn.exceptions.YarnRuntimeException: Failed to load class: [org.apache.hadoop.yarn.api.protocolrecords.impl.pb.AllocateRequestPBImpl]
	at org.apache.hadoop.conf.Configuration.getClassByName(Configuration.java:2022)
	at org.apache.hadoop.yarn.factories.impl.pb.RecordFactoryPBImpl.newRecordInstance(RecordFactoryPBImpl.java:56)
	at org.apache.hadoop.yarn.util.Records.newRecord(Records.java:36)
	at org.apache.hadoop.yarn.api.protocolrecords.AllocateRequest.newInstance(AllocateRequest.java:75)
	at org.apache.hadoop.yarn.api.protocolrecords.AllocateRequest.newInstance(AllocateRequest.java:64)
	at org.apache.hadoop.yarn.server.resourcemanager.MockAM.allocate(MockAM.java:207)
	at org.apache.hadoop.yarn.server.resourcemanager.MockAM.allocate(MockAM.java:156)
	at org.apache.hadoop.yarn.server.resourcemanager.MockAM.allocate(MockAM.java:147)
	at org.apache.hadoop.yarn.server.resourcemanager.TestWorkPreservingRMRestart.testNewContainersNotAllocatedDuringSchedulerRecovery(TestWorkPreservingRMRestart.java:965)


REGRESSION:  org.apache.hadoop.yarn.server.resourcemanager.TestWorkPreservingRMRestart.testReleasedContainerNotRecovered[2]

Error Message:
Failed to load class: [org.apache.hadoop.yarn.api.protocolrecords.impl.pb.AllocateRequestPBImpl]

Stack Trace:
org.apache.hadoop.yarn.exceptions.YarnRuntimeException: Failed to load class: [org.apache.hadoop.yarn.api.protocolrecords.impl.pb.AllocateRequestPBImpl]
	at org.apache.hadoop.conf.Configuration.getClassByName(Configuration.java:2022)
	at org.apache.hadoop.yarn.factories.impl.pb.RecordFactoryPBImpl.newRecordInstance(RecordFactoryPBImpl.java:56)
	at org.apache.hadoop.yarn.util.Records.newRecord(Records.java:36)
	at org.apache.hadoop.yarn.api.protocolrecords.AllocateRequest.newInstance(AllocateRequest.java:75)
	at org.apache.hadoop.yarn.api.protocolrecords.AllocateRequest.newInstance(AllocateRequest.java:64)
	at org.apache.hadoop.yarn.server.resourcemanager.MockAM.allocate(MockAM.java:207)
	at org.apache.hadoop.yarn.server.resourcemanager.TestWorkPreservingRMRestart.testReleasedContainerNotRecovered(TestWorkPreservingRMRestart.java:866)


REGRESSION:  org.apache.hadoop.yarn.server.resourcemanager.TestWorkPreservingRMRestart.testAppFailedToRenewTokenOnRecovery[2]

Error Message:
org/apache/hadoop/yarn/security/client/RMDelegationTokenIdentifier$Renewer

Stack Trace:
java.lang.NoClassDefFoundError: org/apache/hadoop/yarn/security/client/RMDelegationTokenIdentifier$Renewer
	at org.apache.hadoop.yarn.server.resourcemanager.TestRMRestart$TestSecurityMockRM.init(TestRMRestart.java:2027)
	at org.apache.hadoop.yarn.server.resourcemanager.MockRM.<init>(MockRM.java:108)
	at org.apache.hadoop.yarn.server.resourcemanager.TestRMRestart$TestSecurityMockRM.<init>(TestRMRestart.java:2021)
	at org.apache.hadoop.yarn.server.resourcemanager.TestWorkPreservingRMRestart.testAppFailedToRenewTokenOnRecovery(TestWorkPreservingRMRestart.java:1035)


REGRESSION:  org.apache.hadoop.yarn.server.resourcemanager.TestWorkPreservingRMRestart.testNewContainersNotAllocatedDuringSchedulerRecovery[2]

Error Message:
Failed to load class: [org.apache.hadoop.yarn.api.protocolrecords.impl.pb.AllocateRequestPBImpl]

Stack Trace:
org.apache.hadoop.yarn.exceptions.YarnRuntimeException: Failed to load class: [org.apache.hadoop.yarn.api.protocolrecords.impl.pb.AllocateRequestPBImpl]
	at org.apache.hadoop.conf.Configuration.getClassByName(Configuration.java:2022)
	at org.apache.hadoop.yarn.factories.impl.pb.RecordFactoryPBImpl.newRecordInstance(RecordFactoryPBImpl.java:56)
	at org.apache.hadoop.yarn.util.Records.newRecord(Records.java:36)
	at org.apache.hadoop.yarn.api.protocolrecords.AllocateRequest.newInstance(AllocateRequest.java:75)
	at org.apache.hadoop.yarn.api.protocolrecords.AllocateRequest.newInstance(AllocateRequest.java:64)
	at org.apache.hadoop.yarn.server.resourcemanager.MockAM.allocate(MockAM.java:207)
	at org.apache.hadoop.yarn.server.resourcemanager.MockAM.allocate(MockAM.java:156)
	at org.apache.hadoop.yarn.server.resourcemanager.MockAM.allocate(MockAM.java:147)
	at org.apache.hadoop.yarn.server.resourcemanager.TestWorkPreservingRMRestart.testNewContainersNotAllocatedDuringSchedulerRecovery(TestWorkPreservingRMRestart.java:965)



Failed: YARN-2868 PreCommit Build #6371

Posted by Apache Jenkins Server <je...@builds.apache.org>.
Jira: https://issues.apache.org/jira/browse/YARN-2868
Build: https://builds.apache.org/job/PreCommit-YARN-Build/6371/

###################################################################################
########################## LAST 60 LINES OF THE CONSOLE ###########################
[...truncated 3301 lines...]

{color:red}-1 overall{color}.  Here are the results of testing the latest attachment 
  http://issues.apache.org/jira/secure/attachment/12693520/YARN-2868.006.patch
  against trunk revision 6b17eb9.

    {color:green}+1 @author{color}.  The patch does not contain any @author tags.

    {color:red}-1 tests included{color}.  The patch doesn't appear to include any new or modified tests.
                        Please justify why no new tests are needed for this patch.
                        Also please list what manual steps were performed to verify this patch.

    {color:green}+1 javac{color}.  The applied patch does not increase the total number of javac compiler warnings.

    {color:green}+1 javadoc{color}.  There were no new javadoc warning messages.

    {color:green}+1 eclipse:eclipse{color}.  The patch built with eclipse:eclipse.

    {color:green}+1 findbugs{color}.  The patch does not introduce any new Findbugs (version 2.0.3) warnings.

    {color:green}+1 release audit{color}.  The applied patch does not increase the total number of release audit warnings.

    {color:green}+1 core tests{color}.  The patch passed unit tests in hadoop-yarn-project/hadoop-yarn/hadoop-yarn-server/hadoop-yarn-server-resourcemanager.

Test results: https://builds.apache.org/job/PreCommit-YARN-Build/6371//testReport/
Console output: https://builds.apache.org/job/PreCommit-YARN-Build/6371//console

This message is automatically generated.


======================================================================
======================================================================
    Adding comment to Jira.
======================================================================
======================================================================


Comment added.
180d72f03bc3c99c7c4e278428576793be48195b logged out


======================================================================
======================================================================
    Finished build.
======================================================================
======================================================================


Build step 'Execute shell' marked build as failure
Archiving artifacts
Sending artifact delta relative to PreCommit-YARN-Build #6366
Archived 15 artifacts
Archive block size is 32768
Received 240 blocks and 1002982 bytes
Compression is 88.7%
Took 1.2 sec
[description-setter] Could not determine description.
Recording test results
Email was triggered for: Failure
Sending email for trigger: Failure



###################################################################################
############################## FAILED TESTS (if any) ##############################
All tests passed

Failed: YARN-3028 PreCommit Build #6370

Posted by Apache Jenkins Server <je...@builds.apache.org>.
Jira: https://issues.apache.org/jira/browse/YARN-3028
Build: https://builds.apache.org/job/PreCommit-YARN-Build/6370/

###################################################################################
########################## LAST 60 LINES OF THE CONSOLE ###########################
[...truncated 3459 lines...]
  http://issues.apache.org/jira/secure/attachment/12693515/0001-YARN-3028.patch
  against trunk revision 6b17eb9.

    {color:green}+1 @author{color}.  The patch does not contain any @author tags.

    {color:green}+1 tests included{color}.  The patch appears to include 1 new or modified test files.

    {color:green}+1 javac{color}.  The applied patch does not increase the total number of javac compiler warnings.

    {color:green}+1 javadoc{color}.  There were no new javadoc warning messages.

    {color:green}+1 eclipse:eclipse{color}.  The patch built with eclipse:eclipse.

    {color:green}+1 findbugs{color}.  The patch does not introduce any new Findbugs (version 2.0.3) warnings.

    {color:green}+1 release audit{color}.  The applied patch does not increase the total number of release audit warnings.

    {color:red}-1 core tests{color}.  The patch failed these unit tests in hadoop-yarn-project/hadoop-yarn/hadoop-yarn-client:

                  org.apache.hadoop.yarn.client.TestResourceTrackerOnHA
                  org.apache.hadoop.yarn.client.TestApplicationClientProtocolOnHA
                  org.apache.hadoop.yarn.client.api.impl.TestYarnClient

Test results: https://builds.apache.org/job/PreCommit-YARN-Build/6370//testReport/
Console output: https://builds.apache.org/job/PreCommit-YARN-Build/6370//console

This message is automatically generated.


======================================================================
======================================================================
    Adding comment to Jira.
======================================================================
======================================================================


Comment added.
7a2f77e71fc50d472217cc38c68a4cb22a9c621a logged out


======================================================================
======================================================================
    Finished build.
======================================================================
======================================================================


Build step 'Execute shell' marked build as failure
Archiving artifacts
Sending artifact delta relative to PreCommit-YARN-Build #6366
Archived 15 artifacts
Archive block size is 32768
Received 51 blocks and 6993697 bytes
Compression is 19.3%
Took 18 sec
[description-setter] Could not determine description.
Recording test results
Email was triggered for: Failure
Sending email for trigger: Failure



###################################################################################
############################## FAILED TESTS (if any) ##############################
12 tests failed.
FAILED:  org.apache.hadoop.yarn.client.TestApplicationClientProtocolOnHA.testGetContainersOnHA

Error Message:
Call From asf908.gq1.ygridcore.net/67.195.81.152 to asf908.gq1.ygridcore.net:28032 failed on connection exception: java.net.ConnectException: Connection refused; For more details see:  http://wiki.apache.org/hadoop/ConnectionRefused

Stack Trace:
java.net.ConnectException: Call From asf908.gq1.ygridcore.net/67.195.81.152 to asf908.gq1.ygridcore.net:28032 failed on connection exception: java.net.ConnectException: Connection refused; For more details see:  http://wiki.apache.org/hadoop/ConnectionRefused
	at sun.nio.ch.SocketChannelImpl.checkConnect(Native Method)
	at sun.nio.ch.SocketChannelImpl.finishConnect(SocketChannelImpl.java:739)
	at org.apache.hadoop.net.SocketIOWithTimeout.connect(SocketIOWithTimeout.java:206)
	at org.apache.hadoop.net.NetUtils.connect(NetUtils.java:530)
	at org.apache.hadoop.net.NetUtils.connect(NetUtils.java:494)
	at org.apache.hadoop.ipc.Client$Connection.setupConnection(Client.java:607)
	at org.apache.hadoop.ipc.Client$Connection.setupIOstreams(Client.java:705)
	at org.apache.hadoop.ipc.Client$Connection.access$2800(Client.java:368)
	at org.apache.hadoop.ipc.Client.getConnection(Client.java:1521)
	at org.apache.hadoop.ipc.Client.call(Client.java:1438)
	at org.apache.hadoop.ipc.Client.call(Client.java:1399)
	at org.apache.hadoop.ipc.ProtobufRpcEngine$Invoker.invoke(ProtobufRpcEngine.java:230)
	at com.sun.proxy.$Proxy17.getContainers(Unknown Source)
	at org.apache.hadoop.yarn.api.impl.pb.client.ApplicationClientProtocolPBClientImpl.getContainers(ApplicationClientProtocolPBClientImpl.java:410)
	at sun.reflect.NativeMethodAccessorImpl.invoke0(Native Method)
	at sun.reflect.NativeMethodAccessorImpl.invoke(NativeMethodAccessorImpl.java:57)
	at sun.reflect.DelegatingMethodAccessorImpl.invoke(DelegatingMethodAccessorImpl.java:43)
	at java.lang.reflect.Method.invoke(Method.java:606)
	at org.apache.hadoop.io.retry.RetryInvocationHandler.invokeMethod(RetryInvocationHandler.java:186)
	at org.apache.hadoop.io.retry.RetryInvocationHandler.invoke(RetryInvocationHandler.java:101)
	at com.sun.proxy.$Proxy18.getContainers(Unknown Source)
	at org.apache.hadoop.yarn.client.api.impl.YarnClientImpl.getContainers(YarnClientImpl.java:654)
	at org.apache.hadoop.yarn.client.TestApplicationClientProtocolOnHA.testGetContainersOnHA(TestApplicationClientProtocolOnHA.java:154)


FAILED:  org.apache.hadoop.yarn.client.TestApplicationClientProtocolOnHA.testGetNewApplicationOnHA

Error Message:
Call From asf908.gq1.ygridcore.net/67.195.81.152 to asf908.gq1.ygridcore.net:28032 failed on connection exception: java.net.ConnectException: Connection refused; For more details see:  http://wiki.apache.org/hadoop/ConnectionRefused

Stack Trace:
java.net.ConnectException: Call From asf908.gq1.ygridcore.net/67.195.81.152 to asf908.gq1.ygridcore.net:28032 failed on connection exception: java.net.ConnectException: Connection refused; For more details see:  http://wiki.apache.org/hadoop/ConnectionRefused
	at sun.nio.ch.SocketChannelImpl.checkConnect(Native Method)
	at sun.nio.ch.SocketChannelImpl.finishConnect(SocketChannelImpl.java:739)
	at org.apache.hadoop.net.SocketIOWithTimeout.connect(SocketIOWithTimeout.java:206)
	at org.apache.hadoop.net.NetUtils.connect(NetUtils.java:530)
	at org.apache.hadoop.net.NetUtils.connect(NetUtils.java:494)
	at org.apache.hadoop.ipc.Client$Connection.setupConnection(Client.java:607)
	at org.apache.hadoop.ipc.Client$Connection.setupIOstreams(Client.java:705)
	at org.apache.hadoop.ipc.Client$Connection.access$2800(Client.java:368)
	at org.apache.hadoop.ipc.Client.getConnection(Client.java:1521)
	at org.apache.hadoop.ipc.Client.call(Client.java:1438)
	at org.apache.hadoop.ipc.Client.call(Client.java:1399)
	at org.apache.hadoop.ipc.ProtobufRpcEngine$Invoker.invoke(ProtobufRpcEngine.java:230)
	at com.sun.proxy.$Proxy17.getNewApplication(Unknown Source)
	at org.apache.hadoop.yarn.api.impl.pb.client.ApplicationClientProtocolPBClientImpl.getNewApplication(ApplicationClientProtocolPBClientImpl.java:217)
	at sun.reflect.NativeMethodAccessorImpl.invoke0(Native Method)
	at sun.reflect.NativeMethodAccessorImpl.invoke(NativeMethodAccessorImpl.java:57)
	at sun.reflect.DelegatingMethodAccessorImpl.invoke(DelegatingMethodAccessorImpl.java:43)
	at java.lang.reflect.Method.invoke(Method.java:606)
	at org.apache.hadoop.io.retry.RetryInvocationHandler.invokeMethod(RetryInvocationHandler.java:186)
	at org.apache.hadoop.io.retry.RetryInvocationHandler.invoke(RetryInvocationHandler.java:101)
	at com.sun.proxy.$Proxy18.getNewApplication(Unknown Source)
	at org.apache.hadoop.yarn.client.api.impl.YarnClientImpl.getNewApplication(YarnClientImpl.java:206)
	at org.apache.hadoop.yarn.client.api.impl.YarnClientImpl.createApplication(YarnClientImpl.java:214)
	at org.apache.hadoop.yarn.client.TestApplicationClientProtocolOnHA.testGetNewApplicationOnHA(TestApplicationClientProtocolOnHA.java:76)


FAILED:  org.apache.hadoop.yarn.client.TestApplicationClientProtocolOnHA.testGetApplicationAttemptsOnHA

Error Message:
Call From asf908.gq1.ygridcore.net/67.195.81.152 to asf908.gq1.ygridcore.net:28032 failed on connection exception: java.net.ConnectException: Connection refused; For more details see:  http://wiki.apache.org/hadoop/ConnectionRefused

Stack Trace:
java.net.ConnectException: Call From asf908.gq1.ygridcore.net/67.195.81.152 to asf908.gq1.ygridcore.net:28032 failed on connection exception: java.net.ConnectException: Connection refused; For more details see:  http://wiki.apache.org/hadoop/ConnectionRefused
	at sun.nio.ch.SocketChannelImpl.checkConnect(Native Method)
	at sun.nio.ch.SocketChannelImpl.finishConnect(SocketChannelImpl.java:739)
	at org.apache.hadoop.net.SocketIOWithTimeout.connect(SocketIOWithTimeout.java:206)
	at org.apache.hadoop.net.NetUtils.connect(NetUtils.java:530)
	at org.apache.hadoop.net.NetUtils.connect(NetUtils.java:494)
	at org.apache.hadoop.ipc.Client$Connection.setupConnection(Client.java:607)
	at org.apache.hadoop.ipc.Client$Connection.setupIOstreams(Client.java:705)
	at org.apache.hadoop.ipc.Client$Connection.access$2800(Client.java:368)
	at org.apache.hadoop.ipc.Client.getConnection(Client.java:1521)
	at org.apache.hadoop.ipc.Client.call(Client.java:1438)
	at org.apache.hadoop.ipc.Client.call(Client.java:1399)
	at org.apache.hadoop.ipc.ProtobufRpcEngine$Invoker.invoke(ProtobufRpcEngine.java:230)
	at com.sun.proxy.$Proxy17.getApplicationAttempts(Unknown Source)
	at org.apache.hadoop.yarn.api.impl.pb.client.ApplicationClientProtocolPBClientImpl.getApplicationAttempts(ApplicationClientProtocolPBClientImpl.java:382)
	at sun.reflect.NativeMethodAccessorImpl.invoke0(Native Method)
	at sun.reflect.NativeMethodAccessorImpl.invoke(NativeMethodAccessorImpl.java:57)
	at sun.reflect.DelegatingMethodAccessorImpl.invoke(DelegatingMethodAccessorImpl.java:43)
	at java.lang.reflect.Method.invoke(Method.java:606)
	at org.apache.hadoop.io.retry.RetryInvocationHandler.invokeMethod(RetryInvocationHandler.java:186)
	at org.apache.hadoop.io.retry.RetryInvocationHandler.invoke(RetryInvocationHandler.java:101)
	at com.sun.proxy.$Proxy18.getApplicationAttempts(Unknown Source)
	at org.apache.hadoop.yarn.client.api.impl.YarnClientImpl.getApplicationAttempts(YarnClientImpl.java:605)
	at org.apache.hadoop.yarn.client.TestApplicationClientProtocolOnHA.testGetApplicationAttemptsOnHA(TestApplicationClientProtocolOnHA.java:137)


FAILED:  org.apache.hadoop.yarn.client.TestApplicationClientProtocolOnHA.testGetApplicationAttemptReportOnHA

Error Message:
Call From asf908.gq1.ygridcore.net/67.195.81.152 to asf908.gq1.ygridcore.net:28032 failed on connection exception: java.net.ConnectException: Connection refused; For more details see:  http://wiki.apache.org/hadoop/ConnectionRefused

Stack Trace:
java.net.ConnectException: Call From asf908.gq1.ygridcore.net/67.195.81.152 to asf908.gq1.ygridcore.net:28032 failed on connection exception: java.net.ConnectException: Connection refused; For more details see:  http://wiki.apache.org/hadoop/ConnectionRefused
	at sun.nio.ch.SocketChannelImpl.checkConnect(Native Method)
	at sun.nio.ch.SocketChannelImpl.finishConnect(SocketChannelImpl.java:739)
	at org.apache.hadoop.net.SocketIOWithTimeout.connect(SocketIOWithTimeout.java:206)
	at org.apache.hadoop.net.NetUtils.connect(NetUtils.java:530)
	at org.apache.hadoop.net.NetUtils.connect(NetUtils.java:494)
	at org.apache.hadoop.ipc.Client$Connection.setupConnection(Client.java:607)
	at org.apache.hadoop.ipc.Client$Connection.setupIOstreams(Client.java:705)
	at org.apache.hadoop.ipc.Client$Connection.access$2800(Client.java:368)
	at org.apache.hadoop.ipc.Client.getConnection(Client.java:1521)
	at org.apache.hadoop.ipc.Client.call(Client.java:1438)
	at org.apache.hadoop.ipc.Client.call(Client.java:1399)
	at org.apache.hadoop.ipc.ProtobufRpcEngine$Invoker.invoke(ProtobufRpcEngine.java:230)
	at com.sun.proxy.$Proxy17.getApplicationAttemptReport(Unknown Source)
	at org.apache.hadoop.yarn.api.impl.pb.client.ApplicationClientProtocolPBClientImpl.getApplicationAttemptReport(ApplicationClientProtocolPBClientImpl.java:368)
	at sun.reflect.NativeMethodAccessorImpl.invoke0(Native Method)
	at sun.reflect.NativeMethodAccessorImpl.invoke(NativeMethodAccessorImpl.java:57)
	at sun.reflect.DelegatingMethodAccessorImpl.invoke(DelegatingMethodAccessorImpl.java:43)
	at java.lang.reflect.Method.invoke(Method.java:606)
	at org.apache.hadoop.io.retry.RetryInvocationHandler.invokeMethod(RetryInvocationHandler.java:186)
	at org.apache.hadoop.io.retry.RetryInvocationHandler.invoke(RetryInvocationHandler.java:101)
	at com.sun.proxy.$Proxy18.getApplicationAttemptReport(Unknown Source)
	at org.apache.hadoop.yarn.client.api.impl.YarnClientImpl.getApplicationAttemptReport(YarnClientImpl.java:581)
	at org.apache.hadoop.yarn.client.TestApplicationClientProtocolOnHA.testGetApplicationAttemptReportOnHA(TestApplicationClientProtocolOnHA.java:128)


FAILED:  org.apache.hadoop.yarn.client.TestApplicationClientProtocolOnHA.testGetQueueUserAclsOnHA

Error Message:
Call From asf908.gq1.ygridcore.net/67.195.81.152 to asf908.gq1.ygridcore.net:28032 failed on connection exception: java.net.ConnectException: Connection refused; For more details see:  http://wiki.apache.org/hadoop/ConnectionRefused

Stack Trace:
java.net.ConnectException: Call From asf908.gq1.ygridcore.net/67.195.81.152 to asf908.gq1.ygridcore.net:28032 failed on connection exception: java.net.ConnectException: Connection refused; For more details see:  http://wiki.apache.org/hadoop/ConnectionRefused
	at sun.nio.ch.SocketChannelImpl.checkConnect(Native Method)
	at sun.nio.ch.SocketChannelImpl.finishConnect(SocketChannelImpl.java:739)
	at org.apache.hadoop.net.SocketIOWithTimeout.connect(SocketIOWithTimeout.java:206)
	at org.apache.hadoop.net.NetUtils.connect(NetUtils.java:530)
	at org.apache.hadoop.net.NetUtils.connect(NetUtils.java:494)
	at org.apache.hadoop.ipc.Client$Connection.setupConnection(Client.java:607)
	at org.apache.hadoop.ipc.Client$Connection.setupIOstreams(Client.java:705)
	at org.apache.hadoop.ipc.Client$Connection.access$2800(Client.java:368)
	at org.apache.hadoop.ipc.Client.getConnection(Client.java:1521)
	at org.apache.hadoop.ipc.Client.call(Client.java:1438)
	at org.apache.hadoop.ipc.Client.call(Client.java:1399)
	at org.apache.hadoop.ipc.ProtobufRpcEngine$Invoker.invoke(ProtobufRpcEngine.java:230)
	at com.sun.proxy.$Proxy17.getQueueUserAcls(Unknown Source)
	at org.apache.hadoop.yarn.api.impl.pb.client.ApplicationClientProtocolPBClientImpl.getQueueUserAcls(ApplicationClientProtocolPBClientImpl.java:291)
	at sun.reflect.NativeMethodAccessorImpl.invoke0(Native Method)
	at sun.reflect.NativeMethodAccessorImpl.invoke(NativeMethodAccessorImpl.java:57)
	at sun.reflect.DelegatingMethodAccessorImpl.invoke(DelegatingMethodAccessorImpl.java:43)
	at java.lang.reflect.Method.invoke(Method.java:606)
	at org.apache.hadoop.io.retry.RetryInvocationHandler.invokeMethod(RetryInvocationHandler.java:186)
	at org.apache.hadoop.io.retry.RetryInvocationHandler.invoke(RetryInvocationHandler.java:101)
	at com.sun.proxy.$Proxy18.getQueueUserAcls(Unknown Source)
	at org.apache.hadoop.yarn.client.api.impl.YarnClientImpl.getQueueAclsInfo(YarnClientImpl.java:517)
	at org.apache.hadoop.yarn.client.TestApplicationClientProtocolOnHA.testGetQueueUserAclsOnHA(TestApplicationClientProtocolOnHA.java:119)


FAILED:  org.apache.hadoop.yarn.client.TestApplicationClientProtocolOnHA.testGetQueueInfoOnHA

Error Message:
Call From asf908.gq1.ygridcore.net/67.195.81.152 to asf908.gq1.ygridcore.net:28032 failed on connection exception: java.net.ConnectException: Connection refused; For more details see:  http://wiki.apache.org/hadoop/ConnectionRefused

Stack Trace:
java.net.ConnectException: Call From asf908.gq1.ygridcore.net/67.195.81.152 to asf908.gq1.ygridcore.net:28032 failed on connection exception: java.net.ConnectException: Connection refused; For more details see:  http://wiki.apache.org/hadoop/ConnectionRefused
	at sun.nio.ch.SocketChannelImpl.checkConnect(Native Method)
	at sun.nio.ch.SocketChannelImpl.finishConnect(SocketChannelImpl.java:739)
	at org.apache.hadoop.net.SocketIOWithTimeout.connect(SocketIOWithTimeout.java:206)
	at org.apache.hadoop.net.NetUtils.connect(NetUtils.java:530)
	at org.apache.hadoop.net.NetUtils.connect(NetUtils.java:494)
	at org.apache.hadoop.ipc.Client$Connection.setupConnection(Client.java:607)
	at org.apache.hadoop.ipc.Client$Connection.setupIOstreams(Client.java:705)
	at org.apache.hadoop.ipc.Client$Connection.access$2800(Client.java:368)
	at org.apache.hadoop.ipc.Client.getConnection(Client.java:1521)
	at org.apache.hadoop.ipc.Client.call(Client.java:1438)
	at org.apache.hadoop.ipc.Client.call(Client.java:1399)
	at org.apache.hadoop.ipc.ProtobufRpcEngine$Invoker.invoke(ProtobufRpcEngine.java:230)
	at com.sun.proxy.$Proxy17.getQueueInfo(Unknown Source)
	at org.apache.hadoop.yarn.api.impl.pb.client.ApplicationClientProtocolPBClientImpl.getQueueInfo(ApplicationClientProtocolPBClientImpl.java:276)
	at sun.reflect.NativeMethodAccessorImpl.invoke0(Native Method)
	at sun.reflect.NativeMethodAccessorImpl.invoke(NativeMethodAccessorImpl.java:57)
	at sun.reflect.DelegatingMethodAccessorImpl.invoke(DelegatingMethodAccessorImpl.java:43)
	at java.lang.reflect.Method.invoke(Method.java:606)
	at org.apache.hadoop.io.retry.RetryInvocationHandler.invokeMethod(RetryInvocationHandler.java:186)
	at org.apache.hadoop.io.retry.RetryInvocationHandler.invoke(RetryInvocationHandler.java:101)
	at com.sun.proxy.$Proxy18.getQueueInfo(Unknown Source)
	at org.apache.hadoop.yarn.client.api.impl.YarnClientImpl.getQueueInfo(YarnClientImpl.java:509)
	at org.apache.hadoop.yarn.client.TestApplicationClientProtocolOnHA.testGetQueueInfoOnHA(TestApplicationClientProtocolOnHA.java:111)


FAILED:  org.apache.hadoop.yarn.client.TestApplicationClientProtocolOnHA.testForceKillApplicationOnHA

Error Message:
Call From asf908.gq1.ygridcore.net/67.195.81.152 to asf908.gq1.ygridcore.net:28032 failed on connection exception: java.net.ConnectException: Connection refused; For more details see:  http://wiki.apache.org/hadoop/ConnectionRefused

Stack Trace:
java.net.ConnectException: Call From asf908.gq1.ygridcore.net/67.195.81.152 to asf908.gq1.ygridcore.net:28032 failed on connection exception: java.net.ConnectException: Connection refused; For more details see:  http://wiki.apache.org/hadoop/ConnectionRefused
	at sun.nio.ch.SocketChannelImpl.checkConnect(Native Method)
	at sun.nio.ch.SocketChannelImpl.finishConnect(SocketChannelImpl.java:739)
	at org.apache.hadoop.net.SocketIOWithTimeout.connect(SocketIOWithTimeout.java:206)
	at org.apache.hadoop.net.NetUtils.connect(NetUtils.java:530)
	at org.apache.hadoop.net.NetUtils.connect(NetUtils.java:494)
	at org.apache.hadoop.ipc.Client$Connection.setupConnection(Client.java:607)
	at org.apache.hadoop.ipc.Client$Connection.setupIOstreams(Client.java:705)
	at org.apache.hadoop.ipc.Client$Connection.access$2800(Client.java:368)
	at org.apache.hadoop.ipc.Client.getConnection(Client.java:1521)
	at org.apache.hadoop.ipc.Client.call(Client.java:1438)
	at org.apache.hadoop.ipc.Client.call(Client.java:1399)
	at org.apache.hadoop.ipc.ProtobufRpcEngine$Invoker.invoke(ProtobufRpcEngine.java:230)
	at com.sun.proxy.$Proxy17.forceKillApplication(Unknown Source)
	at org.apache.hadoop.yarn.api.impl.pb.client.ApplicationClientProtocolPBClientImpl.forceKillApplication(ApplicationClientProtocolPBClientImpl.java:172)
	at sun.reflect.NativeMethodAccessorImpl.invoke0(Native Method)
	at sun.reflect.NativeMethodAccessorImpl.invoke(NativeMethodAccessorImpl.java:57)
	at sun.reflect.DelegatingMethodAccessorImpl.invoke(DelegatingMethodAccessorImpl.java:43)
	at java.lang.reflect.Method.invoke(Method.java:606)
	at org.apache.hadoop.io.retry.RetryInvocationHandler.invokeMethod(RetryInvocationHandler.java:186)
	at org.apache.hadoop.io.retry.RetryInvocationHandler.invoke(RetryInvocationHandler.java:101)
	at com.sun.proxy.$Proxy18.forceKillApplication(Unknown Source)
	at org.apache.hadoop.yarn.client.api.impl.YarnClientImpl.killApplication(YarnClientImpl.java:361)
	at org.apache.hadoop.yarn.client.TestApplicationClientProtocolOnHA.testForceKillApplicationOnHA(TestApplicationClientProtocolOnHA.java:185)


FAILED:  org.apache.hadoop.yarn.client.TestApplicationClientProtocolOnHA.testGetApplicationsOnHA

Error Message:
Call From asf908.gq1.ygridcore.net/67.195.81.152 to asf908.gq1.ygridcore.net:28032 failed on connection exception: java.net.ConnectException: Connection refused; For more details see:  http://wiki.apache.org/hadoop/ConnectionRefused

Stack Trace:
java.net.ConnectException: Call From asf908.gq1.ygridcore.net/67.195.81.152 to asf908.gq1.ygridcore.net:28032 failed on connection exception: java.net.ConnectException: Connection refused; For more details see:  http://wiki.apache.org/hadoop/ConnectionRefused
	at sun.nio.ch.SocketChannelImpl.checkConnect(Native Method)
	at sun.nio.ch.SocketChannelImpl.finishConnect(SocketChannelImpl.java:739)
	at org.apache.hadoop.net.SocketIOWithTimeout.connect(SocketIOWithTimeout.java:206)
	at org.apache.hadoop.net.NetUtils.connect(NetUtils.java:530)
	at org.apache.hadoop.net.NetUtils.connect(NetUtils.java:494)
	at org.apache.hadoop.ipc.Client$Connection.setupConnection(Client.java:607)
	at org.apache.hadoop.ipc.Client$Connection.setupIOstreams(Client.java:705)
	at org.apache.hadoop.ipc.Client$Connection.access$2800(Client.java:368)
	at org.apache.hadoop.ipc.Client.getConnection(Client.java:1521)
	at org.apache.hadoop.ipc.Client.call(Client.java:1438)
	at org.apache.hadoop.ipc.Client.call(Client.java:1399)
	at org.apache.hadoop.ipc.ProtobufRpcEngine$Invoker.invoke(ProtobufRpcEngine.java:230)
	at com.sun.proxy.$Proxy17.getApplications(Unknown Source)
	at org.apache.hadoop.yarn.api.impl.pb.client.ApplicationClientProtocolPBClientImpl.getApplications(ApplicationClientProtocolPBClientImpl.java:247)
	at sun.reflect.GeneratedMethodAccessor41.invoke(Unknown Source)
	at sun.reflect.DelegatingMethodAccessorImpl.invoke(DelegatingMethodAccessorImpl.java:43)
	at java.lang.reflect.Method.invoke(Method.java:606)
	at org.apache.hadoop.io.retry.RetryInvocationHandler.invokeMethod(RetryInvocationHandler.java:186)
	at org.apache.hadoop.io.retry.RetryInvocationHandler.invoke(RetryInvocationHandler.java:101)
	at com.sun.proxy.$Proxy18.getApplications(Unknown Source)
	at org.apache.hadoop.yarn.client.api.impl.YarnClientImpl.getApplications(YarnClientImpl.java:452)
	at org.apache.hadoop.yarn.client.api.impl.YarnClientImpl.getApplications(YarnClientImpl.java:429)
	at org.apache.hadoop.yarn.client.TestApplicationClientProtocolOnHA.testGetApplicationsOnHA(TestApplicationClientProtocolOnHA.java:94)


FAILED:  org.apache.hadoop.yarn.client.TestApplicationClientProtocolOnHA.testGetClusterNodesOnHA

Error Message:
Call From asf908.gq1.ygridcore.net/67.195.81.152 to asf908.gq1.ygridcore.net:28032 failed on connection exception: java.net.ConnectException: Connection refused; For more details see:  http://wiki.apache.org/hadoop/ConnectionRefused

Stack Trace:
java.net.ConnectException: Call From asf908.gq1.ygridcore.net/67.195.81.152 to asf908.gq1.ygridcore.net:28032 failed on connection exception: java.net.ConnectException: Connection refused; For more details see:  http://wiki.apache.org/hadoop/ConnectionRefused
	at sun.nio.ch.SocketChannelImpl.checkConnect(Native Method)
	at sun.nio.ch.SocketChannelImpl.finishConnect(SocketChannelImpl.java:739)
	at org.apache.hadoop.net.SocketIOWithTimeout.connect(SocketIOWithTimeout.java:206)
	at org.apache.hadoop.net.NetUtils.connect(NetUtils.java:530)
	at org.apache.hadoop.net.NetUtils.connect(NetUtils.java:494)
	at org.apache.hadoop.ipc.Client$Connection.setupConnection(Client.java:607)
	at org.apache.hadoop.ipc.Client$Connection.setupIOstreams(Client.java:705)
	at org.apache.hadoop.ipc.Client$Connection.access$2800(Client.java:368)
	at org.apache.hadoop.ipc.Client.getConnection(Client.java:1521)
	at org.apache.hadoop.ipc.Client.call(Client.java:1438)
	at org.apache.hadoop.ipc.Client.call(Client.java:1399)
	at org.apache.hadoop.ipc.ProtobufRpcEngine$Invoker.invoke(ProtobufRpcEngine.java:230)
	at com.sun.proxy.$Proxy17.getClusterNodes(Unknown Source)
	at org.apache.hadoop.yarn.api.impl.pb.client.ApplicationClientProtocolPBClientImpl.getClusterNodes(ApplicationClientProtocolPBClientImpl.java:262)
	at sun.reflect.NativeMethodAccessorImpl.invoke0(Native Method)
	at sun.reflect.NativeMethodAccessorImpl.invoke(NativeMethodAccessorImpl.java:57)
	at sun.reflect.DelegatingMethodAccessorImpl.invoke(DelegatingMethodAccessorImpl.java:43)
	at java.lang.reflect.Method.invoke(Method.java:606)
	at org.apache.hadoop.io.retry.RetryInvocationHandler.invokeMethod(RetryInvocationHandler.java:186)
	at org.apache.hadoop.io.retry.RetryInvocationHandler.invoke(RetryInvocationHandler.java:101)
	at com.sun.proxy.$Proxy18.getClusterNodes(Unknown Source)
	at org.apache.hadoop.yarn.client.api.impl.YarnClientImpl.getNodeReports(YarnClientImpl.java:475)
	at org.apache.hadoop.yarn.client.TestApplicationClientProtocolOnHA.testGetClusterNodesOnHA(TestApplicationClientProtocolOnHA.java:103)


FAILED:  org.apache.hadoop.yarn.client.TestApplicationClientProtocolOnHA.testGetClusterMetricsOnHA

Error Message:
Call From asf908.gq1.ygridcore.net/67.195.81.152 to asf908.gq1.ygridcore.net:28032 failed on connection exception: java.net.ConnectException: Connection refused; For more details see:  http://wiki.apache.org/hadoop/ConnectionRefused

Stack Trace:
java.net.ConnectException: Call From asf908.gq1.ygridcore.net/67.195.81.152 to asf908.gq1.ygridcore.net:28032 failed on connection exception: java.net.ConnectException: Connection refused; For more details see:  http://wiki.apache.org/hadoop/ConnectionRefused
	at sun.nio.ch.SocketChannelImpl.checkConnect(Native Method)
	at sun.nio.ch.SocketChannelImpl.finishConnect(SocketChannelImpl.java:739)
	at org.apache.hadoop.net.SocketIOWithTimeout.connect(SocketIOWithTimeout.java:206)
	at org.apache.hadoop.net.NetUtils.connect(NetUtils.java:530)
	at org.apache.hadoop.net.NetUtils.connect(NetUtils.java:494)
	at org.apache.hadoop.ipc.Client$Connection.setupConnection(Client.java:607)
	at org.apache.hadoop.ipc.Client$Connection.setupIOstreams(Client.java:705)
	at org.apache.hadoop.ipc.Client$Connection.access$2800(Client.java:368)
	at org.apache.hadoop.ipc.Client.getConnection(Client.java:1521)
	at org.apache.hadoop.ipc.Client.call(Client.java:1438)
	at org.apache.hadoop.ipc.Client.call(Client.java:1399)
	at org.apache.hadoop.ipc.ProtobufRpcEngine$Invoker.invoke(ProtobufRpcEngine.java:230)
	at com.sun.proxy.$Proxy17.getClusterMetrics(Unknown Source)
	at org.apache.hadoop.yarn.api.impl.pb.client.ApplicationClientProtocolPBClientImpl.getClusterMetrics(ApplicationClientProtocolPBClientImpl.java:202)
	at sun.reflect.NativeMethodAccessorImpl.invoke0(Native Method)
	at sun.reflect.NativeMethodAccessorImpl.invoke(NativeMethodAccessorImpl.java:57)
	at sun.reflect.DelegatingMethodAccessorImpl.invoke(DelegatingMethodAccessorImpl.java:43)
	at java.lang.reflect.Method.invoke(Method.java:606)
	at org.apache.hadoop.io.retry.RetryInvocationHandler.invokeMethod(RetryInvocationHandler.java:186)
	at org.apache.hadoop.io.retry.RetryInvocationHandler.invoke(RetryInvocationHandler.java:101)
	at com.sun.proxy.$Proxy18.getClusterMetrics(Unknown Source)
	at org.apache.hadoop.yarn.client.api.impl.YarnClientImpl.getYarnClusterMetrics(YarnClientImpl.java:461)
	at org.apache.hadoop.yarn.client.TestApplicationClientProtocolOnHA.testGetClusterMetricsOnHA(TestApplicationClientProtocolOnHA.java:85)


FAILED:  org.apache.hadoop.yarn.client.TestResourceTrackerOnHA.testResourceTrackerOnHA

Error Message:
Call From asf908.gq1.ygridcore.net/67.195.81.152 to asf908.gq1.ygridcore.net:28031 failed on connection exception: java.net.ConnectException: Connection refused; For more details see:  http://wiki.apache.org/hadoop/ConnectionRefused

Stack Trace:
java.net.ConnectException: Call From asf908.gq1.ygridcore.net/67.195.81.152 to asf908.gq1.ygridcore.net:28031 failed on connection exception: java.net.ConnectException: Connection refused; For more details see:  http://wiki.apache.org/hadoop/ConnectionRefused
	at sun.nio.ch.SocketChannelImpl.checkConnect(Native Method)
	at sun.nio.ch.SocketChannelImpl.finishConnect(SocketChannelImpl.java:739)
	at org.apache.hadoop.net.SocketIOWithTimeout.connect(SocketIOWithTimeout.java:206)
	at org.apache.hadoop.net.NetUtils.connect(NetUtils.java:530)
	at org.apache.hadoop.net.NetUtils.connect(NetUtils.java:494)
	at org.apache.hadoop.ipc.Client$Connection.setupConnection(Client.java:607)
	at org.apache.hadoop.ipc.Client$Connection.setupIOstreams(Client.java:705)
	at org.apache.hadoop.ipc.Client$Connection.access$2800(Client.java:368)
	at org.apache.hadoop.ipc.Client.getConnection(Client.java:1521)
	at org.apache.hadoop.ipc.Client.call(Client.java:1438)
	at org.apache.hadoop.ipc.Client.call(Client.java:1399)
	at org.apache.hadoop.ipc.ProtobufRpcEngine$Invoker.invoke(ProtobufRpcEngine.java:230)
	at com.sun.proxy.$Proxy87.registerNodeManager(Unknown Source)
	at org.apache.hadoop.yarn.server.api.impl.pb.client.ResourceTrackerPBClientImpl.registerNodeManager(ResourceTrackerPBClientImpl.java:68)
	at sun.reflect.NativeMethodAccessorImpl.invoke0(Native Method)
	at sun.reflect.NativeMethodAccessorImpl.invoke(NativeMethodAccessorImpl.java:57)
	at sun.reflect.DelegatingMethodAccessorImpl.invoke(DelegatingMethodAccessorImpl.java:43)
	at java.lang.reflect.Method.invoke(Method.java:606)
	at org.apache.hadoop.io.retry.RetryInvocationHandler.invokeMethod(RetryInvocationHandler.java:186)
	at org.apache.hadoop.io.retry.RetryInvocationHandler.invoke(RetryInvocationHandler.java:101)
	at com.sun.proxy.$Proxy88.registerNodeManager(Unknown Source)
	at org.apache.hadoop.yarn.client.TestResourceTrackerOnHA.testResourceTrackerOnHA(TestResourceTrackerOnHA.java:64)


FAILED:  org.apache.hadoop.yarn.client.api.impl.TestYarnClient.testReservationAPIs

Error Message:
org.apache.hadoop.yarn.server.resourcemanager.reservation.exceptions.PlanningException: The GreedyAgent couldn't find a valid allocation for your request
 at org.apache.hadoop.yarn.ipc.RPCUtil.getRemoteException(RPCUtil.java:38)
 at org.apache.hadoop.yarn.server.resourcemanager.ClientRMService.submitReservation(ClientRMService.java:1127)
 at org.apache.hadoop.yarn.api.impl.pb.service.ApplicationClientProtocolPBServiceImpl.submitReservation(ApplicationClientProtocolPBServiceImpl.java:418)
 at org.apache.hadoop.yarn.proto.ApplicationClientProtocol$ApplicationClientProtocolService$2.callBlockingMethod(ApplicationClientProtocol.java:433)
 at org.apache.hadoop.ipc.ProtobufRpcEngine$Server$ProtoBufRpcInvoker.call(ProtobufRpcEngine.java:637)
 at org.apache.hadoop.ipc.RPC$Server.call(RPC.java:966)
 at org.apache.hadoop.ipc.Server$Handler$1.run(Server.java:2127)
 at org.apache.hadoop.ipc.Server$Handler$1.run(Server.java:2123)
 at java.security.AccessController.doPrivileged(Native Method)
 at javax.security.auth.Subject.doAs(Subject.java:415)
 at org.apache.hadoop.security.UserGroupInformation.doAs(UserGroupInformation.java:1669)
 at org.apache.hadoop.ipc.Server$Handler.run(Server.java:2121)
Caused by: org.apache.hadoop.yarn.server.resourcemanager.reservation.exceptions.PlanningException: The GreedyAgent couldn't find a valid allocation for your request
 at org.apache.hadoop.yarn.server.resourcemanager.reservation.GreedyReservationAgent.computeAllocation(GreedyReservationAgent.java:130)
 at org.apache.hadoop.yarn.server.resourcemanager.reservation.GreedyReservationAgent.createReservation(GreedyReservationAgent.java:58)
 at org.apache.hadoop.yarn.server.resourcemanager.ClientRMService.submitReservation(ClientRMService.java:1110)
 ... 10 more


Stack Trace:
java.lang.AssertionError: org.apache.hadoop.yarn.server.resourcemanager.reservation.exceptions.PlanningException: The GreedyAgent couldn't find a valid allocation for your request
	at org.apache.hadoop.yarn.ipc.RPCUtil.getRemoteException(RPCUtil.java:38)
	at org.apache.hadoop.yarn.server.resourcemanager.ClientRMService.submitReservation(ClientRMService.java:1127)
	at org.apache.hadoop.yarn.api.impl.pb.service.ApplicationClientProtocolPBServiceImpl.submitReservation(ApplicationClientProtocolPBServiceImpl.java:418)
	at org.apache.hadoop.yarn.proto.ApplicationClientProtocol$ApplicationClientProtocolService$2.callBlockingMethod(ApplicationClientProtocol.java:433)
	at org.apache.hadoop.ipc.ProtobufRpcEngine$Server$ProtoBufRpcInvoker.call(ProtobufRpcEngine.java:637)
	at org.apache.hadoop.ipc.RPC$Server.call(RPC.java:966)
	at org.apache.hadoop.ipc.Server$Handler$1.run(Server.java:2127)
	at org.apache.hadoop.ipc.Server$Handler$1.run(Server.java:2123)
	at java.security.AccessController.doPrivileged(Native Method)
	at javax.security.auth.Subject.doAs(Subject.java:415)
	at org.apache.hadoop.security.UserGroupInformation.doAs(UserGroupInformation.java:1669)
	at org.apache.hadoop.ipc.Server$Handler.run(Server.java:2121)
Caused by: org.apache.hadoop.yarn.server.resourcemanager.reservation.exceptions.PlanningException: The GreedyAgent couldn't find a valid allocation for your request
	at org.apache.hadoop.yarn.server.resourcemanager.reservation.GreedyReservationAgent.computeAllocation(GreedyReservationAgent.java:130)
	at org.apache.hadoop.yarn.server.resourcemanager.reservation.GreedyReservationAgent.createReservation(GreedyReservationAgent.java:58)
	at org.apache.hadoop.yarn.server.resourcemanager.ClientRMService.submitReservation(ClientRMService.java:1110)
	... 10 more

	at org.junit.Assert.fail(Assert.java:88)
	at org.apache.hadoop.yarn.client.api.impl.TestYarnClient.testReservationAPIs(TestYarnClient.java:904)



Failed: YARN-3078 PreCommit Build #6369

Posted by Apache Jenkins Server <je...@builds.apache.org>.
Jira: https://issues.apache.org/jira/browse/YARN-3078
Build: https://builds.apache.org/job/PreCommit-YARN-Build/6369/

###################################################################################
########################## LAST 60 LINES OF THE CONSOLE ###########################
[...truncated 3198 lines...]

{color:red}-1 overall{color}.  Here are the results of testing the latest attachment 
  http://issues.apache.org/jira/secure/attachment/12693495/YARN-3078.001.patch
  against trunk revision 73b72a0.

    {color:green}+1 @author{color}.  The patch does not contain any @author tags.

    {color:red}-1 tests included{color}.  The patch doesn't appear to include any new or modified tests.
                        Please justify why no new tests are needed for this patch.
                        Also please list what manual steps were performed to verify this patch.

    {color:green}+1 javac{color}.  The applied patch does not increase the total number of javac compiler warnings.

    {color:green}+1 javadoc{color}.  There were no new javadoc warning messages.

    {color:green}+1 eclipse:eclipse{color}.  The patch built with eclipse:eclipse.

    {color:green}+1 findbugs{color}.  The patch does not introduce any new Findbugs (version 2.0.3) warnings.

    {color:green}+1 release audit{color}.  The applied patch does not increase the total number of release audit warnings.

    {color:green}+1 core tests{color}.  The patch passed unit tests in hadoop-yarn-project/hadoop-yarn/hadoop-yarn-common.

Test results: https://builds.apache.org/job/PreCommit-YARN-Build/6369//testReport/
Console output: https://builds.apache.org/job/PreCommit-YARN-Build/6369//console

This message is automatically generated.


======================================================================
======================================================================
    Adding comment to Jira.
======================================================================
======================================================================


Comment added.
2c81b2b41951b7e4b2020b475b3ae27f276083fd logged out


======================================================================
======================================================================
    Finished build.
======================================================================
======================================================================


Build step 'Execute shell' marked build as failure
Archiving artifacts
Sending artifact delta relative to PreCommit-YARN-Build #6366
Archived 15 artifacts
Archive block size is 32768
Received 237 blocks and 1099642 bytes
Compression is 87.6%
Took 1 sec
[description-setter] Could not determine description.
Recording test results
Email was triggered for: Failure
Sending email for trigger: Failure



###################################################################################
############################## FAILED TESTS (if any) ##############################
All tests passed