You are viewing a plain text version of this content. The canonical link for it is here.
Posted to builds@beam.apache.org by Apache Jenkins Server <je...@builds.apache.org> on 2023/06/02 06:15:31 UTC
Build failed in Jenkins: beam_PreCommit_Website_Cron #6862
See <https://ci-beam.apache.org/job/beam_PreCommit_Website_Cron/6862/display/redirect>
Changes:
------------------------------------------
Started by timer
Running as SYSTEM
[EnvInject] - Loading node environment variables.
Building remotely on apache-beam-jenkins-15 (beam) in workspace <https://ci-beam.apache.org/job/beam_PreCommit_Website_Cron/ws/>
The recommended git tool is: NONE
No credentials specified
Wiping out workspace first.
Cloning the remote Git repository
Using shallow clone with depth 1
Avoid fetching tags
Cloning repository https://github.com/apache/beam.git
> git init <https://ci-beam.apache.org/job/beam_PreCommit_Website_Cron/ws/src> # timeout=10
Fetching upstream changes from https://github.com/apache/beam.git
> git --version # timeout=10
> git --version # 'git version 2.25.1'
> git fetch --no-tags --force --progress --depth=1 -- https://github.com/apache/beam.git +refs/heads/*:refs/remotes/origin/* # timeout=10
> git config remote.origin.url https://github.com/apache/beam.git # timeout=10
> git config --add remote.origin.fetch +refs/heads/*:refs/remotes/origin/* # timeout=10
> git config remote.origin.url https://github.com/apache/beam.git # timeout=10
Using shallow fetch with depth 1
Fetching upstream changes from https://github.com/apache/beam.git
> git fetch --no-tags --force --progress --depth=1 -- https://github.com/apache/beam.git +refs/heads/*:refs/remotes/origin/* +refs/pull/${ghprbPullId}/*:refs/remotes/origin/pr/${ghprbPullId}/* # timeout=10
> git rev-parse origin/master^{commit} # timeout=10
Checking out Revision f5e17e3e3b9bf164381e84902108732a4f687552 (origin/master)
> git config core.sparsecheckout # timeout=10
> git checkout -f f5e17e3e3b9bf164381e84902108732a4f687552 # timeout=10
Commit message: "Revert "populate jobs with gradle scans access (#26379)" (#26972)"
> git rev-list --no-walk f5e17e3e3b9bf164381e84902108732a4f687552 # timeout=10
No emails were triggered.
[EnvInject] - Executing scripts and injecting environment variables after the SCM step.
[EnvInject] - Injecting as environment variables the properties content
SETUPTOOLS_USE_DISTUTILS=stdlib
SPARK_LOCAL_IP=127.0.0.1
[EnvInject] - Variables injected successfully.
[Gradle] - Launching build.
[src] $ <https://ci-beam.apache.org/job/beam_PreCommit_Website_Cron/ws/src/gradlew> --continue --max-workers=8 -Dorg.gradle.jvmargs=-Xms2g -Dorg.gradle.jvmargs=-Xmx6g -Dorg.gradle.vfs.watch=false -Pdocker-pull-licenses :websitePreCommit
To honour the JVM settings for this build a single-use Daemon process will be forked. See https://docs.gradle.org/7.5.1/userguide/gradle_daemon.html#sec:disabling_the_daemon.
Daemon will be stopped at the end of the build
Configuration on demand is an incubating feature.
Gradle Enterprise plugins resolution: https://plugins.gradle.org/m2
Enforcing Gradle Enterprise: https://ge.apache.org, allowUntrustedServer: false
> Task :buildSrc:compileJava NO-SOURCE
> Task :buildSrc:compileGroovy FROM-CACHE
> Task :buildSrc:pluginDescriptors
> Task :buildSrc:processResources
> Task :buildSrc:classes
> Task :buildSrc:jar
> Task :buildSrc:assemble
> Task :buildSrc:spotlessGroovy FROM-CACHE
> Task :buildSrc:spotlessGroovyCheck UP-TO-DATE
> Task :buildSrc:spotlessGroovyGradle FROM-CACHE
> Task :buildSrc:spotlessGroovyGradleCheck UP-TO-DATE
> Task :buildSrc:spotlessCheck UP-TO-DATE
> Task :buildSrc:pluginUnderTestMetadata
> Task :buildSrc:compileTestJava NO-SOURCE
> Task :buildSrc:compileTestGroovy NO-SOURCE
> Task :buildSrc:processTestResources NO-SOURCE
> Task :buildSrc:testClasses UP-TO-DATE
> Task :buildSrc:test NO-SOURCE
> Task :buildSrc:validatePlugins FROM-CACHE
> Task :buildSrc:check UP-TO-DATE
> Task :buildSrc:build
> Task :website:buildDockerImage
Sending build context to Docker daemon 71.06MB
Step 1/8 : FROM debian:stable-slim
---> cc2f487c8222
Step 2/8 : SHELL ["/bin/bash", "-o", "pipefail", "-e", "-u", "-x", "-c"]
---> Using cache
---> d617a50b564e
Step 3/8 : ENV DEBIAN_FRONTEND=noninteractive LANGUAGE=C.UTF-8 LANG=C.UTF-8 LC_ALL=C.UTF-8 LC_CTYPE=C.UTF-8 LC_MESSAGES=C.UTF-8
---> Using cache
---> a806f757f373
Step 4/8 : RUN apt-get update && apt-get install -y --no-install-recommends ca-certificates curl git gnupg2 gosu lynx && apt-get autoremove -yqq --purge && apt-get clean && rm -rf /var/lib/apt/lists/*
---> Using cache
---> 11ea2f8fba12
Step 5/8 : RUN curl -sL https://deb.nodesource.com/setup_10.x | bash - && apt-get update && apt-get install -y --no-install-recommends nodejs && apt-get autoremove -yqq --purge && apt-get clean && rm -rf /var/lib/apt/lists/*
---> Using cache
---> a50b3540bc2c
Step 6/8 : RUN curl -sS https://dl.yarnpkg.com/debian/pubkey.gpg | apt-key add - && echo "deb https://dl.yarnpkg.com/debian/ stable main" | tee /etc/apt/sources.list.d/yarn.list && apt-get update && apt-get install -y --no-install-recommends yarn && apt-get autoremove -yqq --purge && apt-get clean && rm -rf /var/lib/apt/lists/*
---> Using cache
---> 187b0d4779ce
Step 7/8 : RUN HUGOHOME="$(mktemp -d)" && export HUGOHOME && curl -sL https://github.com/gohugoio/hugo/releases/download/v0.68.3/hugo_extended_0.68.3_Linux-64bit.tar.gz > "${HUGOHOME}/hugo.tar.gz" && tar -xzvf "${HUGOHOME}/hugo.tar.gz" hugo && mv hugo /usr/local/bin/hugo && chmod +x /usr/local/bin/hugo && rm -r "${HUGOHOME}"
---> Using cache
---> c9694afef3d4
Step 8/8 : WORKDIR /opt/
---> Using cache
---> c042617d99ba
Successfully built c042617d99ba
Successfully tagged beam-website:latest
> Task :website:createDockerContainer
> Task :website:startDockerContainer
e2ba17549abae313c75cfe7d6f2e52f685c167554178bbc15468ac991cda528a
> Task :website:setupDockerContainer
> Task :website:installDependencies
yarn install v1.22.19
warning Skipping preferred cache folder "/.cache/yarn" because it is not writable.
warning Selected the next writable cache folder in the list, will be "/tmp/.yarn-cache-1017".
[1/4] Resolving packages...
[2/4] Fetching packages...
[3/4] Linking dependencies...
[4/4] Building fresh packages...
Done in 4.01s.
> Task :website:initGitSubmodules
Submodule '.github/actions/cancel-workflow-runs' (https://github.com/potiuk/cancel-workflow-runs) registered for path '.github/actions/cancel-workflow-runs'
Submodule '.github/actions/github-push-action' (https://github.com/ad-m/github-push-action) registered for path '.github/actions/github-push-action'
Submodule '.github/actions/gradle-command-action' (https://github.com/eskatos/gradle-command-action) registered for path '.github/actions/gradle-command-action'
Submodule 'website/www/site/themes/docsy' (https://github.com/google/docsy.git) registered for path 'website/www/site/themes/docsy'
Cloning into '/opt/.github/actions/cancel-workflow-runs'...
Cloning into '/opt/.github/actions/github-push-action'...
Cloning into '/opt/.github/actions/gradle-command-action'...
Cloning into '/opt/website/www/site/themes/docsy'...
Submodule path '.github/actions/cancel-workflow-runs': checked out '953e057dc81d3458935a18d1184c386b0f6b5738'
Submodule path '.github/actions/github-push-action': checked out '057a6ba835d986bfe495dd476a6c4db1d5f9503c'
Submodule path '.github/actions/gradle-command-action': checked out '90ccf054e6b9905f30f98c938bce4c6acd323b6b'
Submodule path 'website/www/site/themes/docsy': checked out '8b786354829536454688df1e63b9cad792f68562'
Submodule 'assets/vendor/Font-Awesome' (https://github.com/FortAwesome/Font-Awesome.git) registered for path 'website/www/site/themes/docsy/assets/vendor/Font-Awesome'
Submodule 'assets/vendor/bootstrap' (https://github.com/twbs/bootstrap.git) registered for path 'website/www/site/themes/docsy/assets/vendor/bootstrap'
Cloning into '/opt/website/www/site/themes/docsy/assets/vendor/Font-Awesome'...
Cloning into '/opt/website/www/site/themes/docsy/assets/vendor/bootstrap'...
Submodule path 'website/www/site/themes/docsy/assets/vendor/Font-Awesome': checked out '538a5bc4cf7989821d052e3ff919e2bead07021c'
Submodule path 'website/www/site/themes/docsy/assets/vendor/bootstrap': checked out '3b558734382ce58b51e5fc676453bfd53bba9201'
> Task :website:buildCodeSamples
yarn run v1.22.19
warning Skipping preferred cache folder "/.cache/yarn" because it is not writable.
warning Selected the next writable cache folder in the list, will be "/tmp/.yarn-cache-1017".
$ ./build_code_samples.sh
warning Cannot find a suitable global folder. Tried these: "/usr/local, /.yarn"
Working directory: /opt/website/www
Dist directory: ./site/code_samples
mkdir: created directory './site/code_samples'
Done in 0.83s.
> Task :website:buildLocalWebsite
yarn run v1.22.19
warning Skipping preferred cache folder "/.cache/yarn" because it is not writable.
warning Selected the next writable cache folder in the list, will be "/tmp/.yarn-cache-1017".
$ cross-env HUGO_ENV=production hugo --minify -d ../dist -s site -v -d /opt/build/website/generated-local-content --config /opt/website/www/site/config.toml
warning Cannot find a suitable global folder. Tried these: "/usr/local, /.yarn"
INFO 2023/06/02 06:15:16 Using config file:
Building sites … INFO 2023/06/02 06:15:16 syncing static files to /opt/build/website/generated-local-content/
INFO 2023/06/02 06:15:16 postcss: use config file /opt/website/www/site/themes/docsy/postcss.config.js
Replace Autoprefixer browsers option to Browserslist config.
Use browserslist key in package.json or .browserslistrc file.
Using browsers option can cause errors. Browserslist config
can be used for Babel, Autoprefixer, postcss-normalize and other tools.
If you really need to use option, rename it to overrideBrowserslist.
Learn more at:
https://github.com/browserslist/browserslist#readme
https://twitter.com/browserslist
Browserslist: caniuse-lite is outdated. Please run:
npx browserslist@latest --update-db
Why you should do it regularly:
https://github.com/browserslist/browserslist#browsers-data-updating
ERROR 2023/06/02 06:15:18 Author 'riteshghorse' is not defined. Please add them to 'website/www/site/data/authors.yml'
Total in 11911 ms
Error: Error building site: logged 1 error(s)
info Visit https://yarnpkg.com/en/docs/cli/run for documentation about this command.
error Command failed with exit code 255.
> Task :website:buildLocalWebsite FAILED
> Task :website:stopAndRemoveDockerContainer
e2ba17549abae313c75cfe7d6f2e52f685c167554178bbc15468ac991cda528a
FAILURE: Build failed with an exception.
* What went wrong:
Execution failed for task ':website:buildLocalWebsite'.
> Process 'command 'docker'' finished with non-zero exit value 255
* Try:
> Run with --stacktrace option to get the stack trace.
> Run with --info or --debug option to get more log output.
* Get more help at https://help.gradle.org
BUILD FAILED in 1m 5s
19 actionable tasks: 13 executed, 4 from cache, 2 up-to-date
Publishing build scan...
https://ge.apache.org/s/fkfveynvgovq4
Build step 'Invoke Gradle script' changed build result to FAILURE
Build step 'Invoke Gradle script' marked build as failure
---------------------------------------------------------------------
To unsubscribe, e-mail: builds-unsubscribe@beam.apache.org
For additional commands, e-mail: builds-help@beam.apache.org
Jenkins build is back to normal : beam_PreCommit_Website_Cron #6864
Posted by Apache Jenkins Server <je...@builds.apache.org>.
See <https://ci-beam.apache.org/job/beam_PreCommit_Website_Cron/6864/display/redirect?page=changes>
---------------------------------------------------------------------
To unsubscribe, e-mail: builds-unsubscribe@beam.apache.org
For additional commands, e-mail: builds-help@beam.apache.org
Build failed in Jenkins: beam_PreCommit_Website_Cron #6863
Posted by Apache Jenkins Server <je...@builds.apache.org>.
See <https://ci-beam.apache.org/job/beam_PreCommit_Website_Cron/6863/display/redirect>
Changes:
------------------------------------------
[...truncated 31.00 KB...]
## Running `apt-get update` for you...
+ apt-get update
Get:1 https://deb.nodesource.com/node_10.x bullseye InRelease [4586 B]
Hit:2 http://deb.debian.org/debian stable InRelease
Get:3 https://deb.nodesource.com/node_10.x bullseye/main amd64 Packages [769 B]
Hit:4 http://deb.debian.org/debian-security stable-security InRelease
Hit:5 http://deb.debian.org/debian stable-updates InRelease
Fetched 5355 B in 1s (9046 B/s)
Reading package lists...
## Run `sudo apt-get install -y nodejs` to install Node.js 10.x and npm
## You may also need development tools to build native addons:
sudo apt-get install gcc g++ make
## To install the Yarn package manager, run:
curl -sL https://dl.yarnpkg.com/debian/pubkey.gpg | gpg --dearmor | sudo tee /usr/share/keyrings/yarnkey.gpg >/dev/null
echo "deb [signed-by=/usr/share/keyrings/yarnkey.gpg] https://dl.yarnpkg.com/debian stable main" | sudo tee /etc/apt/sources.list.d/yarn.list
sudo apt-get update && sudo apt-get install yarn
[91m+ apt-get update
[0mHit:1 https://deb.nodesource.com/node_10.x bullseye InRelease
Hit:2 http://deb.debian.org/debian stable InRelease
Hit:3 http://deb.debian.org/debian-security stable-security InRelease
Hit:4 http://deb.debian.org/debian stable-updates InRelease
Reading package lists...
[91m+ apt-get install -y --no-install-recommends nodejs
[0mReading package lists...
Building dependency tree...
Reading state information...
The following additional packages will be installed:
libc-ares2 libicu67 libnode72 libuv1
Suggested packages:
npm
Recommended packages:
nodejs-doc
The following NEW packages will be installed:
libc-ares2 libicu67 libnode72 libuv1 nodejs
0 upgraded, 5 newly installed, 0 to remove and 1 not upgraded.
Need to get 17.3 MB of archives.
After this operation, 72.0 MB of additional disk space will be used.
Get:1 http://deb.debian.org/debian stable/main amd64 libc-ares2 amd64 1.17.1-1+deb11u2 [102 kB]
Get:2 http://deb.debian.org/debian stable/main amd64 libicu67 amd64 67.1-7 [8622 kB]
Get:3 http://deb.debian.org/debian stable/main amd64 libuv1 amd64 1.40.0-2 [132 kB]
Get:4 http://deb.debian.org/debian-security stable-security/main amd64 libnode72 amd64 12.22.12~dfsg-1~deb11u4 [8332 kB]
Get:5 http://deb.debian.org/debian-security stable-security/main amd64 nodejs amd64 12.22.12~dfsg-1~deb11u4 [148 kB]
[91mdebconf: delaying package configuration, since apt-utils is not installed
[0mFetched 17.3 MB in 0s (38.1 MB/s)
Selecting previously unselected package libc-ares2:amd64.
(Reading database ... (Reading database ... 5%(Reading database ... 10%(Reading database ... 15%(Reading database ... 20%(Reading database ... 25%(Reading database ... 30%(Reading database ... 35%(Reading database ... 40%(Reading database ... 45%(Reading database ... 50%(Reading database ... 55%(Reading database ... 60%(Reading database ... 65%(Reading database ... 70%(Reading database ... 75%(Reading database ... 80%(Reading database ... 85%(Reading database ... 90%(Reading database ... 95%(Reading database ... 100%(Reading database ... 11204 files and directories currently installed.)
Preparing to unpack .../libc-ares2_1.17.1-1+deb11u2_amd64.deb ...
Unpacking libc-ares2:amd64 (1.17.1-1+deb11u2) ...
Selecting previously unselected package libicu67:amd64.
Preparing to unpack .../libicu67_67.1-7_amd64.deb ...
Unpacking libicu67:amd64 (67.1-7) ...
Selecting previously unselected package libuv1:amd64.
Preparing to unpack .../libuv1_1.40.0-2_amd64.deb ...
Unpacking libuv1:amd64 (1.40.0-2) ...
Selecting previously unselected package libnode72:amd64.
Preparing to unpack .../libnode72_12.22.12~dfsg-1~deb11u4_amd64.deb ...
Unpacking libnode72:amd64 (12.22.12~dfsg-1~deb11u4) ...
Selecting previously unselected package nodejs.
Preparing to unpack .../nodejs_12.22.12~dfsg-1~deb11u4_amd64.deb ...
Unpacking nodejs (12.22.12~dfsg-1~deb11u4) ...
Setting up libicu67:amd64 (67.1-7) ...
Setting up libc-ares2:amd64 (1.17.1-1+deb11u2) ...
Setting up libuv1:amd64 (1.40.0-2) ...
Setting up libnode72:amd64 (12.22.12~dfsg-1~deb11u4) ...
Setting up nodejs (12.22.12~dfsg-1~deb11u4) ...
update-alternatives: using /usr/bin/nodejs to provide /usr/bin/js (js) in auto mode
update-alternatives: warning: skip creation of /usr/share/man/man1/js.1.gz because associated file /usr/share/man/man1/nodejs.1.gz (of link group js) doesn't exist
Processing triggers for libc-bin (2.31-13+deb11u6) ...
[91m+ apt-get autoremove -yqq --purge
[0m[91m+ apt-get clean
[0m[91m+ rm -rf /var/lib/apt/lists/auxfiles /var/lib/apt/lists/deb.debian.org_debian-security_dists_stable-security_InRelease /var/lib/apt/lists/deb.debian.org_debian-security_dists_stable-security_main_binary-amd64_Packages.lz4 /var/lib/apt/lists/deb.debian.org_debian_dists_stable-updates_InRelease /var/lib/apt/lists/deb.debian.org_debian_dists_stable-updates_main_binary-amd64_Packages.lz4 /var/lib/apt/lists/deb.debian.org_debian_dists_stable_InRelease /var/lib/apt/lists/deb.debian.org_debian_dists_stable_main_binary-amd64_Packages.lz4 /var/lib/apt/lists/deb.nodesource.com_node%5f10.x_dists_bullseye_InRelease /var/lib/apt/lists/deb.nodesource.com_node%5f10.x_dists_bullseye_main_binary-amd64_Packages.lz4 /var/lib/apt/lists/lock /var/lib/apt/lists/partial
[0mRemoving intermediate container b75cfe393989
---> 8dffb7aba0cc
Step 6/8 : RUN curl -sS https://dl.yarnpkg.com/debian/pubkey.gpg | apt-key add - && echo "deb https://dl.yarnpkg.com/debian/ stable main" | tee /etc/apt/sources.list.d/yarn.list && apt-get update && apt-get install -y --no-install-recommends yarn && apt-get autoremove -yqq --purge && apt-get clean && rm -rf /var/lib/apt/lists/*
---> Running in 9a47aeefeb73
[91m+ curl -sS https://dl.yarnpkg.com/debian/pubkey.gpg
[0m[91m+ apt-key add -
[0m[91mWarning: apt-key is deprecated. Manage keyring files in trusted.gpg.d instead (see apt-key(8)).
[0mOK
[91m+ echo 'deb https://dl.yarnpkg.com/debian/ stable main'
[0m[91m+ tee /etc/apt/sources.list.d/yarn.list
[0mdeb https://dl.yarnpkg.com/debian/ stable main
[91m+ apt-get update
[0mGet:1 https://dl.yarnpkg.com/debian stable InRelease [17.1 kB]
Get:2 http://deb.debian.org/debian stable InRelease [116 kB]
Get:3 https://deb.nodesource.com/node_10.x bullseye InRelease [4586 B]
Get:4 http://deb.debian.org/debian-security stable-security InRelease [48.4 kB]
Get:5 http://deb.debian.org/debian stable-updates InRelease [44.1 kB]
Get:6 https://dl.yarnpkg.com/debian stable/main amd64 Packages [10.9 kB]
Get:7 https://dl.yarnpkg.com/debian stable/main all Packages [10.9 kB]
Get:8 https://deb.nodesource.com/node_10.x bullseye/main amd64 Packages [769 B]
Get:9 http://deb.debian.org/debian stable/main amd64 Packages [8183 kB]
Get:10 http://deb.debian.org/debian-security stable-security/main amd64 Packages [245 kB]
Get:11 http://deb.debian.org/debian stable-updates/main amd64 Packages [14.8 kB]
Fetched 8695 kB in 2s (4235 kB/s)
Reading package lists...
[91m+ apt-get install -y --no-install-recommends yarn
[0mReading package lists...
Building dependency tree...
Reading state information...
The following NEW packages will be installed:
yarn
0 upgraded, 1 newly installed, 0 to remove and 1 not upgraded.
Need to get 893 kB of archives.
After this operation, 5415 kB of additional disk space will be used.
Get:1 https://dl.yarnpkg.com/debian stable/main amd64 yarn all 1.22.19-1 [893 kB]
[91mdebconf: delaying package configuration, since apt-utils is not installed
[0mFetched 893 kB in 0s (6039 kB/s)
Selecting previously unselected package yarn.
(Reading database ... (Reading database ... 5%(Reading database ... 10%(Reading database ... 15%(Reading database ... 20%(Reading database ... 25%(Reading database ... 30%(Reading database ... 35%(Reading database ... 40%(Reading database ... 45%(Reading database ... 50%(Reading database ... 55%(Reading database ... 60%(Reading database ... 65%(Reading database ... 70%(Reading database ... 75%(Reading database ... 80%(Reading database ... 85%(Reading database ... 90%(Reading database ... 95%(Reading database ... 100%(Reading database ... 11303 files and directories currently installed.)
Preparing to unpack .../yarn_1.22.19-1_all.deb ...
Unpacking yarn (1.22.19-1) ...
Setting up yarn (1.22.19-1) ...
[91m+ apt-get autoremove -yqq --purge
[0m[91m+ apt-get clean
[0m[91m+ rm -rf /var/lib/apt/lists/auxfiles /var/lib/apt/lists/deb.debian.org_debian-security_dists_stable-security_InRelease /var/lib/apt/lists/deb.debian.org_debian-security_dists_stable-security_main_binary-amd64_Packages.lz4 /var/lib/apt/lists/deb.debian.org_debian_dists_stable-updates_InRelease /var/lib/apt/lists/deb.debian.org_debian_dists_stable-updates_main_binary-amd64_Packages.lz4 /var/lib/apt/lists/deb.debian.org_debian_dists_stable_InRelease /var/lib/apt/lists/deb.debian.org_debian_dists_stable_main_binary-amd64_Packages.lz4 /var/lib/apt/lists/deb.nodesource.com_node%5f10.x_dists_bullseye_InRelease /var/lib/apt/lists/deb.nodesource.com_node%5f10.x_dists_bullseye_main_binary-amd64_Packages.lz4 /var/lib/apt/lists/dl.yarnpkg.com_debian_dists_stable_InRelease /var/lib/apt/lists/dl.yarnpkg.com_debian_dists_stable_main_binary-all_Packages.lz4 /var/lib/apt/lists/dl.yarnpkg.com_debian_dists_stable_main_binary-amd64_Packages.lz4 /var/lib/apt/lists/lock /var/lib/apt/lists/partial
[0mRemoving intermediate container 9a47aeefeb73
---> 40ba58924cf0
Step 7/8 : RUN HUGOHOME="$(mktemp -d)" && export HUGOHOME && curl -sL https://github.com/gohugoio/hugo/releases/download/v0.68.3/hugo_extended_0.68.3_Linux-64bit.tar.gz > "${HUGOHOME}/hugo.tar.gz" && tar -xzvf "${HUGOHOME}/hugo.tar.gz" hugo && mv hugo /usr/local/bin/hugo && chmod +x /usr/local/bin/hugo && rm -r "${HUGOHOME}"
---> Running in f6b03cdd24b0
[91m++ mktemp -d
[0m[91m+ HUGOHOME=/tmp/tmp.XKBbjFCp3q
+ export HUGOHOME
+ curl -sL https://github.com/gohugoio/hugo/releases/download/v0.68.3/hugo_extended_0.68.3_Linux-64bit.tar.gz
[0m[91m+ tar -xzvf /tmp/tmp.XKBbjFCp3q/hugo.tar.gz hugo
[0mhugo
[91m+ mv hugo /usr/local/bin/hugo
[0m[91m+ chmod +x /usr/local/bin/hugo
[0m[91m+ rm -r /tmp/tmp.XKBbjFCp3q
[0mRemoving intermediate container f6b03cdd24b0
---> e494ff6d20b1
Step 8/8 : WORKDIR /opt/
---> Running in e15e5ee50006
Removing intermediate container e15e5ee50006
---> 8b7b64db78c9
Successfully built 8b7b64db78c9
Successfully tagged beam-website:latest
> Task :website:createDockerContainer
> Task :website:startDockerContainer
4f49b5ddac8afe3e0052daa548d0394f94fd51be69eb172536cf3518954d8024
> Task :website:setupDockerContainer
> Task :website:installDependencies
yarn install v1.22.19
warning Skipping preferred cache folder "/.cache/yarn" because it is not writable.
warning Selected the next writable cache folder in the list, will be "/tmp/.yarn-cache-1017".
[1/4] Resolving packages...
[2/4] Fetching packages...
[3/4] Linking dependencies...
[4/4] Building fresh packages...
Done in 3.83s.
> Task :website:initGitSubmodules
Submodule '.github/actions/cancel-workflow-runs' (https://github.com/potiuk/cancel-workflow-runs) registered for path '.github/actions/cancel-workflow-runs'
Submodule '.github/actions/github-push-action' (https://github.com/ad-m/github-push-action) registered for path '.github/actions/github-push-action'
Submodule '.github/actions/gradle-command-action' (https://github.com/eskatos/gradle-command-action) registered for path '.github/actions/gradle-command-action'
Submodule 'website/www/site/themes/docsy' (https://github.com/google/docsy.git) registered for path 'website/www/site/themes/docsy'
Cloning into '/opt/.github/actions/cancel-workflow-runs'...
Cloning into '/opt/.github/actions/github-push-action'...
Cloning into '/opt/.github/actions/gradle-command-action'...
Cloning into '/opt/website/www/site/themes/docsy'...
Submodule path '.github/actions/cancel-workflow-runs': checked out '953e057dc81d3458935a18d1184c386b0f6b5738'
Submodule path '.github/actions/github-push-action': checked out '057a6ba835d986bfe495dd476a6c4db1d5f9503c'
Submodule path '.github/actions/gradle-command-action': checked out '90ccf054e6b9905f30f98c938bce4c6acd323b6b'
Submodule path 'website/www/site/themes/docsy': checked out '8b786354829536454688df1e63b9cad792f68562'
Submodule 'assets/vendor/Font-Awesome' (https://github.com/FortAwesome/Font-Awesome.git) registered for path 'website/www/site/themes/docsy/assets/vendor/Font-Awesome'
Submodule 'assets/vendor/bootstrap' (https://github.com/twbs/bootstrap.git) registered for path 'website/www/site/themes/docsy/assets/vendor/bootstrap'
Cloning into '/opt/website/www/site/themes/docsy/assets/vendor/Font-Awesome'...
Cloning into '/opt/website/www/site/themes/docsy/assets/vendor/bootstrap'...
Submodule path 'website/www/site/themes/docsy/assets/vendor/Font-Awesome': checked out '538a5bc4cf7989821d052e3ff919e2bead07021c'
Submodule path 'website/www/site/themes/docsy/assets/vendor/bootstrap': checked out '3b558734382ce58b51e5fc676453bfd53bba9201'
> Task :website:buildCodeSamples
yarn run v1.22.19
warning Skipping preferred cache folder "/.cache/yarn" because it is not writable.
warning Selected the next writable cache folder in the list, will be "/tmp/.yarn-cache-1017".
$ ./build_code_samples.sh
warning Cannot find a suitable global folder. Tried these: "/usr/local, /.yarn"
Working directory: /opt/website/www
Dist directory: ./site/code_samples
mkdir: created directory './site/code_samples'
Done in 0.81s.
> Task :website:buildLocalWebsite
yarn run v1.22.19
warning Skipping preferred cache folder "/.cache/yarn" because it is not writable.
warning Selected the next writable cache folder in the list, will be "/tmp/.yarn-cache-1017".
$ cross-env HUGO_ENV=production hugo --minify -d ../dist -s site -v -d /opt/build/website/generated-local-content --config /opt/website/www/site/config.toml
warning Cannot find a suitable global folder. Tried these: "/usr/local, /.yarn"
INFO 2023/06/02 12:16:22 Using config file:
Building sites … INFO 2023/06/02 12:16:22 syncing static files to /opt/build/website/generated-local-content/
INFO 2023/06/02 12:16:22 postcss: use config file /opt/website/www/site/themes/docsy/postcss.config.js
Replace Autoprefixer browsers option to Browserslist config.
Use browserslist key in package.json or .browserslistrc file.
Using browsers option can cause errors. Browserslist config
can be used for Babel, Autoprefixer, postcss-normalize and other tools.
If you really need to use option, rename it to overrideBrowserslist.
Learn more at:
https://github.com/browserslist/browserslist#readme
https://twitter.com/browserslist
Browserslist: caniuse-lite is outdated. Please run:
npx browserslist@latest --update-db
Why you should do it regularly:
https://github.com/browserslist/browserslist#browsers-data-updating
ERROR 2023/06/02 12:16:23 Author 'riteshghorse' is not defined. Please add them to 'website/www/site/data/authors.yml'
Total in 12476 ms
Error: Error building site: logged 1 error(s)
error Command failed with exit code 255.
info Visit https://yarnpkg.com/en/docs/cli/run for documentation about this command.
> Task :website:buildLocalWebsite FAILED
> Task :website:stopAndRemoveDockerContainer
4f49b5ddac8afe3e0052daa548d0394f94fd51be69eb172536cf3518954d8024
FAILURE: Build failed with an exception.
* What went wrong:
Execution failed for task ':website:buildLocalWebsite'.
> Process 'command 'docker'' finished with non-zero exit value 255
* Try:
> Run with --stacktrace option to get the stack trace.
> Run with --info or --debug option to get more log output.
* Get more help at https://help.gradle.org
BUILD FAILED in 2m 12s
19 actionable tasks: 13 executed, 4 from cache, 2 up-to-date
Publishing build scan...
https://ge.apache.org/s/ip3nl5shkokqw
Build step 'Invoke Gradle script' changed build result to FAILURE
Build step 'Invoke Gradle script' marked build as failure
---------------------------------------------------------------------
To unsubscribe, e-mail: builds-unsubscribe@beam.apache.org
For additional commands, e-mail: builds-help@beam.apache.org