You are viewing a plain text version of this content. The canonical link for it is here.
Posted to builds@beam.apache.org by Apache Jenkins Server <je...@builds.apache.org> on 2019/07/27 18:57:50 UTC

Build failed in Jenkins: beam_PostCommit_Python36 #68

See <https://builds.apache.org/job/beam_PostCommit_Python36/68/display/redirect>

------------------------------------------
[...truncated 431.39 KB...]
          {
            "key": "query",
            "label": "Query",
            "namespace": "apache_beam.io.gcp.bigquery.BigQuerySource",
            "type": "STRING",
            "value": "SELECT * FROM (SELECT \"apple\" as fruit) UNION ALL (SELECT \"orange\" as fruit)"
          },
          {
            "key": "validation",
            "label": "Validation Enabled",
            "namespace": "apache_beam.io.gcp.bigquery.BigQuerySource",
            "type": "BOOLEAN",
            "value": false
          }
        ],
        "format": "bigquery",
        "output_info": [
          {
            "encoding": {
              "@type": "kind:windowed_value",
              "component_encodings": [
                {
                  "@type": "FastPrimitivesCoder$eNprYE5OLEhMzkiNT0pNzNVLzk9JLSqGUlxuicUlAUWZuZklmWWpxc4gQa5CBs3GQsbaQqYIfgYGhvi0xJycpMTk7HiwlkJ8pgVkJmfnpEJNYQGawlpbyJZUnKQHACYlLgM=",
                  "component_encodings": [
                    {
                      "@type": "FastPrimitivesCoder$eNprYE5OLEhMzkiNT0pNzNVLzk9JLSqGUlxuicUlAUWZuZklmWWpxc4gQa5CBs3GQsbaQqYIfgYGhvi0xJycpMTk7HiwlkJ8pgVkJmfnpEJNYQGawlpbyJZUnKQHACYlLgM=",
                      "component_encodings": []
                    },
                    {
                      "@type": "FastPrimitivesCoder$eNprYE5OLEhMzkiNT0pNzNVLzk9JLSqGUlxuicUlAUWZuZklmWWpxc4gQa5CBs3GQsbaQqYIfgYGhvi0xJycpMTk7HiwlkJ8pgVkJmfnpEJNYQGawlpbyJZUnKQHACYlLgM=",
                      "component_encodings": []
                    }
                  ],
                  "is_pair_like": true
                },
                {
                  "@type": "kind:global_window"
                }
              ],
              "is_wrapper": true
            },
            "output_name": "out",
            "user_name": "read.out"
          }
        ],
        "user_name": "read"
      }
    },
    {
      "kind": "ParallelWrite",
      "name": "s2",
      "properties": {
        "bigquery_kms_key": "projects/apache-beam-testing/locations/global/keyRings/beam-it/cryptoKeys/test",
        "create_disposition": "CREATE_IF_NEEDED",
        "dataset": "python_query_to_table_15642529661736",
        "display_data": [],
        "encoding": {
          "@type": "kind:windowed_value",
          "component_encodings": [
            {
              "@type": "RowAsDictJsonCoder$eNprYE5OLEhMzkiNT0pNzNXLzNdLTy7QS8pMLyxNLaqML8nPzynmCsovdyx2yUwu8SrOz3POT0kt4ipk0GwsZKwtZErSAwBK5xfp",
              "component_encodings": []
            },
            {
              "@type": "kind:global_window"
            }
          ],
          "is_wrapper": true
        },
        "format": "bigquery",
        "parallel_input": {
          "@type": "OutputReference",
          "output_name": "out",
          "step_name": "s1"
        },
        "schema": "{\"fields\": [{\"name\": \"fruit\", \"type\": \"STRING\", \"mode\": \"NULLABLE\"}]}",
        "table": "output_table",
        "user_name": "write/NativeWrite",
        "write_disposition": "WRITE_EMPTY"
      }
    }
  ],
  "type": "JOB_TYPE_BATCH"
}
root: INFO: Create job: <Job
 createTime: '2019-07-27T18:42:56.836385Z'
 currentStateTime: '1970-01-01T00:00:00Z'
 id: '2019-07-27_11_42_55-7241434226165239487'
 location: 'us-central1'
 name: 'beamapp-jenkins-0727184247-221650'
 projectId: 'apache-beam-testing'
 stageStates: []
 startTime: '2019-07-27T18:42:56.836385Z'
 steps: []
 tempFiles: []
 type: TypeValueValuesEnum(JOB_TYPE_BATCH, 1)>
root: INFO: Created job with id: [2019-07-27_11_42_55-7241434226165239487]
root: INFO: To access the Dataflow monitoring console, please navigate to https://console.cloud.google.com/dataflow/jobsDetail/locations/us-central1/jobs/2019-07-27_11_42_55-7241434226165239487?project=apache-beam-testing
root: INFO: Job 2019-07-27_11_42_55-7241434226165239487 is in state JOB_STATE_RUNNING
root: INFO: 2019-07-27T18:42:55.649Z: JOB_MESSAGE_DETAILED: Autoscaling is enabled for job 2019-07-27_11_42_55-7241434226165239487. The number of workers will be between 1 and 1000.
root: INFO: 2019-07-27T18:42:55.750Z: JOB_MESSAGE_DETAILED: Autoscaling was automatically enabled for job 2019-07-27_11_42_55-7241434226165239487.
root: INFO: 2019-07-27T18:42:58.680Z: JOB_MESSAGE_DETAILED: Checking permissions granted to controller Service Account.
root: INFO: 2019-07-27T18:42:59.196Z: JOB_MESSAGE_BASIC: Worker configuration: n1-standard-1 in us-central1-a.
root: INFO: 2019-07-27T18:42:59.757Z: JOB_MESSAGE_DETAILED: Expanding CoGroupByKey operations into optimizable parts.
root: INFO: 2019-07-27T18:42:59.795Z: JOB_MESSAGE_DETAILED: Expanding GroupByKey operations into optimizable parts.
root: INFO: 2019-07-27T18:42:59.838Z: JOB_MESSAGE_DETAILED: Lifting ValueCombiningMappingFns into MergeBucketsMappingFns
root: INFO: 2019-07-27T18:42:59.885Z: JOB_MESSAGE_DEBUG: Annotating graph with Autotuner information.
root: INFO: 2019-07-27T18:43:00.129Z: JOB_MESSAGE_DETAILED: Fusing adjacent ParDo, Read, Write, and Flatten operations
root: INFO: 2019-07-27T18:43:00.169Z: JOB_MESSAGE_DETAILED: Fusing consumer write/NativeWrite into read
root: INFO: 2019-07-27T18:43:00.214Z: JOB_MESSAGE_DEBUG: Workflow config is missing a default resource spec.
root: INFO: 2019-07-27T18:43:00.261Z: JOB_MESSAGE_DEBUG: Adding StepResource setup and teardown to workflow graph.
root: INFO: 2019-07-27T18:43:00.307Z: JOB_MESSAGE_DEBUG: Adding workflow start and stop steps.
root: INFO: 2019-07-27T18:43:00.352Z: JOB_MESSAGE_DEBUG: Assigning stage ids.
root: INFO: 2019-07-27T18:43:00.525Z: JOB_MESSAGE_DEBUG: Executing wait step start3
root: INFO: 2019-07-27T18:43:00.611Z: JOB_MESSAGE_BASIC: Executing operation read+write/NativeWrite
root: INFO: 2019-07-27T18:43:00.666Z: JOB_MESSAGE_DEBUG: Starting worker pool setup.
root: INFO: 2019-07-27T18:43:00.713Z: JOB_MESSAGE_BASIC: Starting 1 workers in us-central1-a...
root: INFO: 2019-07-27T18:43:00.944Z: JOB_MESSAGE_BASIC: Worker configuration: n1-standard-1 in us-central1-a.
root: INFO: 2019-07-27T18:43:02.532Z: JOB_MESSAGE_BASIC: BigQuery query issued as job: "dataflow_job_3903582801479510692". You can check its status with the bq tool: "bq show -j --project_id=apache-beam-testing dataflow_job_3903582801479510692".
--------------------- >> end captured logging << ---------------------
Found: https://console.cloud.google.com/dataflow/jobsDetail/locations/us-central1/jobs/2019-07-27_11_05_52-13465377056598413588?project=apache-beam-testing.
<https://builds.apache.org/job/beam_PostCommit_Python36/ws/src/sdks/python/apache_beam/io/gcp/bigquery.py>:1150: BeamDeprecationWarning: options is deprecated since First stable release. References to <pipeline>.options will not be supported
Found: https://console.cloud.google.com/dataflow/jobsDetail/locations/us-central1/jobs/2019-07-27_11_22_28-17635818063566134848?project=apache-beam-testing.
  experiments = p.options.view_as(DebugOptions).experiments or []
Found: https://console.cloud.google.com/dataflow/jobsDetail/locations/us-central1/jobs/2019-07-27_11_30_54-13256453709628684559?project=apache-beam-testing.
Found: https://console.cloud.google.com/dataflow/jobsDetail/locations/us-central1/jobs/2019-07-27_11_39_55-14429835692842966214?project=apache-beam-testing.
Found: https://console.cloud.google.com/dataflow/jobsDetail/locations/us-central1/jobs/2019-07-27_11_05_50-16367124689983632625?project=apache-beam-testing.
<https://builds.apache.org/job/beam_PostCommit_Python36/ws/src/sdks/python/apache_beam/runners/dataflow/dataflow_runner.py>:686: BeamDeprecationWarning: BigQuerySink is deprecated since 2.11.0. Use WriteToBigQuery instead.
  kms_key=transform.kms_key))
Found: https://console.cloud.google.com/dataflow/jobsDetail/locations/us-central1/jobs/2019-07-27_11_30_24-4707844652548316400?project=apache-beam-testing.
Found: https://console.cloud.google.com/dataflow/jobsDetail/locations/us-central1/jobs/2019-07-27_11_38_43-4308730525401170868?project=apache-beam-testing.
Found: https://console.cloud.google.com/dataflow/jobsDetail/locations/us-central1/jobs/2019-07-27_11_05_52-8487739096264660225?project=apache-beam-testing.
<https://builds.apache.org/job/beam_PostCommit_Python36/ws/src/sdks/python/apache_beam/io/gcp/bigquery.py>:1150: BeamDeprecationWarning: options is deprecated since First stable release. References to <pipeline>.options will not be supported
Found: https://console.cloud.google.com/dataflow/jobsDetail/locations/us-central1/jobs/2019-07-27_11_18_47-7436039554789169283?project=apache-beam-testing.
  experiments = p.options.view_as(DebugOptions).experiments or []
Found: https://console.cloud.google.com/dataflow/jobsDetail/locations/us-central1/jobs/2019-07-27_11_29_13-1353862047822804545?project=apache-beam-testing.
Found: https://console.cloud.google.com/dataflow/jobsDetail/locations/us-central1/jobs/2019-07-27_11_38_47-5701183768207437617?project=apache-beam-testing.
<https://builds.apache.org/job/beam_PostCommit_Python36/ws/src/sdks/python/apache_beam/io/gcp/bigquery_file_loads.py>:638: BeamDeprecationWarning: options is deprecated since First stable release. References to <pipeline>.options will not be supported
Found: https://console.cloud.google.com/dataflow/jobsDetail/locations/us-central1/jobs/2019-07-27_11_48_03-1786208797314138578?project=apache-beam-testing.
  temp_location = p.options.view_as(GoogleCloudOptions).temp_location
Found: https://console.cloud.google.com/dataflow/jobsDetail/locations/us-central1/jobs/2019-07-27_11_05_50-18426738540747631653?project=apache-beam-testing.
<https://builds.apache.org/job/beam_PostCommit_Python36/ws/src/sdks/python/apache_beam/runners/dataflow/dataflow_runner.py>:686: BeamDeprecationWarning: BigQuerySink is deprecated since 2.11.0. Use WriteToBigQuery instead.
  kms_key=transform.kms_key))
Found: https://console.cloud.google.com/dataflow/jobsDetail/locations/us-central1/jobs/2019-07-27_11_29_16-6648780811323871871?project=apache-beam-testing.
Found: https://console.cloud.google.com/dataflow/jobsDetail/locations/us-central1/jobs/2019-07-27_11_38_43-4192383918901756365?project=apache-beam-testing.
Found: https://console.cloud.google.com/dataflow/jobsDetail/locations/us-central1/jobs/2019-07-27_11_47_21-1195690086989203095?project=apache-beam-testing.
Found: https://console.cloud.google.com/dataflow/jobsDetail/locations/us-central1/jobs/2019-07-27_11_05_50-16139097035056205567?project=apache-beam-testing.
<https://builds.apache.org/job/beam_PostCommit_Python36/ws/src/sdks/python/apache_beam/io/gcp/bigquery_test.py>:572: BeamDeprecationWarning: options is deprecated since First stable release. References to <pipeline>.options will not be supported
Found: https://console.cloud.google.com/dataflow/jobsDetail/locations/us-central1/jobs/2019-07-27_11_15_11-15641965278861596083?project=apache-beam-testing.
  streaming = self.test_pipeline.options.view_as(StandardOptions).streaming
<https://builds.apache.org/job/beam_PostCommit_Python36/ws/src/sdks/python/apache_beam/io/gcp/bigquery.py>:1150: BeamDeprecationWarning: options is deprecated since First stable release. References to <pipeline>.options will not be supported
  experiments = p.options.view_as(DebugOptions).experiments or []
Found: https://console.cloud.google.com/dataflow/jobsDetail/locations/us-central1/jobs/2019-07-27_11_25_43-2127162200931076169?project=apache-beam-testing.
<https://builds.apache.org/job/beam_PostCommit_Python36/ws/src/sdks/python/apache_beam/io/fileio_test.py>:232: FutureWarning: MatchAll is experimental.
  | 'GetPath' >> beam.Map(lambda metadata: metadata.path))
Found: https://console.cloud.google.com/dataflow/jobsDetail/locations/us-central1/jobs/2019-07-27_11_34_52-10032878282399480331?project=apache-beam-testing.
<https://builds.apache.org/job/beam_PostCommit_Python36/ws/src/sdks/python/apache_beam/io/fileio_test.py>:243: FutureWarning: MatchAll is experimental.
  | 'Checksums' >> beam.Map(compute_hash))
<https://builds.apache.org/job/beam_PostCommit_Python36/ws/src/sdks/python/apache_beam/io/fileio_test.py>:243: FutureWarning: ReadMatches is experimental.
  | 'Checksums' >> beam.Map(compute_hash))
Found: https://console.cloud.google.com/dataflow/jobsDetail/locations/us-central1/jobs/2019-07-27_11_05_49-14799937999604691428?project=apache-beam-testing.
Found: https://console.cloud.google.com/dataflow/jobsDetail/locations/us-central1/jobs/2019-07-27_11_15_50-16437670287836559343?project=apache-beam-testing.
Found: https://console.cloud.google.com/dataflow/jobsDetail/locations/us-central1/jobs/2019-07-27_11_24_12-2438523872727946884?project=apache-beam-testing.
<https://builds.apache.org/job/beam_PostCommit_Python36/ws/src/sdks/python/apache_beam/runners/dataflow/dataflow_runner.py>:686: BeamDeprecationWarning: BigQuerySink is deprecated since 2.11.0. Use WriteToBigQuery instead.
  kms_key=transform.kms_key))
<https://builds.apache.org/job/beam_PostCommit_Python36/ws/src/sdks/python/apache_beam/io/gcp/big_query_query_to_table_pipeline.py>:73: BeamDeprecationWarning: BigQuerySink is deprecated since 2.11.0. Use WriteToBigQuery instead.
  kms_key=kms_key))
Exception in thread Thread-5:
Traceback (most recent call last):
  File "/usr/lib/python3.6/threading.py", line 916, in _bootstrap_inner
    self.run()
  File "/usr/lib/python3.6/threading.py", line 864, in run
Found: https://console.cloud.google.com/dataflow/jobsDetail/locations/us-central1/jobs/2019-07-27_11_33_25-13091133427383529046?project=apache-beam-testing.
Found: https://console.cloud.google.com/dataflow/jobsDetail/locations/us-central1/jobs/2019-07-27_11_42_55-7241434226165239487?project=apache-beam-testing.
    self._target(*self._args, **self._kwargs)
  File "<https://builds.apache.org/job/beam_PostCommit_Python36/ws/src/sdks/python/apache_beam/runners/dataflow/dataflow_runner.py",> line 157, in poll_for_job_completion
    response = runner.dataflow_client.get_job(job_id)
  File "<https://builds.apache.org/job/beam_PostCommit_Python36/ws/src/sdks/python/apache_beam/utils/retry.py",> line 197, in wrapper
    return fun(*args, **kwargs)
  File "<https://builds.apache.org/job/beam_PostCommit_Python36/ws/src/sdks/python/apache_beam/runners/dataflow/internal/apiclient.py",> line 670, in get_job
    response = self._client.projects_locations_jobs.Get(request)
  File "<https://builds.apache.org/job/beam_PostCommit_Python36/ws/src/sdks/python/apache_beam/runners/dataflow/internal/clients/dataflow/dataflow_v1b3_client.py",> line 689, in Get
    config, request, global_params=global_params)
  File "<https://builds.apache.org/job/beam_PostCommit_Python36/ws/src/build/gradleenv/-1734967053/lib/python3.6/site-packages/apitools/base/py/base_api.py",> line 731, in _RunMethod
    return self.ProcessHttpResponse(method_config, http_response, request)
  File "<https://builds.apache.org/job/beam_PostCommit_Python36/ws/src/build/gradleenv/-1734967053/lib/python3.6/site-packages/apitools/base/py/base_api.py",> line 737, in ProcessHttpResponse
    self.__ProcessHttpResponse(method_config, http_response, request))
  File "<https://builds.apache.org/job/beam_PostCommit_Python36/ws/src/build/gradleenv/-1734967053/lib/python3.6/site-packages/apitools/base/py/base_api.py",> line 604, in __ProcessHttpResponse
    http_response, method_config=method_config, request=request)
apitools.base.py.exceptions.HttpNotFoundError: HttpError accessing <https://dataflow.googleapis.com/v1b3/projects/apache-beam-testing/locations/us-central1/jobs/2019-07-27_11_42_55-7241434226165239487?alt=json>: response: <{'vary': 'Origin, X-Origin, Referer', 'content-type': 'application/json; charset=UTF-8', 'date': 'Sat, 27 Jul 2019 18:44:07 GMT', 'server': 'ESF', 'cache-control': 'private', 'x-xss-protection': '0', 'x-frame-options': 'SAMEORIGIN', 'x-content-type-options': 'nosniff', 'transfer-encoding': 'chunked', 'status': '404', 'content-length': '279', '-content-encoding': 'gzip'}>, content <{
  "error": {
    "code": 404,
    "message": "(9f343f52876b6d5e): Information about job 2019-07-27_11_42_55-7241434226165239487 could not be found in our system. Please double check the id is correct. If it is please contact customer support.",
    "status": "NOT_FOUND"
  }
}
>

Found: https://console.cloud.google.com/dataflow/jobsDetail/locations/us-central1/jobs/2019-07-27_11_05_51-9698909100559511152?project=apache-beam-testing.
Found: https://console.cloud.google.com/dataflow/jobsDetail/locations/us-central1/jobs/2019-07-27_11_15_56-3057883125611239051?project=apache-beam-testing.
Found: https://console.cloud.google.com/dataflow/jobsDetail/locations/us-central1/jobs/2019-07-27_11_27_01-15545679253494632918?project=apache-beam-testing.
<https://builds.apache.org/job/beam_PostCommit_Python36/ws/src/sdks/python/apache_beam/io/gcp/bigquery.py>:1150: BeamDeprecationWarning: options is deprecated since First stable release. References to <pipeline>.options will not be supported
  experiments = p.options.view_as(DebugOptions).experiments or []
<https://builds.apache.org/job/beam_PostCommit_Python36/ws/src/sdks/python/apache_beam/io/gcp/bigquery_file_loads.py>:638: BeamDeprecationWarning: options is deprecated since First stable release. References to <pipeline>.options will not be supported
  temp_location = p.options.view_as(GoogleCloudOptions).temp_location
Found: https://console.cloud.google.com/dataflow/jobsDetail/locations/us-central1/jobs/2019-07-27_11_37_20-4967585109709167961?project=apache-beam-testing.
Found: https://console.cloud.google.com/dataflow/jobsDetail/locations/us-central1/jobs/2019-07-27_11_05_51-16206506481825827068?project=apache-beam-testing.
Found: https://console.cloud.google.com/dataflow/jobsDetail/locations/us-central1/jobs/2019-07-27_11_15_13-11650868807703890203?project=apache-beam-testing.
Found: https://console.cloud.google.com/dataflow/jobsDetail/locations/us-central1/jobs/2019-07-27_11_24_40-14354165503831604146?project=apache-beam-testing.
Found: https://console.cloud.google.com/dataflow/jobsDetail/locations/us-central1/jobs/2019-07-27_11_34_41-3325586379100077918?project=apache-beam-testing.
Found: https://console.cloud.google.com/dataflow/jobsDetail/locations/us-central1/jobs/2019-07-27_11_43_47-3419687822175069082?project=apache-beam-testing.

----------------------------------------------------------------------
XML: nosetests-postCommitIT-df-py36.xml
----------------------------------------------------------------------
XML: <https://builds.apache.org/job/beam_PostCommit_Python36/ws/src/sdks/python/nosetests.xml>
----------------------------------------------------------------------
Ran 42 tests in 3128.538s

FAILED (SKIP=5, errors=1, failures=1)

> Task :sdks:python:test-suites:dataflow:py36:postCommitIT FAILED

FAILURE: Build failed with an exception.

* Where:
Build file '<https://builds.apache.org/job/beam_PostCommit_Python36/ws/src/sdks/python/test-suites/dataflow/py36/build.gradle'> line: 49

* What went wrong:
Execution failed for task ':sdks:python:test-suites:dataflow:py36:postCommitIT'.
> Process 'command 'sh'' finished with non-zero exit value 1

* Try:
Run with --stacktrace option to get the stack trace. Run with --info or --debug option to get more log output. Run with --scan to get full insights.

* Get more help at https://help.gradle.org

Deprecated Gradle features were used in this build, making it incompatible with Gradle 6.0.
Use '--warning-mode all' to show the individual deprecation warnings.
See https://docs.gradle.org/5.2.1/userguide/command_line_interface.html#sec:command_line_warnings

BUILD FAILED in 53m 10s
63 actionable tasks: 46 executed, 17 from cache

Publishing build scan...
https://gradle.com/s/hzmy4mpfaxxea

Build step 'Invoke Gradle script' changed build result to FAILURE
Build step 'Invoke Gradle script' marked build as failure

---------------------------------------------------------------------
To unsubscribe, e-mail: builds-unsubscribe@beam.apache.org
For additional commands, e-mail: builds-help@beam.apache.org


Jenkins build is back to normal : beam_PostCommit_Python36 #69

Posted by Apache Jenkins Server <je...@builds.apache.org>.
See <https://builds.apache.org/job/beam_PostCommit_Python36/69/display/redirect>


---------------------------------------------------------------------
To unsubscribe, e-mail: builds-unsubscribe@beam.apache.org
For additional commands, e-mail: builds-help@beam.apache.org