You are viewing a plain text version of this content. The canonical link for it is here.
Posted to dev@tuscany.apache.org by Adriano Crestani <ad...@apache.org> on 2008/04/01 02:18:42 UTC

Re: [VOTE] SDO 1.1 rc3 release

Hi Ant,

The bug is fixed on revision 643224 ; )

Adriano Crestani

On Mon, Mar 31, 2008 at 8:56 AM, ant elder <an...@gmail.com> wrote:

>
>
> On Sun, Mar 30, 2008 at 7:53 AM, Adriano Crestani <
> adrianocrestani@apache.org> wrote:
>
> > Adriano, you've assigned TUSCANY-1659 to yourself so does that mean
> > you're
> > working on a fix (which would be great!)? Anyone have any pointers to
> > help
> > fix it? The jira has been open for over 6 months already so is anyone
> > actually saying its a blocker for this 1.1 release?
> >
> > Yes, I'm trying to fix it : ). And I think it's not a blocker, cause
> > it's not so relevant, since it blocks only in few cases that are
> > env-dependent. So, for me it's ok if we add this fix only on next release.
> >
>
> Does that email from Frank over on the SDO Date Format thread get you
> closer? I'm still happy hold of the repsin if you think you're likely to get
> a fix for this done soon.
>
>    ...ant
>

Re: [VOTE] SDO 1.1 rc3 release

Posted by Adriano Crestani <ad...@apache.org>.
Now the bug seems to be fixed. I think it's ready to be voted : )

Adriano Crestani

On Thu, Apr 3, 2008 at 12:49 AM, ant elder <an...@apache.org> wrote:

> The RC4a artifacts are now available at
> http://people.apache.org/~antelder/tuscany/sdo/1.1-RC4a/<http://people.apache.org/%7Eantelder/tuscany/sdo/1.1-RC4a/>
>
> I'll call a vote on releasing that late today, any reviews in the meantime
> welcomed.
>
>   ...ant
>
> On Thu, Apr 3, 2008 at 8:58 AM, ant elder <an...@apache.org> wrote:
>
> > Ok, i'm doing an RC4a right now to include the TUSCANY-2187 fix, will be
> > up shortly, hopefully you'll have the endurance to try that too :)
> >
> >    ...ant
> >
> >
> > On Thu, Apr 3, 2008 at 8:50 AM, Adriano Crestani <
> > adrianocrestani@apache.org> wrote:
> >
> > > No, I just tested the code you posted at
> > > http://people.apache.org/~antelder/tuscany/sdo/1.1-rc4<http://people.apache.org/%7Eantelder/tuscany/sdo/1.1-rc4>
> <http://people.apache.org/%7Eantelder/tuscany/sdo/1.1-rc4>
> > > <http://people.apache.org/%7Eantelder/tuscany/sdo/1.1-rc4>
> > >
> > > On Wed, Apr 2, 2008 at 11:27 PM, ant elder <an...@gmail.com>
> wrote:
> > >
> > > > Thats good, looks like we might be just about there now. Just to
> > > confirm -
> > > > were you testing with the code which included the TUSCANY-2187 fix
> > > that
> > > > Raymond had just committed?
> > > >
> > > >   ...ant
> > > >
> > > > On Thu, Apr 3, 2008 at 7:55 AM, Adriano Crestani <
> > > > adrianocrestani@apache.org>
> > > > wrote:
> > > >
> > > > > Hi,
> > > > >
> > > > > I found the problem. I was running the mvn command on impl folder
> > > and
> > > > > getting this failure, and not on the root folder. Strangely, I
> tried
> > > to
> > > > > run
> > > > > the mvn on the impl folder on another environment and it worked :
> )
> > > > >
> > > > > It's probably a problem with my environment though
> > > > >
> > > > > So, the RC4 seems OK to me ; )
> > > > >
> > > > > Adriano Crestani
> > > > >
> > > > > On Wed, Apr 2, 2008 at 9:16 PM, Adriano Crestani <
> > > > > adrianocrestani@apache.org>
> > > > > wrote:
> > > > >
> > > > > > mvn clean install didn't work either : (
> > > > > >
> > > > > > Adriano Crestani
> > > > > >
> > > > > >
> > > > > > On Wed, Apr 2, 2008 at 9:03 PM, Raymond Feng <
> enjoyjava@gmail.com>
> > > > > wrote:
> > > > > >
> > > > > > > I just tried the 1.1-incubating branch with both IBM and SUN
> JDK
> > > > > 1.5.x.
> > > > > > > The build was successful. Did you run with "mvn clean
> install"?
> > > > > > >
> > > > > > > IIRC, when I was playing around different versions of surefire
> > > > plugin
> > > > > > > this afternoon, I hit the same problem once in the OSGi test
> > > case.
> > > > It
> > > > > seems
> > > > > > > to be a bit random. Anyway, I don't think it's a blocker.
> > > > > > >
> > > > > > > Thanks,
> > > > > > > Raymond
> > > > > > > --------------------------------------------------
> > > > > > > From: "Adriano Crestani" <ad...@apache.org>
> > > > > > > Sent: Wednesday, April 02, 2008 9:28 PM
> > > > > > > To: <tu...@ws.apache.org>
> > > > > > > Cc: <an...@gmail.com>
> > > > > > > Subject: Re: [VOTE] SDO 1.1 rc3 release
> > > > > > >
> > > > > > >  Hi,
> > > > > > > >
> > > > > > > > I'm getting a test failure (the maven output below)* : ( *.
> Am
> > > I
> > > > > doing
> > > > > > > > something wrong?
> > > > > > > >
> > > > > > > > Regards,
> > > > > > > > Adriano Crestani
> > > > > > > >
> > > > > > > > -------------------------------------------------------
> > > > > > > > T E S T S
> > > > > > > > -------------------------------------------------------
> > > > > > > > Running
> org.apache.tuscany.sdo.test.DataObjectGetListTestCase
> > > > > > > > Tests run: 2, Failures: 0, Errors: 0, Skipped: 0, Time
> > > elapsed:
> > > > > 0.114
> > > > > > > > sec
> > > > > > > > Running
> > > > org.apache.tuscany.sdo.test.NeverStaleChangeSummaryTestCase
> > > > > > > > Tests run: 1, Failures: 0, Errors: 0, Skipped: 0, Time
> > > elapsed:
> > > > > 0.037
> > > > > > > > sec
> > > > > > > > Running org.apache.tuscany.sdo.test.XPathTestCase
> > > > > > > > Tests run: 2, Failures: 0, Errors: 0, Skipped: 0, Time
> > > elapsed:
> > > > 0.1
> > > > > > > > sec
> > > > > > > > Running
> > > org.apache.tuscany.sdo.test.DynamicTypesComparisonTestCase
> > > > > > > > Tests run: 1, Failures: 0, Errors: 0, Skipped: 0, Time
> > > elapsed:
> > > > > 0.023
> > > > > > > > sec
> > > > > > > > Running org.apache.tuscany.sdo.test.ImplSpecificTestCase
> > > > > > > > Tests run: 1, Failures: 0, Errors: 0, Skipped: 0, Time
> > > elapsed:
> > > > > 0.003
> > > > > > > > sec
> > > > > > > > Running org.apache.tuscany.sdo.test.HelperContextTestCase
> > > > > > > > Tests run: 2, Failures: 0, Errors: 0, Skipped: 0, Time
> > > elapsed:
> > > > > 0.004
> > > > > > > > sec
> > > > > > > > Running
> org.apache.tuscany.sdo.test.SubstitutionValuesTestCase
> > > > > > > > Tests run: 1, Failures: 0, Errors: 0, Skipped: 0, Time
> > > elapsed:
> > > > > 0.042
> > > > > > > > sec
> > > > > > > > Running org.apache.tuscany.sdo.test.osgi.OSGiTestCase
> > > > > > > > Tests run: 1, Failures: 0, Errors: 1, Skipped: 0, Time
> > > elapsed:
> > > > > 2.681
> > > > > > > > sec
> > > > > > > > <<< FA
> > > > > > > > ILURE!
> > > > > > > > Running org.apache.tuscany.sdo.test.XMLLoadOptionsTestCase
> > > > > > > > Tests run: 5, Failures: 0, Errors: 0, Skipped: 0, Time
> > > elapsed:
> > > > > 0.136
> > > > > > > > sec
> > > > > > > > Running org.apache.tuscany.sdo.test.XMLSaveOptionsTestCase
> > > > > > > > Tests run: 2, Failures: 0, Errors: 0, Skipped: 0, Time
> > > elapsed:
> > > > > 0.154
> > > > > > > > sec
> > > > > > > > Running
> > > > org.apache.tuscany.sdo.test.JavaSerializeDeserializeTestCase
> > > > > > > > Tests run: 3, Failures: 0, Errors: 0, Skipped: 0, Time
> > > elapsed:
> > > > > 0.252
> > > > > > > > sec
> > > > > > > > Running org.apache.tuscany.sdo.test.SequenceTestCase
> > > > > > > > Tests run: 1, Failures: 0, Errors: 0, Skipped: 0, Time
> > > elapsed:
> > > > > 0.013
> > > > > > > > sec
> > > > > > > > Running org.apache.tuscany.sdo.test.ChangeSummaryTestCase
> > > > > > > > Tests run: 1, Failures: 0, Errors: 0, Skipped: 0, Time
> > > elapsed:
> > > > > 0.024
> > > > > > > > sec
> > > > > > > > Running org.apache.tuscany.sdo.test.SchemaLocationTestCase
> > > > > > > > Tests run: 1, Failures: 0, Errors: 0, Skipped: 0, Time
> > > elapsed:
> > > > > 0.019
> > > > > > > > sec
> > > > > > > > Running org.apache.tuscany.sdo.test.FormTestCase
> > > > > > > > Tests run: 5, Failures: 0, Errors: 0, Skipped: 0, Time
> > > elapsed:
> > > > > 0.034
> > > > > > > > sec
> > > > > > > > Running
> > > > > org.apache.tuscany.sdo.test.ChangeSummaryOnDataObjectTestCase
> > > > > > > > Tests run: 4, Failures: 0, Errors: 0, Skipped: 0, Time
> > > elapsed:
> > > > > 0.315
> > > > > > > > sec
> > > > > > > > Running org.apache.tuscany.sdo.test.SerializeTypesTestCase
> > > > > > > > Tests run: 3, Failures: 0, Errors: 0, Skipped: 0, Time
> > > elapsed:
> > > > 0.03
> > > > > > > > sec
> > > > > > > > Running org.apache.tuscany.sdo.test.SimpleCopyTestCase
> > > > > > > > Tests run: 1, Failures: 0, Errors: 0, Skipped: 0, Time
> > > elapsed:
> > > > > 0.018
> > > > > > > > sec
> > > > > > > > Running org.apache.tuscany.sdo.test.osgi.ClassLoaderTestCase
> > > > > > > > Tests run: 1, Failures: 0, Errors: 0, Skipped: 0, Time
> > > elapsed:
> > > > > 4.349
> > > > > > > > sec
> > > > > > > > Running
> > > > org.apache.tuscany.sdo.test.DeserializationNoSchemaTestCase
> > > > > > > > Tests run: 2, Failures: 0, Errors: 0, Skipped: 0, Time
> > > elapsed:
> > > > 1.19
> > > > > > > > sec
> > > > > > > > Running
> > > > > org.apache.tuscany.sdo.test.MetadataInstancePropertiesTestCase
> > > > > > > > Tests run: 4, Failures: 0, Errors: 0, Skipped: 0, Time
> > > elapsed:
> > > > > 0.063
> > > > > > > > sec
> > > > > > > > Running org.apache.tuscany.sdo.test.DefineTypeTestCase
> > > > > > > > Tests run: 8, Failures: 0, Errors: 0, Skipped: 0, Time
> > > elapsed:
> > > > > 0.062
> > > > > > > > sec
> > > > > > > > Running org.apache.tuscany.sdo.test.DataTypeBaseTypeTestCase
> > > > > > > > Tests run: 3, Failures: 0, Errors: 0, Skipped: 0, Time
> > > elapsed:
> > > > > 0.013
> > > > > > > > sec
> > > > > > > > Running org.apache.tuscany.sdo.test.XMLStreamHelperTestCase
> > > > > > > > Tests run: 7, Failures: 0, Errors: 0, Skipped: 0, Time
> > > elapsed:
> > > > > 0.291
> > > > > > > > sec
> > > > > > > > Running org.apache.tuscany.sdo.test.MixedTypeTestCase
> > > > > > > > Tests run: 1, Failures: 0, Errors: 0, Skipped: 0, Time
> > > elapsed:
> > > > > 0.011
> > > > > > > > sec
> > > > > > > > Running org.apache.tuscany.sdo.test.TypeConversionTestCase
> > > > > > > > Tests run: 27, Failures: 0, Errors: 0, Skipped: 0, Time
> > > elapsed:
> > > > > 0.176
> > > > > > > > sec
> > > > > > > > Running
> > > org.apache.tuscany.sdo.test.XMLUnknownPropertiesTestCase
> > > > > > > > Tests run: 2, Failures: 0, Errors: 0, Skipped: 0, Time
> > > elapsed:
> > > > > 0.023
> > > > > > > > sec
> > > > > > > > Running org.apache.tuscany.sdo.test.XSDQNameTestCase
> > > > > > > >
> > > > > > >
> > > > > > >
> > > > > > >
> > > >
> ---------------------------------------------------------------------
> > > > > > > To unsubscribe, e-mail: tuscany-dev-unsubscribe@ws.apache.org
> > > > > > > For additional commands, e-mail:
> tuscany-dev-help@ws.apache.org
> > > > > > >
> > > > > > >
> > > > > >
> > > > >
> > > >
> > >
> >
> >
>

Re: [VOTE] SDO 1.1 rc3 release

Posted by ant elder <an...@apache.org>.
The RC4a artifacts are now available at
http://people.apache.org/~antelder/tuscany/sdo/1.1-RC4a/

I'll call a vote on releasing that late today, any reviews in the meantime
welcomed.

   ...ant

On Thu, Apr 3, 2008 at 8:58 AM, ant elder <an...@apache.org> wrote:

> Ok, i'm doing an RC4a right now to include the TUSCANY-2187 fix, will be
> up shortly, hopefully you'll have the endurance to try that too :)
>
>    ...ant
>
>
> On Thu, Apr 3, 2008 at 8:50 AM, Adriano Crestani <
> adrianocrestani@apache.org> wrote:
>
> > No, I just tested the code you posted at
> > http://people.apache.org/~antelder/tuscany/sdo/1.1-rc4<http://people.apache.org/%7Eantelder/tuscany/sdo/1.1-rc4>
> > <http://people.apache.org/%7Eantelder/tuscany/sdo/1.1-rc4>
> >
> > On Wed, Apr 2, 2008 at 11:27 PM, ant elder <an...@gmail.com> wrote:
> >
> > > Thats good, looks like we might be just about there now. Just to
> > confirm -
> > > were you testing with the code which included the TUSCANY-2187 fix
> > that
> > > Raymond had just committed?
> > >
> > >   ...ant
> > >
> > > On Thu, Apr 3, 2008 at 7:55 AM, Adriano Crestani <
> > > adrianocrestani@apache.org>
> > > wrote:
> > >
> > > > Hi,
> > > >
> > > > I found the problem. I was running the mvn command on impl folder
> > and
> > > > getting this failure, and not on the root folder. Strangely, I tried
> > to
> > > > run
> > > > the mvn on the impl folder on another environment and it worked : )
> > > >
> > > > It's probably a problem with my environment though
> > > >
> > > > So, the RC4 seems OK to me ; )
> > > >
> > > > Adriano Crestani
> > > >
> > > > On Wed, Apr 2, 2008 at 9:16 PM, Adriano Crestani <
> > > > adrianocrestani@apache.org>
> > > > wrote:
> > > >
> > > > > mvn clean install didn't work either : (
> > > > >
> > > > > Adriano Crestani
> > > > >
> > > > >
> > > > > On Wed, Apr 2, 2008 at 9:03 PM, Raymond Feng <en...@gmail.com>
> > > > wrote:
> > > > >
> > > > > > I just tried the 1.1-incubating branch with both IBM and SUN JDK
> > > > 1.5.x.
> > > > > > The build was successful. Did you run with "mvn clean install"?
> > > > > >
> > > > > > IIRC, when I was playing around different versions of surefire
> > > plugin
> > > > > > this afternoon, I hit the same problem once in the OSGi test
> > case.
> > > It
> > > > seems
> > > > > > to be a bit random. Anyway, I don't think it's a blocker.
> > > > > >
> > > > > > Thanks,
> > > > > > Raymond
> > > > > > --------------------------------------------------
> > > > > > From: "Adriano Crestani" <ad...@apache.org>
> > > > > > Sent: Wednesday, April 02, 2008 9:28 PM
> > > > > > To: <tu...@ws.apache.org>
> > > > > > Cc: <an...@gmail.com>
> > > > > > Subject: Re: [VOTE] SDO 1.1 rc3 release
> > > > > >
> > > > > >  Hi,
> > > > > > >
> > > > > > > I'm getting a test failure (the maven output below)* : ( *. Am
> > I
> > > > doing
> > > > > > > something wrong?
> > > > > > >
> > > > > > > Regards,
> > > > > > > Adriano Crestani
> > > > > > >
> > > > > > > -------------------------------------------------------
> > > > > > > T E S T S
> > > > > > > -------------------------------------------------------
> > > > > > > Running org.apache.tuscany.sdo.test.DataObjectGetListTestCase
> > > > > > > Tests run: 2, Failures: 0, Errors: 0, Skipped: 0, Time
> > elapsed:
> > > > 0.114
> > > > > > > sec
> > > > > > > Running
> > > org.apache.tuscany.sdo.test.NeverStaleChangeSummaryTestCase
> > > > > > > Tests run: 1, Failures: 0, Errors: 0, Skipped: 0, Time
> > elapsed:
> > > > 0.037
> > > > > > > sec
> > > > > > > Running org.apache.tuscany.sdo.test.XPathTestCase
> > > > > > > Tests run: 2, Failures: 0, Errors: 0, Skipped: 0, Time
> > elapsed:
> > > 0.1
> > > > > > > sec
> > > > > > > Running
> > org.apache.tuscany.sdo.test.DynamicTypesComparisonTestCase
> > > > > > > Tests run: 1, Failures: 0, Errors: 0, Skipped: 0, Time
> > elapsed:
> > > > 0.023
> > > > > > > sec
> > > > > > > Running org.apache.tuscany.sdo.test.ImplSpecificTestCase
> > > > > > > Tests run: 1, Failures: 0, Errors: 0, Skipped: 0, Time
> > elapsed:
> > > > 0.003
> > > > > > > sec
> > > > > > > Running org.apache.tuscany.sdo.test.HelperContextTestCase
> > > > > > > Tests run: 2, Failures: 0, Errors: 0, Skipped: 0, Time
> > elapsed:
> > > > 0.004
> > > > > > > sec
> > > > > > > Running org.apache.tuscany.sdo.test.SubstitutionValuesTestCase
> > > > > > > Tests run: 1, Failures: 0, Errors: 0, Skipped: 0, Time
> > elapsed:
> > > > 0.042
> > > > > > > sec
> > > > > > > Running org.apache.tuscany.sdo.test.osgi.OSGiTestCase
> > > > > > > Tests run: 1, Failures: 0, Errors: 1, Skipped: 0, Time
> > elapsed:
> > > > 2.681
> > > > > > > sec
> > > > > > > <<< FA
> > > > > > > ILURE!
> > > > > > > Running org.apache.tuscany.sdo.test.XMLLoadOptionsTestCase
> > > > > > > Tests run: 5, Failures: 0, Errors: 0, Skipped: 0, Time
> > elapsed:
> > > > 0.136
> > > > > > > sec
> > > > > > > Running org.apache.tuscany.sdo.test.XMLSaveOptionsTestCase
> > > > > > > Tests run: 2, Failures: 0, Errors: 0, Skipped: 0, Time
> > elapsed:
> > > > 0.154
> > > > > > > sec
> > > > > > > Running
> > > org.apache.tuscany.sdo.test.JavaSerializeDeserializeTestCase
> > > > > > > Tests run: 3, Failures: 0, Errors: 0, Skipped: 0, Time
> > elapsed:
> > > > 0.252
> > > > > > > sec
> > > > > > > Running org.apache.tuscany.sdo.test.SequenceTestCase
> > > > > > > Tests run: 1, Failures: 0, Errors: 0, Skipped: 0, Time
> > elapsed:
> > > > 0.013
> > > > > > > sec
> > > > > > > Running org.apache.tuscany.sdo.test.ChangeSummaryTestCase
> > > > > > > Tests run: 1, Failures: 0, Errors: 0, Skipped: 0, Time
> > elapsed:
> > > > 0.024
> > > > > > > sec
> > > > > > > Running org.apache.tuscany.sdo.test.SchemaLocationTestCase
> > > > > > > Tests run: 1, Failures: 0, Errors: 0, Skipped: 0, Time
> > elapsed:
> > > > 0.019
> > > > > > > sec
> > > > > > > Running org.apache.tuscany.sdo.test.FormTestCase
> > > > > > > Tests run: 5, Failures: 0, Errors: 0, Skipped: 0, Time
> > elapsed:
> > > > 0.034
> > > > > > > sec
> > > > > > > Running
> > > > org.apache.tuscany.sdo.test.ChangeSummaryOnDataObjectTestCase
> > > > > > > Tests run: 4, Failures: 0, Errors: 0, Skipped: 0, Time
> > elapsed:
> > > > 0.315
> > > > > > > sec
> > > > > > > Running org.apache.tuscany.sdo.test.SerializeTypesTestCase
> > > > > > > Tests run: 3, Failures: 0, Errors: 0, Skipped: 0, Time
> > elapsed:
> > > 0.03
> > > > > > > sec
> > > > > > > Running org.apache.tuscany.sdo.test.SimpleCopyTestCase
> > > > > > > Tests run: 1, Failures: 0, Errors: 0, Skipped: 0, Time
> > elapsed:
> > > > 0.018
> > > > > > > sec
> > > > > > > Running org.apache.tuscany.sdo.test.osgi.ClassLoaderTestCase
> > > > > > > Tests run: 1, Failures: 0, Errors: 0, Skipped: 0, Time
> > elapsed:
> > > > 4.349
> > > > > > > sec
> > > > > > > Running
> > > org.apache.tuscany.sdo.test.DeserializationNoSchemaTestCase
> > > > > > > Tests run: 2, Failures: 0, Errors: 0, Skipped: 0, Time
> > elapsed:
> > > 1.19
> > > > > > > sec
> > > > > > > Running
> > > > org.apache.tuscany.sdo.test.MetadataInstancePropertiesTestCase
> > > > > > > Tests run: 4, Failures: 0, Errors: 0, Skipped: 0, Time
> > elapsed:
> > > > 0.063
> > > > > > > sec
> > > > > > > Running org.apache.tuscany.sdo.test.DefineTypeTestCase
> > > > > > > Tests run: 8, Failures: 0, Errors: 0, Skipped: 0, Time
> > elapsed:
> > > > 0.062
> > > > > > > sec
> > > > > > > Running org.apache.tuscany.sdo.test.DataTypeBaseTypeTestCase
> > > > > > > Tests run: 3, Failures: 0, Errors: 0, Skipped: 0, Time
> > elapsed:
> > > > 0.013
> > > > > > > sec
> > > > > > > Running org.apache.tuscany.sdo.test.XMLStreamHelperTestCase
> > > > > > > Tests run: 7, Failures: 0, Errors: 0, Skipped: 0, Time
> > elapsed:
> > > > 0.291
> > > > > > > sec
> > > > > > > Running org.apache.tuscany.sdo.test.MixedTypeTestCase
> > > > > > > Tests run: 1, Failures: 0, Errors: 0, Skipped: 0, Time
> > elapsed:
> > > > 0.011
> > > > > > > sec
> > > > > > > Running org.apache.tuscany.sdo.test.TypeConversionTestCase
> > > > > > > Tests run: 27, Failures: 0, Errors: 0, Skipped: 0, Time
> > elapsed:
> > > > 0.176
> > > > > > > sec
> > > > > > > Running
> > org.apache.tuscany.sdo.test.XMLUnknownPropertiesTestCase
> > > > > > > Tests run: 2, Failures: 0, Errors: 0, Skipped: 0, Time
> > elapsed:
> > > > 0.023
> > > > > > > sec
> > > > > > > Running org.apache.tuscany.sdo.test.XSDQNameTestCase
> > > > > > >
> > > > > >
> > > > > >
> > > > > >
> > > ---------------------------------------------------------------------
> > > > > > To unsubscribe, e-mail: tuscany-dev-unsubscribe@ws.apache.org
> > > > > > For additional commands, e-mail: tuscany-dev-help@ws.apache.org
> > > > > >
> > > > > >
> > > > >
> > > >
> > >
> >
>
>

Re: [VOTE] SDO 1.1 rc3 release

Posted by ant elder <an...@apache.org>.
Ok, i'm doing an RC4a right now to include the TUSCANY-2187 fix, will be up
shortly, hopefully you'll have the endurance to try that too :)

   ...ant

On Thu, Apr 3, 2008 at 8:50 AM, Adriano Crestani <ad...@apache.org>
wrote:

> No, I just tested the code you posted at
> http://people.apache.org/~antelder/tuscany/sdo/1.1-rc4<http://people.apache.org/%7Eantelder/tuscany/sdo/1.1-rc4>
> <http://people.apache.org/%7Eantelder/tuscany/sdo/1.1-rc4>
>
> On Wed, Apr 2, 2008 at 11:27 PM, ant elder <an...@gmail.com> wrote:
>
> > Thats good, looks like we might be just about there now. Just to confirm
> -
> > were you testing with the code which included the TUSCANY-2187 fix that
> > Raymond had just committed?
> >
> >   ...ant
> >
> > On Thu, Apr 3, 2008 at 7:55 AM, Adriano Crestani <
> > adrianocrestani@apache.org>
> > wrote:
> >
> > > Hi,
> > >
> > > I found the problem. I was running the mvn command on impl folder and
> > > getting this failure, and not on the root folder. Strangely, I tried
> to
> > > run
> > > the mvn on the impl folder on another environment and it worked : )
> > >
> > > It's probably a problem with my environment though
> > >
> > > So, the RC4 seems OK to me ; )
> > >
> > > Adriano Crestani
> > >
> > > On Wed, Apr 2, 2008 at 9:16 PM, Adriano Crestani <
> > > adrianocrestani@apache.org>
> > > wrote:
> > >
> > > > mvn clean install didn't work either : (
> > > >
> > > > Adriano Crestani
> > > >
> > > >
> > > > On Wed, Apr 2, 2008 at 9:03 PM, Raymond Feng <en...@gmail.com>
> > > wrote:
> > > >
> > > > > I just tried the 1.1-incubating branch with both IBM and SUN JDK
> > > 1.5.x.
> > > > > The build was successful. Did you run with "mvn clean install"?
> > > > >
> > > > > IIRC, when I was playing around different versions of surefire
> > plugin
> > > > > this afternoon, I hit the same problem once in the OSGi test case.
> > It
> > > seems
> > > > > to be a bit random. Anyway, I don't think it's a blocker.
> > > > >
> > > > > Thanks,
> > > > > Raymond
> > > > > --------------------------------------------------
> > > > > From: "Adriano Crestani" <ad...@apache.org>
> > > > > Sent: Wednesday, April 02, 2008 9:28 PM
> > > > > To: <tu...@ws.apache.org>
> > > > > Cc: <an...@gmail.com>
> > > > > Subject: Re: [VOTE] SDO 1.1 rc3 release
> > > > >
> > > > >  Hi,
> > > > > >
> > > > > > I'm getting a test failure (the maven output below)* : ( *. Am I
> > > doing
> > > > > > something wrong?
> > > > > >
> > > > > > Regards,
> > > > > > Adriano Crestani
> > > > > >
> > > > > > -------------------------------------------------------
> > > > > > T E S T S
> > > > > > -------------------------------------------------------
> > > > > > Running org.apache.tuscany.sdo.test.DataObjectGetListTestCase
> > > > > > Tests run: 2, Failures: 0, Errors: 0, Skipped: 0, Time elapsed:
> > > 0.114
> > > > > > sec
> > > > > > Running
> > org.apache.tuscany.sdo.test.NeverStaleChangeSummaryTestCase
> > > > > > Tests run: 1, Failures: 0, Errors: 0, Skipped: 0, Time elapsed:
> > > 0.037
> > > > > > sec
> > > > > > Running org.apache.tuscany.sdo.test.XPathTestCase
> > > > > > Tests run: 2, Failures: 0, Errors: 0, Skipped: 0, Time elapsed:
> > 0.1
> > > > > > sec
> > > > > > Running
> org.apache.tuscany.sdo.test.DynamicTypesComparisonTestCase
> > > > > > Tests run: 1, Failures: 0, Errors: 0, Skipped: 0, Time elapsed:
> > > 0.023
> > > > > > sec
> > > > > > Running org.apache.tuscany.sdo.test.ImplSpecificTestCase
> > > > > > Tests run: 1, Failures: 0, Errors: 0, Skipped: 0, Time elapsed:
> > > 0.003
> > > > > > sec
> > > > > > Running org.apache.tuscany.sdo.test.HelperContextTestCase
> > > > > > Tests run: 2, Failures: 0, Errors: 0, Skipped: 0, Time elapsed:
> > > 0.004
> > > > > > sec
> > > > > > Running org.apache.tuscany.sdo.test.SubstitutionValuesTestCase
> > > > > > Tests run: 1, Failures: 0, Errors: 0, Skipped: 0, Time elapsed:
> > > 0.042
> > > > > > sec
> > > > > > Running org.apache.tuscany.sdo.test.osgi.OSGiTestCase
> > > > > > Tests run: 1, Failures: 0, Errors: 1, Skipped: 0, Time elapsed:
> > > 2.681
> > > > > > sec
> > > > > > <<< FA
> > > > > > ILURE!
> > > > > > Running org.apache.tuscany.sdo.test.XMLLoadOptionsTestCase
> > > > > > Tests run: 5, Failures: 0, Errors: 0, Skipped: 0, Time elapsed:
> > > 0.136
> > > > > > sec
> > > > > > Running org.apache.tuscany.sdo.test.XMLSaveOptionsTestCase
> > > > > > Tests run: 2, Failures: 0, Errors: 0, Skipped: 0, Time elapsed:
> > > 0.154
> > > > > > sec
> > > > > > Running
> > org.apache.tuscany.sdo.test.JavaSerializeDeserializeTestCase
> > > > > > Tests run: 3, Failures: 0, Errors: 0, Skipped: 0, Time elapsed:
> > > 0.252
> > > > > > sec
> > > > > > Running org.apache.tuscany.sdo.test.SequenceTestCase
> > > > > > Tests run: 1, Failures: 0, Errors: 0, Skipped: 0, Time elapsed:
> > > 0.013
> > > > > > sec
> > > > > > Running org.apache.tuscany.sdo.test.ChangeSummaryTestCase
> > > > > > Tests run: 1, Failures: 0, Errors: 0, Skipped: 0, Time elapsed:
> > > 0.024
> > > > > > sec
> > > > > > Running org.apache.tuscany.sdo.test.SchemaLocationTestCase
> > > > > > Tests run: 1, Failures: 0, Errors: 0, Skipped: 0, Time elapsed:
> > > 0.019
> > > > > > sec
> > > > > > Running org.apache.tuscany.sdo.test.FormTestCase
> > > > > > Tests run: 5, Failures: 0, Errors: 0, Skipped: 0, Time elapsed:
> > > 0.034
> > > > > > sec
> > > > > > Running
> > > org.apache.tuscany.sdo.test.ChangeSummaryOnDataObjectTestCase
> > > > > > Tests run: 4, Failures: 0, Errors: 0, Skipped: 0, Time elapsed:
> > > 0.315
> > > > > > sec
> > > > > > Running org.apache.tuscany.sdo.test.SerializeTypesTestCase
> > > > > > Tests run: 3, Failures: 0, Errors: 0, Skipped: 0, Time elapsed:
> > 0.03
> > > > > > sec
> > > > > > Running org.apache.tuscany.sdo.test.SimpleCopyTestCase
> > > > > > Tests run: 1, Failures: 0, Errors: 0, Skipped: 0, Time elapsed:
> > > 0.018
> > > > > > sec
> > > > > > Running org.apache.tuscany.sdo.test.osgi.ClassLoaderTestCase
> > > > > > Tests run: 1, Failures: 0, Errors: 0, Skipped: 0, Time elapsed:
> > > 4.349
> > > > > > sec
> > > > > > Running
> > org.apache.tuscany.sdo.test.DeserializationNoSchemaTestCase
> > > > > > Tests run: 2, Failures: 0, Errors: 0, Skipped: 0, Time elapsed:
> > 1.19
> > > > > > sec
> > > > > > Running
> > > org.apache.tuscany.sdo.test.MetadataInstancePropertiesTestCase
> > > > > > Tests run: 4, Failures: 0, Errors: 0, Skipped: 0, Time elapsed:
> > > 0.063
> > > > > > sec
> > > > > > Running org.apache.tuscany.sdo.test.DefineTypeTestCase
> > > > > > Tests run: 8, Failures: 0, Errors: 0, Skipped: 0, Time elapsed:
> > > 0.062
> > > > > > sec
> > > > > > Running org.apache.tuscany.sdo.test.DataTypeBaseTypeTestCase
> > > > > > Tests run: 3, Failures: 0, Errors: 0, Skipped: 0, Time elapsed:
> > > 0.013
> > > > > > sec
> > > > > > Running org.apache.tuscany.sdo.test.XMLStreamHelperTestCase
> > > > > > Tests run: 7, Failures: 0, Errors: 0, Skipped: 0, Time elapsed:
> > > 0.291
> > > > > > sec
> > > > > > Running org.apache.tuscany.sdo.test.MixedTypeTestCase
> > > > > > Tests run: 1, Failures: 0, Errors: 0, Skipped: 0, Time elapsed:
> > > 0.011
> > > > > > sec
> > > > > > Running org.apache.tuscany.sdo.test.TypeConversionTestCase
> > > > > > Tests run: 27, Failures: 0, Errors: 0, Skipped: 0, Time elapsed:
> > > 0.176
> > > > > > sec
> > > > > > Running org.apache.tuscany.sdo.test.XMLUnknownPropertiesTestCase
> > > > > > Tests run: 2, Failures: 0, Errors: 0, Skipped: 0, Time elapsed:
> > > 0.023
> > > > > > sec
> > > > > > Running org.apache.tuscany.sdo.test.XSDQNameTestCase
> > > > > >
> > > > >
> > > > >
> > > > >
> > ---------------------------------------------------------------------
> > > > > To unsubscribe, e-mail: tuscany-dev-unsubscribe@ws.apache.org
> > > > > For additional commands, e-mail: tuscany-dev-help@ws.apache.org
> > > > >
> > > > >
> > > >
> > >
> >
>

Re: [VOTE] SDO 1.1 rc3 release

Posted by Adriano Crestani <ad...@apache.org>.
No, I just tested the code you posted at
http://people.apache.org/~antelder/tuscany/sdo/1.1-rc4<http://people.apache.org/%7Eantelder/tuscany/sdo/1.1-rc4>

On Wed, Apr 2, 2008 at 11:27 PM, ant elder <an...@gmail.com> wrote:

> Thats good, looks like we might be just about there now. Just to confirm -
> were you testing with the code which included the TUSCANY-2187 fix that
> Raymond had just committed?
>
>   ...ant
>
> On Thu, Apr 3, 2008 at 7:55 AM, Adriano Crestani <
> adrianocrestani@apache.org>
> wrote:
>
> > Hi,
> >
> > I found the problem. I was running the mvn command on impl folder and
> > getting this failure, and not on the root folder. Strangely, I tried to
> > run
> > the mvn on the impl folder on another environment and it worked : )
> >
> > It's probably a problem with my environment though
> >
> > So, the RC4 seems OK to me ; )
> >
> > Adriano Crestani
> >
> > On Wed, Apr 2, 2008 at 9:16 PM, Adriano Crestani <
> > adrianocrestani@apache.org>
> > wrote:
> >
> > > mvn clean install didn't work either : (
> > >
> > > Adriano Crestani
> > >
> > >
> > > On Wed, Apr 2, 2008 at 9:03 PM, Raymond Feng <en...@gmail.com>
> > wrote:
> > >
> > > > I just tried the 1.1-incubating branch with both IBM and SUN JDK
> > 1.5.x.
> > > > The build was successful. Did you run with "mvn clean install"?
> > > >
> > > > IIRC, when I was playing around different versions of surefire
> plugin
> > > > this afternoon, I hit the same problem once in the OSGi test case.
> It
> > seems
> > > > to be a bit random. Anyway, I don't think it's a blocker.
> > > >
> > > > Thanks,
> > > > Raymond
> > > > --------------------------------------------------
> > > > From: "Adriano Crestani" <ad...@apache.org>
> > > > Sent: Wednesday, April 02, 2008 9:28 PM
> > > > To: <tu...@ws.apache.org>
> > > > Cc: <an...@gmail.com>
> > > > Subject: Re: [VOTE] SDO 1.1 rc3 release
> > > >
> > > >  Hi,
> > > > >
> > > > > I'm getting a test failure (the maven output below)* : ( *. Am I
> > doing
> > > > > something wrong?
> > > > >
> > > > > Regards,
> > > > > Adriano Crestani
> > > > >
> > > > > -------------------------------------------------------
> > > > > T E S T S
> > > > > -------------------------------------------------------
> > > > > Running org.apache.tuscany.sdo.test.DataObjectGetListTestCase
> > > > > Tests run: 2, Failures: 0, Errors: 0, Skipped: 0, Time elapsed:
> > 0.114
> > > > > sec
> > > > > Running
> org.apache.tuscany.sdo.test.NeverStaleChangeSummaryTestCase
> > > > > Tests run: 1, Failures: 0, Errors: 0, Skipped: 0, Time elapsed:
> > 0.037
> > > > > sec
> > > > > Running org.apache.tuscany.sdo.test.XPathTestCase
> > > > > Tests run: 2, Failures: 0, Errors: 0, Skipped: 0, Time elapsed:
> 0.1
> > > > > sec
> > > > > Running org.apache.tuscany.sdo.test.DynamicTypesComparisonTestCase
> > > > > Tests run: 1, Failures: 0, Errors: 0, Skipped: 0, Time elapsed:
> > 0.023
> > > > > sec
> > > > > Running org.apache.tuscany.sdo.test.ImplSpecificTestCase
> > > > > Tests run: 1, Failures: 0, Errors: 0, Skipped: 0, Time elapsed:
> > 0.003
> > > > > sec
> > > > > Running org.apache.tuscany.sdo.test.HelperContextTestCase
> > > > > Tests run: 2, Failures: 0, Errors: 0, Skipped: 0, Time elapsed:
> > 0.004
> > > > > sec
> > > > > Running org.apache.tuscany.sdo.test.SubstitutionValuesTestCase
> > > > > Tests run: 1, Failures: 0, Errors: 0, Skipped: 0, Time elapsed:
> > 0.042
> > > > > sec
> > > > > Running org.apache.tuscany.sdo.test.osgi.OSGiTestCase
> > > > > Tests run: 1, Failures: 0, Errors: 1, Skipped: 0, Time elapsed:
> > 2.681
> > > > > sec
> > > > > <<< FA
> > > > > ILURE!
> > > > > Running org.apache.tuscany.sdo.test.XMLLoadOptionsTestCase
> > > > > Tests run: 5, Failures: 0, Errors: 0, Skipped: 0, Time elapsed:
> > 0.136
> > > > > sec
> > > > > Running org.apache.tuscany.sdo.test.XMLSaveOptionsTestCase
> > > > > Tests run: 2, Failures: 0, Errors: 0, Skipped: 0, Time elapsed:
> > 0.154
> > > > > sec
> > > > > Running
> org.apache.tuscany.sdo.test.JavaSerializeDeserializeTestCase
> > > > > Tests run: 3, Failures: 0, Errors: 0, Skipped: 0, Time elapsed:
> > 0.252
> > > > > sec
> > > > > Running org.apache.tuscany.sdo.test.SequenceTestCase
> > > > > Tests run: 1, Failures: 0, Errors: 0, Skipped: 0, Time elapsed:
> > 0.013
> > > > > sec
> > > > > Running org.apache.tuscany.sdo.test.ChangeSummaryTestCase
> > > > > Tests run: 1, Failures: 0, Errors: 0, Skipped: 0, Time elapsed:
> > 0.024
> > > > > sec
> > > > > Running org.apache.tuscany.sdo.test.SchemaLocationTestCase
> > > > > Tests run: 1, Failures: 0, Errors: 0, Skipped: 0, Time elapsed:
> > 0.019
> > > > > sec
> > > > > Running org.apache.tuscany.sdo.test.FormTestCase
> > > > > Tests run: 5, Failures: 0, Errors: 0, Skipped: 0, Time elapsed:
> > 0.034
> > > > > sec
> > > > > Running
> > org.apache.tuscany.sdo.test.ChangeSummaryOnDataObjectTestCase
> > > > > Tests run: 4, Failures: 0, Errors: 0, Skipped: 0, Time elapsed:
> > 0.315
> > > > > sec
> > > > > Running org.apache.tuscany.sdo.test.SerializeTypesTestCase
> > > > > Tests run: 3, Failures: 0, Errors: 0, Skipped: 0, Time elapsed:
> 0.03
> > > > > sec
> > > > > Running org.apache.tuscany.sdo.test.SimpleCopyTestCase
> > > > > Tests run: 1, Failures: 0, Errors: 0, Skipped: 0, Time elapsed:
> > 0.018
> > > > > sec
> > > > > Running org.apache.tuscany.sdo.test.osgi.ClassLoaderTestCase
> > > > > Tests run: 1, Failures: 0, Errors: 0, Skipped: 0, Time elapsed:
> > 4.349
> > > > > sec
> > > > > Running
> org.apache.tuscany.sdo.test.DeserializationNoSchemaTestCase
> > > > > Tests run: 2, Failures: 0, Errors: 0, Skipped: 0, Time elapsed:
> 1.19
> > > > > sec
> > > > > Running
> > org.apache.tuscany.sdo.test.MetadataInstancePropertiesTestCase
> > > > > Tests run: 4, Failures: 0, Errors: 0, Skipped: 0, Time elapsed:
> > 0.063
> > > > > sec
> > > > > Running org.apache.tuscany.sdo.test.DefineTypeTestCase
> > > > > Tests run: 8, Failures: 0, Errors: 0, Skipped: 0, Time elapsed:
> > 0.062
> > > > > sec
> > > > > Running org.apache.tuscany.sdo.test.DataTypeBaseTypeTestCase
> > > > > Tests run: 3, Failures: 0, Errors: 0, Skipped: 0, Time elapsed:
> > 0.013
> > > > > sec
> > > > > Running org.apache.tuscany.sdo.test.XMLStreamHelperTestCase
> > > > > Tests run: 7, Failures: 0, Errors: 0, Skipped: 0, Time elapsed:
> > 0.291
> > > > > sec
> > > > > Running org.apache.tuscany.sdo.test.MixedTypeTestCase
> > > > > Tests run: 1, Failures: 0, Errors: 0, Skipped: 0, Time elapsed:
> > 0.011
> > > > > sec
> > > > > Running org.apache.tuscany.sdo.test.TypeConversionTestCase
> > > > > Tests run: 27, Failures: 0, Errors: 0, Skipped: 0, Time elapsed:
> > 0.176
> > > > > sec
> > > > > Running org.apache.tuscany.sdo.test.XMLUnknownPropertiesTestCase
> > > > > Tests run: 2, Failures: 0, Errors: 0, Skipped: 0, Time elapsed:
> > 0.023
> > > > > sec
> > > > > Running org.apache.tuscany.sdo.test.XSDQNameTestCase
> > > > >
> > > >
> > > >
> > > >
> ---------------------------------------------------------------------
> > > > To unsubscribe, e-mail: tuscany-dev-unsubscribe@ws.apache.org
> > > > For additional commands, e-mail: tuscany-dev-help@ws.apache.org
> > > >
> > > >
> > >
> >
>

Re: [VOTE] SDO 1.1 rc3 release

Posted by ant elder <an...@gmail.com>.
Thats good, looks like we might be just about there now. Just to confirm -
were you testing with the code which included the TUSCANY-2187 fix that
Raymond had just committed?

   ...ant

On Thu, Apr 3, 2008 at 7:55 AM, Adriano Crestani <ad...@apache.org>
wrote:

> Hi,
>
> I found the problem. I was running the mvn command on impl folder and
> getting this failure, and not on the root folder. Strangely, I tried to
> run
> the mvn on the impl folder on another environment and it worked : )
>
> It's probably a problem with my environment though
>
> So, the RC4 seems OK to me ; )
>
> Adriano Crestani
>
> On Wed, Apr 2, 2008 at 9:16 PM, Adriano Crestani <
> adrianocrestani@apache.org>
> wrote:
>
> > mvn clean install didn't work either : (
> >
> > Adriano Crestani
> >
> >
> > On Wed, Apr 2, 2008 at 9:03 PM, Raymond Feng <en...@gmail.com>
> wrote:
> >
> > > I just tried the 1.1-incubating branch with both IBM and SUN JDK
> 1.5.x.
> > > The build was successful. Did you run with "mvn clean install"?
> > >
> > > IIRC, when I was playing around different versions of surefire plugin
> > > this afternoon, I hit the same problem once in the OSGi test case. It
> seems
> > > to be a bit random. Anyway, I don't think it's a blocker.
> > >
> > > Thanks,
> > > Raymond
> > > --------------------------------------------------
> > > From: "Adriano Crestani" <ad...@apache.org>
> > > Sent: Wednesday, April 02, 2008 9:28 PM
> > > To: <tu...@ws.apache.org>
> > > Cc: <an...@gmail.com>
> > > Subject: Re: [VOTE] SDO 1.1 rc3 release
> > >
> > >  Hi,
> > > >
> > > > I'm getting a test failure (the maven output below)* : ( *. Am I
> doing
> > > > something wrong?
> > > >
> > > > Regards,
> > > > Adriano Crestani
> > > >
> > > > -------------------------------------------------------
> > > > T E S T S
> > > > -------------------------------------------------------
> > > > Running org.apache.tuscany.sdo.test.DataObjectGetListTestCase
> > > > Tests run: 2, Failures: 0, Errors: 0, Skipped: 0, Time elapsed:
> 0.114
> > > > sec
> > > > Running org.apache.tuscany.sdo.test.NeverStaleChangeSummaryTestCase
> > > > Tests run: 1, Failures: 0, Errors: 0, Skipped: 0, Time elapsed:
> 0.037
> > > > sec
> > > > Running org.apache.tuscany.sdo.test.XPathTestCase
> > > > Tests run: 2, Failures: 0, Errors: 0, Skipped: 0, Time elapsed: 0.1
> > > > sec
> > > > Running org.apache.tuscany.sdo.test.DynamicTypesComparisonTestCase
> > > > Tests run: 1, Failures: 0, Errors: 0, Skipped: 0, Time elapsed:
> 0.023
> > > > sec
> > > > Running org.apache.tuscany.sdo.test.ImplSpecificTestCase
> > > > Tests run: 1, Failures: 0, Errors: 0, Skipped: 0, Time elapsed:
> 0.003
> > > > sec
> > > > Running org.apache.tuscany.sdo.test.HelperContextTestCase
> > > > Tests run: 2, Failures: 0, Errors: 0, Skipped: 0, Time elapsed:
> 0.004
> > > > sec
> > > > Running org.apache.tuscany.sdo.test.SubstitutionValuesTestCase
> > > > Tests run: 1, Failures: 0, Errors: 0, Skipped: 0, Time elapsed:
> 0.042
> > > > sec
> > > > Running org.apache.tuscany.sdo.test.osgi.OSGiTestCase
> > > > Tests run: 1, Failures: 0, Errors: 1, Skipped: 0, Time elapsed:
> 2.681
> > > > sec
> > > > <<< FA
> > > > ILURE!
> > > > Running org.apache.tuscany.sdo.test.XMLLoadOptionsTestCase
> > > > Tests run: 5, Failures: 0, Errors: 0, Skipped: 0, Time elapsed:
> 0.136
> > > > sec
> > > > Running org.apache.tuscany.sdo.test.XMLSaveOptionsTestCase
> > > > Tests run: 2, Failures: 0, Errors: 0, Skipped: 0, Time elapsed:
> 0.154
> > > > sec
> > > > Running org.apache.tuscany.sdo.test.JavaSerializeDeserializeTestCase
> > > > Tests run: 3, Failures: 0, Errors: 0, Skipped: 0, Time elapsed:
> 0.252
> > > > sec
> > > > Running org.apache.tuscany.sdo.test.SequenceTestCase
> > > > Tests run: 1, Failures: 0, Errors: 0, Skipped: 0, Time elapsed:
> 0.013
> > > > sec
> > > > Running org.apache.tuscany.sdo.test.ChangeSummaryTestCase
> > > > Tests run: 1, Failures: 0, Errors: 0, Skipped: 0, Time elapsed:
> 0.024
> > > > sec
> > > > Running org.apache.tuscany.sdo.test.SchemaLocationTestCase
> > > > Tests run: 1, Failures: 0, Errors: 0, Skipped: 0, Time elapsed:
> 0.019
> > > > sec
> > > > Running org.apache.tuscany.sdo.test.FormTestCase
> > > > Tests run: 5, Failures: 0, Errors: 0, Skipped: 0, Time elapsed:
> 0.034
> > > > sec
> > > > Running
> org.apache.tuscany.sdo.test.ChangeSummaryOnDataObjectTestCase
> > > > Tests run: 4, Failures: 0, Errors: 0, Skipped: 0, Time elapsed:
> 0.315
> > > > sec
> > > > Running org.apache.tuscany.sdo.test.SerializeTypesTestCase
> > > > Tests run: 3, Failures: 0, Errors: 0, Skipped: 0, Time elapsed: 0.03
> > > > sec
> > > > Running org.apache.tuscany.sdo.test.SimpleCopyTestCase
> > > > Tests run: 1, Failures: 0, Errors: 0, Skipped: 0, Time elapsed:
> 0.018
> > > > sec
> > > > Running org.apache.tuscany.sdo.test.osgi.ClassLoaderTestCase
> > > > Tests run: 1, Failures: 0, Errors: 0, Skipped: 0, Time elapsed:
> 4.349
> > > > sec
> > > > Running org.apache.tuscany.sdo.test.DeserializationNoSchemaTestCase
> > > > Tests run: 2, Failures: 0, Errors: 0, Skipped: 0, Time elapsed: 1.19
> > > > sec
> > > > Running
> org.apache.tuscany.sdo.test.MetadataInstancePropertiesTestCase
> > > > Tests run: 4, Failures: 0, Errors: 0, Skipped: 0, Time elapsed:
> 0.063
> > > > sec
> > > > Running org.apache.tuscany.sdo.test.DefineTypeTestCase
> > > > Tests run: 8, Failures: 0, Errors: 0, Skipped: 0, Time elapsed:
> 0.062
> > > > sec
> > > > Running org.apache.tuscany.sdo.test.DataTypeBaseTypeTestCase
> > > > Tests run: 3, Failures: 0, Errors: 0, Skipped: 0, Time elapsed:
> 0.013
> > > > sec
> > > > Running org.apache.tuscany.sdo.test.XMLStreamHelperTestCase
> > > > Tests run: 7, Failures: 0, Errors: 0, Skipped: 0, Time elapsed:
> 0.291
> > > > sec
> > > > Running org.apache.tuscany.sdo.test.MixedTypeTestCase
> > > > Tests run: 1, Failures: 0, Errors: 0, Skipped: 0, Time elapsed:
> 0.011
> > > > sec
> > > > Running org.apache.tuscany.sdo.test.TypeConversionTestCase
> > > > Tests run: 27, Failures: 0, Errors: 0, Skipped: 0, Time elapsed:
> 0.176
> > > > sec
> > > > Running org.apache.tuscany.sdo.test.XMLUnknownPropertiesTestCase
> > > > Tests run: 2, Failures: 0, Errors: 0, Skipped: 0, Time elapsed:
> 0.023
> > > > sec
> > > > Running org.apache.tuscany.sdo.test.XSDQNameTestCase
> > > >
> > >
> > >
> > > ---------------------------------------------------------------------
> > > To unsubscribe, e-mail: tuscany-dev-unsubscribe@ws.apache.org
> > > For additional commands, e-mail: tuscany-dev-help@ws.apache.org
> > >
> > >
> >
>

Re: [VOTE] SDO 1.1 rc3 release

Posted by ant elder <an...@gmail.com>.
Thanks ;) I shall rebuild the RC4 distro to include that.

   ...ant

On Wed, Apr 2, 2008 at 10:15 PM, Raymond Feng <en...@gmail.com> wrote:

> Hi, Ant.
>
> I had to fix TUSCANY-2187 which broke the build on Windows with SUN JDK
> 1.5.x. The commit is r644071.
>
> Thanks,
> Raymond
>
> --------------------------------------------------
> From: "ant elder" <an...@apache.org>
> Sent: Wednesday, April 02, 2008 2:12 AM
> To: <tu...@ws.apache.org>
> Subject: Re: [VOTE] SDO 1.1 rc3 release
>
>  A new SDO 1.1 RC4 is available at
> > http://people.apache.org/~antelder/tuscany/sdo/1.1-rc4<http://people.apache.org/%7Eantelder/tuscany/sdo/1.1-rc4>,
> > could anyone do a
> > quick sanity check review before I call a release vote on this?
> >
> >  ...ant
> >
> > On Wed, Apr 2, 2008 at 8:32 AM, ant elder <an...@apache.org> wrote:
> >
> >  Thats excellent Adriano. I'll go merge this into the 1.1 branch and
> > > respin
> > > an RC now.
> > >
> > >   ...ant
> > >
> > >
> > > On Tue, Apr 1, 2008 at 1:18 AM, Adriano Crestani <
> > > adrianocrestani@apache.org> wrote:
> > >
> > > > Hi Ant,
> > > >
> > > > The bug is fixed on revision 643224 ; )
> > > >
> > > > Adriano Crestani
> > > >
> > > > On Mon, Mar 31, 2008 at 8:56 AM, ant elder <an...@gmail.com>
> > > wrote:
> > > >
> > > > >
> > > > >
> > > > > On Sun, Mar 30, 2008 at 7:53 AM, Adriano Crestani <
> > > > > adrianocrestani@apache.org> wrote:
> > > > >
> > > > > > Adriano, you've assigned TUSCANY-1659 to yourself so does that
> > > mean
> > > > > > you're
> > > > > > working on a fix (which would be great!)? Anyone have any
> > > pointers
> > > > to
> > > > > > help
> > > > > > fix it? The jira has been open for over 6 months already so is
> > > > anyone
> > > > > > actually saying its a blocker for this 1.1 release?
> > > > > >
> > > > > > Yes, I'm trying to fix it : ). And I think it's not a blocker, >
> > > > > cause
> > > > > > it's not so relevant, since it blocks only in few cases that are
> > > > > > env-dependent. So, for me it's ok if we add this fix only on
> > > next
> > > > release.
> > > > > >
> > > > >
> > > > > Does that email from Frank over on the SDO Date Format thread get
> > > you
> > > > > closer? I'm still happy hold of the repsin if you think you're
> > > likely
> > > > to get
> > > > > a fix for this done soon.
> > > > >
> > > > >    ...ant
> > > > >
> > > >
> > >
> > >
> > >
> >

Re: [VOTE] SDO 1.1 rc3 release

Posted by Adriano Crestani <ad...@apache.org>.
Hi,

I found the problem. I was running the mvn command on impl folder and
getting this failure, and not on the root folder. Strangely, I tried to run
the mvn on the impl folder on another environment and it worked : )

It's probably a problem with my environment though

So, the RC4 seems OK to me ; )

Adriano Crestani

On Wed, Apr 2, 2008 at 9:16 PM, Adriano Crestani <ad...@apache.org>
wrote:

> mvn clean install didn't work either : (
>
> Adriano Crestani
>
>
> On Wed, Apr 2, 2008 at 9:03 PM, Raymond Feng <en...@gmail.com> wrote:
>
> > I just tried the 1.1-incubating branch with both IBM and SUN JDK 1.5.x.
> > The build was successful. Did you run with "mvn clean install"?
> >
> > IIRC, when I was playing around different versions of surefire plugin
> > this afternoon, I hit the same problem once in the OSGi test case. It seems
> > to be a bit random. Anyway, I don't think it's a blocker.
> >
> > Thanks,
> > Raymond
> > --------------------------------------------------
> > From: "Adriano Crestani" <ad...@apache.org>
> > Sent: Wednesday, April 02, 2008 9:28 PM
> > To: <tu...@ws.apache.org>
> > Cc: <an...@gmail.com>
> > Subject: Re: [VOTE] SDO 1.1 rc3 release
> >
> >  Hi,
> > >
> > > I'm getting a test failure (the maven output below)* : ( *. Am I doing
> > > something wrong?
> > >
> > > Regards,
> > > Adriano Crestani
> > >
> > > -------------------------------------------------------
> > > T E S T S
> > > -------------------------------------------------------
> > > Running org.apache.tuscany.sdo.test.DataObjectGetListTestCase
> > > Tests run: 2, Failures: 0, Errors: 0, Skipped: 0, Time elapsed: 0.114
> > > sec
> > > Running org.apache.tuscany.sdo.test.NeverStaleChangeSummaryTestCase
> > > Tests run: 1, Failures: 0, Errors: 0, Skipped: 0, Time elapsed: 0.037
> > > sec
> > > Running org.apache.tuscany.sdo.test.XPathTestCase
> > > Tests run: 2, Failures: 0, Errors: 0, Skipped: 0, Time elapsed: 0.1
> > > sec
> > > Running org.apache.tuscany.sdo.test.DynamicTypesComparisonTestCase
> > > Tests run: 1, Failures: 0, Errors: 0, Skipped: 0, Time elapsed: 0.023
> > > sec
> > > Running org.apache.tuscany.sdo.test.ImplSpecificTestCase
> > > Tests run: 1, Failures: 0, Errors: 0, Skipped: 0, Time elapsed: 0.003
> > > sec
> > > Running org.apache.tuscany.sdo.test.HelperContextTestCase
> > > Tests run: 2, Failures: 0, Errors: 0, Skipped: 0, Time elapsed: 0.004
> > > sec
> > > Running org.apache.tuscany.sdo.test.SubstitutionValuesTestCase
> > > Tests run: 1, Failures: 0, Errors: 0, Skipped: 0, Time elapsed: 0.042
> > > sec
> > > Running org.apache.tuscany.sdo.test.osgi.OSGiTestCase
> > > Tests run: 1, Failures: 0, Errors: 1, Skipped: 0, Time elapsed: 2.681
> > > sec
> > > <<< FA
> > > ILURE!
> > > Running org.apache.tuscany.sdo.test.XMLLoadOptionsTestCase
> > > Tests run: 5, Failures: 0, Errors: 0, Skipped: 0, Time elapsed: 0.136
> > > sec
> > > Running org.apache.tuscany.sdo.test.XMLSaveOptionsTestCase
> > > Tests run: 2, Failures: 0, Errors: 0, Skipped: 0, Time elapsed: 0.154
> > > sec
> > > Running org.apache.tuscany.sdo.test.JavaSerializeDeserializeTestCase
> > > Tests run: 3, Failures: 0, Errors: 0, Skipped: 0, Time elapsed: 0.252
> > > sec
> > > Running org.apache.tuscany.sdo.test.SequenceTestCase
> > > Tests run: 1, Failures: 0, Errors: 0, Skipped: 0, Time elapsed: 0.013
> > > sec
> > > Running org.apache.tuscany.sdo.test.ChangeSummaryTestCase
> > > Tests run: 1, Failures: 0, Errors: 0, Skipped: 0, Time elapsed: 0.024
> > > sec
> > > Running org.apache.tuscany.sdo.test.SchemaLocationTestCase
> > > Tests run: 1, Failures: 0, Errors: 0, Skipped: 0, Time elapsed: 0.019
> > > sec
> > > Running org.apache.tuscany.sdo.test.FormTestCase
> > > Tests run: 5, Failures: 0, Errors: 0, Skipped: 0, Time elapsed: 0.034
> > > sec
> > > Running org.apache.tuscany.sdo.test.ChangeSummaryOnDataObjectTestCase
> > > Tests run: 4, Failures: 0, Errors: 0, Skipped: 0, Time elapsed: 0.315
> > > sec
> > > Running org.apache.tuscany.sdo.test.SerializeTypesTestCase
> > > Tests run: 3, Failures: 0, Errors: 0, Skipped: 0, Time elapsed: 0.03
> > > sec
> > > Running org.apache.tuscany.sdo.test.SimpleCopyTestCase
> > > Tests run: 1, Failures: 0, Errors: 0, Skipped: 0, Time elapsed: 0.018
> > > sec
> > > Running org.apache.tuscany.sdo.test.osgi.ClassLoaderTestCase
> > > Tests run: 1, Failures: 0, Errors: 0, Skipped: 0, Time elapsed: 4.349
> > > sec
> > > Running org.apache.tuscany.sdo.test.DeserializationNoSchemaTestCase
> > > Tests run: 2, Failures: 0, Errors: 0, Skipped: 0, Time elapsed: 1.19
> > > sec
> > > Running org.apache.tuscany.sdo.test.MetadataInstancePropertiesTestCase
> > > Tests run: 4, Failures: 0, Errors: 0, Skipped: 0, Time elapsed: 0.063
> > > sec
> > > Running org.apache.tuscany.sdo.test.DefineTypeTestCase
> > > Tests run: 8, Failures: 0, Errors: 0, Skipped: 0, Time elapsed: 0.062
> > > sec
> > > Running org.apache.tuscany.sdo.test.DataTypeBaseTypeTestCase
> > > Tests run: 3, Failures: 0, Errors: 0, Skipped: 0, Time elapsed: 0.013
> > > sec
> > > Running org.apache.tuscany.sdo.test.XMLStreamHelperTestCase
> > > Tests run: 7, Failures: 0, Errors: 0, Skipped: 0, Time elapsed: 0.291
> > > sec
> > > Running org.apache.tuscany.sdo.test.MixedTypeTestCase
> > > Tests run: 1, Failures: 0, Errors: 0, Skipped: 0, Time elapsed: 0.011
> > > sec
> > > Running org.apache.tuscany.sdo.test.TypeConversionTestCase
> > > Tests run: 27, Failures: 0, Errors: 0, Skipped: 0, Time elapsed: 0.176
> > > sec
> > > Running org.apache.tuscany.sdo.test.XMLUnknownPropertiesTestCase
> > > Tests run: 2, Failures: 0, Errors: 0, Skipped: 0, Time elapsed: 0.023
> > > sec
> > > Running org.apache.tuscany.sdo.test.XSDQNameTestCase
> > >
> >
> >
> > ---------------------------------------------------------------------
> > To unsubscribe, e-mail: tuscany-dev-unsubscribe@ws.apache.org
> > For additional commands, e-mail: tuscany-dev-help@ws.apache.org
> >
> >
>

Re: [VOTE] SDO 1.1 rc3 release

Posted by Adriano Crestani <ad...@apache.org>.
mvn clean install didn't work either : (

Adriano Crestani

On Wed, Apr 2, 2008 at 9:03 PM, Raymond Feng <en...@gmail.com> wrote:

> I just tried the 1.1-incubating branch with both IBM and SUN JDK 1.5.x.
> The build was successful. Did you run with "mvn clean install"?
>
> IIRC, when I was playing around different versions of surefire plugin this
> afternoon, I hit the same problem once in the OSGi test case. It seems to be
> a bit random. Anyway, I don't think it's a blocker.
>
> Thanks,
> Raymond
> --------------------------------------------------
> From: "Adriano Crestani" <ad...@apache.org>
> Sent: Wednesday, April 02, 2008 9:28 PM
> To: <tu...@ws.apache.org>
> Cc: <an...@gmail.com>
> Subject: Re: [VOTE] SDO 1.1 rc3 release
>
>  Hi,
> >
> > I'm getting a test failure (the maven output below)* : ( *. Am I doing
> > something wrong?
> >
> > Regards,
> > Adriano Crestani
> >
> > -------------------------------------------------------
> > T E S T S
> > -------------------------------------------------------
> > Running org.apache.tuscany.sdo.test.DataObjectGetListTestCase
> > Tests run: 2, Failures: 0, Errors: 0, Skipped: 0, Time elapsed: 0.114
> > sec
> > Running org.apache.tuscany.sdo.test.NeverStaleChangeSummaryTestCase
> > Tests run: 1, Failures: 0, Errors: 0, Skipped: 0, Time elapsed: 0.037
> > sec
> > Running org.apache.tuscany.sdo.test.XPathTestCase
> > Tests run: 2, Failures: 0, Errors: 0, Skipped: 0, Time elapsed: 0.1 sec
> > Running org.apache.tuscany.sdo.test.DynamicTypesComparisonTestCase
> > Tests run: 1, Failures: 0, Errors: 0, Skipped: 0, Time elapsed: 0.023
> > sec
> > Running org.apache.tuscany.sdo.test.ImplSpecificTestCase
> > Tests run: 1, Failures: 0, Errors: 0, Skipped: 0, Time elapsed: 0.003
> > sec
> > Running org.apache.tuscany.sdo.test.HelperContextTestCase
> > Tests run: 2, Failures: 0, Errors: 0, Skipped: 0, Time elapsed: 0.004
> > sec
> > Running org.apache.tuscany.sdo.test.SubstitutionValuesTestCase
> > Tests run: 1, Failures: 0, Errors: 0, Skipped: 0, Time elapsed: 0.042
> > sec
> > Running org.apache.tuscany.sdo.test.osgi.OSGiTestCase
> > Tests run: 1, Failures: 0, Errors: 1, Skipped: 0, Time elapsed: 2.681
> > sec
> > <<< FA
> > ILURE!
> > Running org.apache.tuscany.sdo.test.XMLLoadOptionsTestCase
> > Tests run: 5, Failures: 0, Errors: 0, Skipped: 0, Time elapsed: 0.136
> > sec
> > Running org.apache.tuscany.sdo.test.XMLSaveOptionsTestCase
> > Tests run: 2, Failures: 0, Errors: 0, Skipped: 0, Time elapsed: 0.154
> > sec
> > Running org.apache.tuscany.sdo.test.JavaSerializeDeserializeTestCase
> > Tests run: 3, Failures: 0, Errors: 0, Skipped: 0, Time elapsed: 0.252
> > sec
> > Running org.apache.tuscany.sdo.test.SequenceTestCase
> > Tests run: 1, Failures: 0, Errors: 0, Skipped: 0, Time elapsed: 0.013
> > sec
> > Running org.apache.tuscany.sdo.test.ChangeSummaryTestCase
> > Tests run: 1, Failures: 0, Errors: 0, Skipped: 0, Time elapsed: 0.024
> > sec
> > Running org.apache.tuscany.sdo.test.SchemaLocationTestCase
> > Tests run: 1, Failures: 0, Errors: 0, Skipped: 0, Time elapsed: 0.019
> > sec
> > Running org.apache.tuscany.sdo.test.FormTestCase
> > Tests run: 5, Failures: 0, Errors: 0, Skipped: 0, Time elapsed: 0.034
> > sec
> > Running org.apache.tuscany.sdo.test.ChangeSummaryOnDataObjectTestCase
> > Tests run: 4, Failures: 0, Errors: 0, Skipped: 0, Time elapsed: 0.315
> > sec
> > Running org.apache.tuscany.sdo.test.SerializeTypesTestCase
> > Tests run: 3, Failures: 0, Errors: 0, Skipped: 0, Time elapsed: 0.03 sec
> > Running org.apache.tuscany.sdo.test.SimpleCopyTestCase
> > Tests run: 1, Failures: 0, Errors: 0, Skipped: 0, Time elapsed: 0.018
> > sec
> > Running org.apache.tuscany.sdo.test.osgi.ClassLoaderTestCase
> > Tests run: 1, Failures: 0, Errors: 0, Skipped: 0, Time elapsed: 4.349
> > sec
> > Running org.apache.tuscany.sdo.test.DeserializationNoSchemaTestCase
> > Tests run: 2, Failures: 0, Errors: 0, Skipped: 0, Time elapsed: 1.19 sec
> > Running org.apache.tuscany.sdo.test.MetadataInstancePropertiesTestCase
> > Tests run: 4, Failures: 0, Errors: 0, Skipped: 0, Time elapsed: 0.063
> > sec
> > Running org.apache.tuscany.sdo.test.DefineTypeTestCase
> > Tests run: 8, Failures: 0, Errors: 0, Skipped: 0, Time elapsed: 0.062
> > sec
> > Running org.apache.tuscany.sdo.test.DataTypeBaseTypeTestCase
> > Tests run: 3, Failures: 0, Errors: 0, Skipped: 0, Time elapsed: 0.013
> > sec
> > Running org.apache.tuscany.sdo.test.XMLStreamHelperTestCase
> > Tests run: 7, Failures: 0, Errors: 0, Skipped: 0, Time elapsed: 0.291
> > sec
> > Running org.apache.tuscany.sdo.test.MixedTypeTestCase
> > Tests run: 1, Failures: 0, Errors: 0, Skipped: 0, Time elapsed: 0.011
> > sec
> > Running org.apache.tuscany.sdo.test.TypeConversionTestCase
> > Tests run: 27, Failures: 0, Errors: 0, Skipped: 0, Time elapsed: 0.176
> > sec
> > Running org.apache.tuscany.sdo.test.XMLUnknownPropertiesTestCase
> > Tests run: 2, Failures: 0, Errors: 0, Skipped: 0, Time elapsed: 0.023
> > sec
> > Running org.apache.tuscany.sdo.test.XSDQNameTestCase
> >
>
>
> ---------------------------------------------------------------------
> To unsubscribe, e-mail: tuscany-dev-unsubscribe@ws.apache.org
> For additional commands, e-mail: tuscany-dev-help@ws.apache.org
>
>

Re: [VOTE] SDO 1.1 rc3 release

Posted by Raymond Feng <en...@gmail.com>.
I just tried the 1.1-incubating branch with both IBM and SUN JDK 1.5.x. The 
build was successful. Did you run with "mvn clean install"?

IIRC, when I was playing around different versions of surefire plugin this 
afternoon, I hit the same problem once in the OSGi test case. It seems to be 
a bit random. Anyway, I don't think it's a blocker.

Thanks,
Raymond
--------------------------------------------------
From: "Adriano Crestani" <ad...@apache.org>
Sent: Wednesday, April 02, 2008 9:28 PM
To: <tu...@ws.apache.org>
Cc: <an...@gmail.com>
Subject: Re: [VOTE] SDO 1.1 rc3 release

> Hi,
>
> I'm getting a test failure (the maven output below)* : ( *. Am I doing
> something wrong?
>
> Regards,
> Adriano Crestani
>
> -------------------------------------------------------
> T E S T S
> -------------------------------------------------------
> Running org.apache.tuscany.sdo.test.DataObjectGetListTestCase
> Tests run: 2, Failures: 0, Errors: 0, Skipped: 0, Time elapsed: 0.114 sec
> Running org.apache.tuscany.sdo.test.NeverStaleChangeSummaryTestCase
> Tests run: 1, Failures: 0, Errors: 0, Skipped: 0, Time elapsed: 0.037 sec
> Running org.apache.tuscany.sdo.test.XPathTestCase
> Tests run: 2, Failures: 0, Errors: 0, Skipped: 0, Time elapsed: 0.1 sec
> Running org.apache.tuscany.sdo.test.DynamicTypesComparisonTestCase
> Tests run: 1, Failures: 0, Errors: 0, Skipped: 0, Time elapsed: 0.023 sec
> Running org.apache.tuscany.sdo.test.ImplSpecificTestCase
> Tests run: 1, Failures: 0, Errors: 0, Skipped: 0, Time elapsed: 0.003 sec
> Running org.apache.tuscany.sdo.test.HelperContextTestCase
> Tests run: 2, Failures: 0, Errors: 0, Skipped: 0, Time elapsed: 0.004 sec
> Running org.apache.tuscany.sdo.test.SubstitutionValuesTestCase
> Tests run: 1, Failures: 0, Errors: 0, Skipped: 0, Time elapsed: 0.042 sec
> Running org.apache.tuscany.sdo.test.osgi.OSGiTestCase
> Tests run: 1, Failures: 0, Errors: 1, Skipped: 0, Time elapsed: 2.681 sec
> <<< FA
> ILURE!
> Running org.apache.tuscany.sdo.test.XMLLoadOptionsTestCase
> Tests run: 5, Failures: 0, Errors: 0, Skipped: 0, Time elapsed: 0.136 sec
> Running org.apache.tuscany.sdo.test.XMLSaveOptionsTestCase
> Tests run: 2, Failures: 0, Errors: 0, Skipped: 0, Time elapsed: 0.154 sec
> Running org.apache.tuscany.sdo.test.JavaSerializeDeserializeTestCase
> Tests run: 3, Failures: 0, Errors: 0, Skipped: 0, Time elapsed: 0.252 sec
> Running org.apache.tuscany.sdo.test.SequenceTestCase
> Tests run: 1, Failures: 0, Errors: 0, Skipped: 0, Time elapsed: 0.013 sec
> Running org.apache.tuscany.sdo.test.ChangeSummaryTestCase
> Tests run: 1, Failures: 0, Errors: 0, Skipped: 0, Time elapsed: 0.024 sec
> Running org.apache.tuscany.sdo.test.SchemaLocationTestCase
> Tests run: 1, Failures: 0, Errors: 0, Skipped: 0, Time elapsed: 0.019 sec
> Running org.apache.tuscany.sdo.test.FormTestCase
> Tests run: 5, Failures: 0, Errors: 0, Skipped: 0, Time elapsed: 0.034 sec
> Running org.apache.tuscany.sdo.test.ChangeSummaryOnDataObjectTestCase
> Tests run: 4, Failures: 0, Errors: 0, Skipped: 0, Time elapsed: 0.315 sec
> Running org.apache.tuscany.sdo.test.SerializeTypesTestCase
> Tests run: 3, Failures: 0, Errors: 0, Skipped: 0, Time elapsed: 0.03 sec
> Running org.apache.tuscany.sdo.test.SimpleCopyTestCase
> Tests run: 1, Failures: 0, Errors: 0, Skipped: 0, Time elapsed: 0.018 sec
> Running org.apache.tuscany.sdo.test.osgi.ClassLoaderTestCase
> Tests run: 1, Failures: 0, Errors: 0, Skipped: 0, Time elapsed: 4.349 sec
> Running org.apache.tuscany.sdo.test.DeserializationNoSchemaTestCase
> Tests run: 2, Failures: 0, Errors: 0, Skipped: 0, Time elapsed: 1.19 sec
> Running org.apache.tuscany.sdo.test.MetadataInstancePropertiesTestCase
> Tests run: 4, Failures: 0, Errors: 0, Skipped: 0, Time elapsed: 0.063 sec
> Running org.apache.tuscany.sdo.test.DefineTypeTestCase
> Tests run: 8, Failures: 0, Errors: 0, Skipped: 0, Time elapsed: 0.062 sec
> Running org.apache.tuscany.sdo.test.DataTypeBaseTypeTestCase
> Tests run: 3, Failures: 0, Errors: 0, Skipped: 0, Time elapsed: 0.013 sec
> Running org.apache.tuscany.sdo.test.XMLStreamHelperTestCase
> Tests run: 7, Failures: 0, Errors: 0, Skipped: 0, Time elapsed: 0.291 sec
> Running org.apache.tuscany.sdo.test.MixedTypeTestCase
> Tests run: 1, Failures: 0, Errors: 0, Skipped: 0, Time elapsed: 0.011 sec
> Running org.apache.tuscany.sdo.test.TypeConversionTestCase
> Tests run: 27, Failures: 0, Errors: 0, Skipped: 0, Time elapsed: 0.176 sec
> Running org.apache.tuscany.sdo.test.XMLUnknownPropertiesTestCase
> Tests run: 2, Failures: 0, Errors: 0, Skipped: 0, Time elapsed: 0.023 sec
> Running org.apache.tuscany.sdo.test.XSDQNameTestCase 


---------------------------------------------------------------------
To unsubscribe, e-mail: tuscany-dev-unsubscribe@ws.apache.org
For additional commands, e-mail: tuscany-dev-help@ws.apache.org


Re: [VOTE] SDO 1.1 rc3 release

Posted by Adriano Crestani <ad...@apache.org>.
Hi,

I'm getting a test failure (the maven output below)* : ( *. Am I doing
something wrong?

Regards,
Adriano Crestani

-------------------------------------------------------
 T E S T S
-------------------------------------------------------
Running org.apache.tuscany.sdo.test.DataObjectGetListTestCase
Tests run: 2, Failures: 0, Errors: 0, Skipped: 0, Time elapsed: 0.114 sec
Running org.apache.tuscany.sdo.test.NeverStaleChangeSummaryTestCase
Tests run: 1, Failures: 0, Errors: 0, Skipped: 0, Time elapsed: 0.037 sec
Running org.apache.tuscany.sdo.test.XPathTestCase
Tests run: 2, Failures: 0, Errors: 0, Skipped: 0, Time elapsed: 0.1 sec
Running org.apache.tuscany.sdo.test.DynamicTypesComparisonTestCase
Tests run: 1, Failures: 0, Errors: 0, Skipped: 0, Time elapsed: 0.023 sec
Running org.apache.tuscany.sdo.test.ImplSpecificTestCase
Tests run: 1, Failures: 0, Errors: 0, Skipped: 0, Time elapsed: 0.003 sec
Running org.apache.tuscany.sdo.test.HelperContextTestCase
Tests run: 2, Failures: 0, Errors: 0, Skipped: 0, Time elapsed: 0.004 sec
Running org.apache.tuscany.sdo.test.SubstitutionValuesTestCase
Tests run: 1, Failures: 0, Errors: 0, Skipped: 0, Time elapsed: 0.042 sec
Running org.apache.tuscany.sdo.test.osgi.OSGiTestCase
Tests run: 1, Failures: 0, Errors: 1, Skipped: 0, Time elapsed: 2.681 sec
<<< FA
ILURE!
Running org.apache.tuscany.sdo.test.XMLLoadOptionsTestCase
Tests run: 5, Failures: 0, Errors: 0, Skipped: 0, Time elapsed: 0.136 sec
Running org.apache.tuscany.sdo.test.XMLSaveOptionsTestCase
Tests run: 2, Failures: 0, Errors: 0, Skipped: 0, Time elapsed: 0.154 sec
Running org.apache.tuscany.sdo.test.JavaSerializeDeserializeTestCase
Tests run: 3, Failures: 0, Errors: 0, Skipped: 0, Time elapsed: 0.252 sec
Running org.apache.tuscany.sdo.test.SequenceTestCase
Tests run: 1, Failures: 0, Errors: 0, Skipped: 0, Time elapsed: 0.013 sec
Running org.apache.tuscany.sdo.test.ChangeSummaryTestCase
Tests run: 1, Failures: 0, Errors: 0, Skipped: 0, Time elapsed: 0.024 sec
Running org.apache.tuscany.sdo.test.SchemaLocationTestCase
Tests run: 1, Failures: 0, Errors: 0, Skipped: 0, Time elapsed: 0.019 sec
Running org.apache.tuscany.sdo.test.FormTestCase
Tests run: 5, Failures: 0, Errors: 0, Skipped: 0, Time elapsed: 0.034 sec
Running org.apache.tuscany.sdo.test.ChangeSummaryOnDataObjectTestCase
Tests run: 4, Failures: 0, Errors: 0, Skipped: 0, Time elapsed: 0.315 sec
Running org.apache.tuscany.sdo.test.SerializeTypesTestCase
Tests run: 3, Failures: 0, Errors: 0, Skipped: 0, Time elapsed: 0.03 sec
Running org.apache.tuscany.sdo.test.SimpleCopyTestCase
Tests run: 1, Failures: 0, Errors: 0, Skipped: 0, Time elapsed: 0.018 sec
Running org.apache.tuscany.sdo.test.osgi.ClassLoaderTestCase
Tests run: 1, Failures: 0, Errors: 0, Skipped: 0, Time elapsed: 4.349 sec
Running org.apache.tuscany.sdo.test.DeserializationNoSchemaTestCase
Tests run: 2, Failures: 0, Errors: 0, Skipped: 0, Time elapsed: 1.19 sec
Running org.apache.tuscany.sdo.test.MetadataInstancePropertiesTestCase
Tests run: 4, Failures: 0, Errors: 0, Skipped: 0, Time elapsed: 0.063 sec
Running org.apache.tuscany.sdo.test.DefineTypeTestCase
Tests run: 8, Failures: 0, Errors: 0, Skipped: 0, Time elapsed: 0.062 sec
Running org.apache.tuscany.sdo.test.DataTypeBaseTypeTestCase
Tests run: 3, Failures: 0, Errors: 0, Skipped: 0, Time elapsed: 0.013 sec
Running org.apache.tuscany.sdo.test.XMLStreamHelperTestCase
Tests run: 7, Failures: 0, Errors: 0, Skipped: 0, Time elapsed: 0.291 sec
Running org.apache.tuscany.sdo.test.MixedTypeTestCase
Tests run: 1, Failures: 0, Errors: 0, Skipped: 0, Time elapsed: 0.011 sec
Running org.apache.tuscany.sdo.test.TypeConversionTestCase
Tests run: 27, Failures: 0, Errors: 0, Skipped: 0, Time elapsed: 0.176 sec
Running org.apache.tuscany.sdo.test.XMLUnknownPropertiesTestCase
Tests run: 2, Failures: 0, Errors: 0, Skipped: 0, Time elapsed: 0.023 sec
Running org.apache.tuscany.sdo.test.XSDQNameTestCase
Tests run: 3, Failures: 0, Errors: 0, Skipped: 0, Time elapsed: 0.016 sec
Running org.apache.tuscany.sdo.test.CrossScopeCopyTestCase
Tests run: 1, Failures: 0, Errors: 0, Skipped: 0, Time elapsed: 0.053 sec
Running org.apache.tuscany.sdo.test.OpenTypeTestCase
Tests run: 3, Failures: 0, Errors: 0, Skipped: 0, Time elapsed: 0.021 sec
Running org.apache.tuscany.sdo.test.DupElementTestCase
Tests run: 1, Failures: 0, Errors: 0, Skipped: 0, Time elapsed: 0.012 sec
Running org.apache.tuscany.sdo.test.IsManyTestCase
Tests run: 1, Failures: 0, Errors: 0, Skipped: 0, Time elapsed: 0.009 sec
Running org.apache.tuscany.sdo.test.ContainmentCycleTestCase
Tests run: 20, Failures: 0, Errors: 0, Skipped: 0, Time elapsed: 0.056 sec
Running org.apache.tuscany.sdo.test.TypeRoundTripTestCase
Tests run: 1, Failures: 0, Errors: 0, Skipped: 0, Time elapsed: 0.009 sec
Running org.apache.tuscany.sdo.test.SimpleEqualityTestCase
Tests run: 2, Failures: 0, Errors: 0, Skipped: 0, Time elapsed: 0.018 sec
Running org.apache.tuscany.sdo.test.ChangeSummaryPropertyTestCase
Tests run: 3, Failures: 0, Errors: 0, Skipped: 0, Time elapsed: 0.387 sec
Running org.apache.tuscany.sdo.test.DefineOpenContentPropertyTestCase
Tests run: 1, Failures: 0, Errors: 0, Skipped: 0, Time elapsed: 0.012 sec
Running org.apache.tuscany.sdo.test.ExpectedExceptionsTestCase
Tests run: 11, Failures: 0, Errors: 0, Skipped: 0, Time elapsed: 0.02 sec
Running org.apache.tuscany.sdo.test.BoundsTestCase
Tests run: 1, Failures: 0, Errors: 0, Skipped: 0, Time elapsed: 0.007 sec
Running org.apache.tuscany.sdo.test.SimpleDynamicTestCase
Tests run: 1, Failures: 0, Errors: 0, Skipped: 0, Time elapsed: 0.01 sec
Running org.apache.tuscany.sdo.codegen.BytecodeInterfaceGeneratorTestCase
Tests run: 10, Failures: 0, Errors: 0, Skipped: 0, Time elapsed: 0.022 sec
Running org.apache.tuscany.sdo.test.XMLHelperTestCase
Tests run: 5, Failures: 0, Errors: 0, Skipped: 0, Time elapsed: 0.854 sec
Running org.apache.tuscany.sdo.test.DataGraphTestCase
Tests run: 12, Failures: 0, Errors: 0, Skipped: 0, Time elapsed: 0.079 sec
Running org.apache.tuscany.sdo.codegen.JavaInterfaceGeneratorTestCase
Tests run: 10, Failures: 0, Errors: 0, Skipped: 0, Time elapsed: 0.007 sec
Running org.apache.tuscany.sdo.test.TypeHelperTestCase
Tests run: 1, Failures: 0, Errors: 0, Skipped: 0, Time elapsed: 0.002 sec
Running org.apache.tuscany.sdo.test.DateConversionTestCase
Tests run: 13, Failures: 0, Errors: 0, Skipped: 0, Time elapsed: 0.049 sec
Running org.apache.tuscany.sdo.test.XMLDocumentTestCase
Tests run: 2, Failures: 0, Errors: 0, Skipped: 0, Time elapsed: 0.008 sec
Running org.apache.tuscany.sdo.test.NotificationTestCase
Tests run: 1, Failures: 0, Errors: 0, Skipped: 0, Time elapsed: 0.008 sec
Running org.apache.tuscany.sdo.test.XMLStreamHelperPerformanceTestCase
Tests run: 1, Failures: 0, Errors: 0, Skipped: 0, Time elapsed: 0.011 sec
Running org.apache.tuscany.sdo.test.XSDHelperTestCase
Tests run: 8, Failures: 0, Errors: 0, Skipped: 0, Time elapsed: 0.054 sec

Results :

Tests in error:
  test(org.apache.tuscany.sdo.test.osgi.OSGiTestCase)

Tests run: 204, Failures: 0, Errors: 1, Skipped: 0

[INFO]
------------------------------------------------------------------------
[ERROR] BUILD FAILURE
[INFO]
------------------------------------------------------------------------
[INFO] There are test failures.
[INFO]
------------------------------------------------------------------------
[INFO] Trace
org.apache.maven.BuildFailureException: There are test failures.
        at
org.apache.maven.lifecycle.DefaultLifecycleExecutor.executeGoals(Defa
ultLifecycleExecutor.java:560)
        at
org.apache.maven.lifecycle.DefaultLifecycleExecutor.executeGoalWithLi
fecycle(DefaultLifecycleExecutor.java:480)
        at
org.apache.maven.lifecycle.DefaultLifecycleExecutor.executeGoal(Defau
ltLifecycleExecutor.java:459)
        at
org.apache.maven.lifecycle.DefaultLifecycleExecutor.executeGoalAndHan
dleFailures(DefaultLifecycleExecutor.java:311)
        at
org.apache.maven.lifecycle.DefaultLifecycleExecutor.executeTaskSegmen
ts(DefaultLifecycleExecutor.java:278)
        at
org.apache.maven.lifecycle.DefaultLifecycleExecutor.execute(DefaultLi
fecycleExecutor.java:143)
        at org.apache.maven.DefaultMaven.doExecute(DefaultMaven.java:333)
        at org.apache.maven.DefaultMaven.execute(DefaultMaven.java:126)
        at org.apache.maven.cli.MavenCli.main(MavenCli.java:282)
        at sun.reflect.NativeMethodAccessorImpl.invoke0(Native Method)
        at
sun.reflect.NativeMethodAccessorImpl.invoke(NativeMethodAccessorImpl.
java:39)
        at
sun.reflect.DelegatingMethodAccessorImpl.invoke(DelegatingMethodAcces
sorImpl.java:25)
        at java.lang.reflect.Method.invoke(Method.java:585)
        at
org.codehaus.classworlds.Launcher.launchEnhanced(Launcher.java:315)
        at org.codehaus.classworlds.Launcher.launch(Launcher.java:255)
        at
org.codehaus.classworlds.Launcher.mainWithExitCode(Launcher.java:430)

        at org.codehaus.classworlds.Launcher.main(Launcher.java:375)
Caused by: org.apache.maven.plugin.MojoFailureException: There are test
failures
.
        at
org.apache.maven.plugin.surefire.SurefirePlugin.execute(SurefirePlugi
n.java:425)
        at
org.apache.maven.plugin.DefaultPluginManager.executeMojo(DefaultPlugi
nManager.java:447)
        at
org.apache.maven.lifecycle.DefaultLifecycleExecutor.executeGoals(Defa
ultLifecycleExecutor.java:539)
        ... 16 more
[INFO]
------------------------------------------------------------------------
[INFO] Total time: 15 seconds
[INFO] Finished at: Thu Apr 03 01:23:23 PDT 2008
[INFO] Final Memory: 7M/13M
[INFO]
------------------------------------------------------------------------

On Wed, Apr 2, 2008 at 1:15 PM, Raymond Feng <en...@gmail.com> wrote:

> Hi, Ant.
>
> I had to fix TUSCANY-2187 which broke the build on Windows with SUN JDK
> 1.5.x. The commit is r644071.
>
> Thanks,
> Raymond
>
> --------------------------------------------------
> From: "ant elder" <an...@apache.org>
> Sent: Wednesday, April 02, 2008 2:12 AM
> To: <tu...@ws.apache.org>
> Subject: Re: [VOTE] SDO 1.1 rc3 release
>
>  A new SDO 1.1 RC4 is available at
> > http://people.apache.org/~antelder/tuscany/sdo/1.1-rc4<http://people.apache.org/%7Eantelder/tuscany/sdo/1.1-rc4>,
> > could anyone do a
> > quick sanity check review before I call a release vote on this?
> >
> >  ...ant
> >
> > On Wed, Apr 2, 2008 at 8:32 AM, ant elder <an...@apache.org> wrote:
> >
> >  Thats excellent Adriano. I'll go merge this into the 1.1 branch and
> > > respin
> > > an RC now.
> > >
> > >   ...ant
> > >
> > >
> > > On Tue, Apr 1, 2008 at 1:18 AM, Adriano Crestani <
> > > adrianocrestani@apache.org> wrote:
> > >
> > > > Hi Ant,
> > > >
> > > > The bug is fixed on revision 643224 ; )
> > > >
> > > > Adriano Crestani
> > > >
> > > > On Mon, Mar 31, 2008 at 8:56 AM, ant elder <an...@gmail.com>
> > > wrote:
> > > >
> > > > >
> > > > >
> > > > > On Sun, Mar 30, 2008 at 7:53 AM, Adriano Crestani <
> > > > > adrianocrestani@apache.org> wrote:
> > > > >
> > > > > > Adriano, you've assigned TUSCANY-1659 to yourself so does that
> > > mean
> > > > > > you're
> > > > > > working on a fix (which would be great!)? Anyone have any
> > > pointers
> > > > to
> > > > > > help
> > > > > > fix it? The jira has been open for over 6 months already so is
> > > > anyone
> > > > > > actually saying its a blocker for this 1.1 release?
> > > > > >
> > > > > > Yes, I'm trying to fix it : ). And I think it's not a blocker, >
> > > > > cause
> > > > > > it's not so relevant, since it blocks only in few cases that are
> > > > > > env-dependent. So, for me it's ok if we add this fix only on
> > > next
> > > > release.
> > > > > >
> > > > >
> > > > > Does that email from Frank over on the SDO Date Format thread get
> > > you
> > > > > closer? I'm still happy hold of the repsin if you think you're
> > > likely
> > > > to get
> > > > > a fix for this done soon.
> > > > >
> > > > >    ...ant
> > > > >
> > > >
> > >
> > >
> > >
> >
> ---------------------------------------------------------------------
> To unsubscribe, e-mail: tuscany-dev-unsubscribe@ws.apache.org
> For additional commands, e-mail: tuscany-dev-help@ws.apache.org
>
>

Re: [VOTE] SDO 1.1 rc3 release

Posted by Raymond Feng <en...@gmail.com>.
Hi, Ant.

I had to fix TUSCANY-2187 which broke the build on Windows with SUN JDK 
1.5.x. The commit is r644071.

Thanks,
Raymond

--------------------------------------------------
From: "ant elder" <an...@apache.org>
Sent: Wednesday, April 02, 2008 2:12 AM
To: <tu...@ws.apache.org>
Subject: Re: [VOTE] SDO 1.1 rc3 release

> A new SDO 1.1 RC4 is available at
> http://people.apache.org/~antelder/tuscany/sdo/1.1-rc4, could anyone do a
> quick sanity check review before I call a release vote on this?
>
>   ...ant
>
> On Wed, Apr 2, 2008 at 8:32 AM, ant elder <an...@apache.org> wrote:
>
>> Thats excellent Adriano. I'll go merge this into the 1.1 branch and 
>> respin
>> an RC now.
>>
>>    ...ant
>>
>>
>> On Tue, Apr 1, 2008 at 1:18 AM, Adriano Crestani <
>> adrianocrestani@apache.org> wrote:
>>
>> > Hi Ant,
>> >
>> > The bug is fixed on revision 643224 ; )
>> >
>> > Adriano Crestani
>> >
>> > On Mon, Mar 31, 2008 at 8:56 AM, ant elder <an...@gmail.com> wrote:
>> >
>> > >
>> > >
>> > > On Sun, Mar 30, 2008 at 7:53 AM, Adriano Crestani <
>> > > adrianocrestani@apache.org> wrote:
>> > >
>> > > > Adriano, you've assigned TUSCANY-1659 to yourself so does that mean
>> > > > you're
>> > > > working on a fix (which would be great!)? Anyone have any pointers
>> > to
>> > > > help
>> > > > fix it? The jira has been open for over 6 months already so is
>> > anyone
>> > > > actually saying its a blocker for this 1.1 release?
>> > > >
>> > > > Yes, I'm trying to fix it : ). And I think it's not a blocker, 
>> > > > cause
>> > > > it's not so relevant, since it blocks only in few cases that are
>> > > > env-dependent. So, for me it's ok if we add this fix only on next
>> > release.
>> > > >
>> > >
>> > > Does that email from Frank over on the SDO Date Format thread get you
>> > > closer? I'm still happy hold of the repsin if you think you're likely
>> > to get
>> > > a fix for this done soon.
>> > >
>> > >    ...ant
>> > >
>> >
>>
>>
> 

---------------------------------------------------------------------
To unsubscribe, e-mail: tuscany-dev-unsubscribe@ws.apache.org
For additional commands, e-mail: tuscany-dev-help@ws.apache.org


Re: [VOTE] SDO 1.1 rc3 release

Posted by ant elder <an...@apache.org>.
A new SDO 1.1 RC4 is available at
http://people.apache.org/~antelder/tuscany/sdo/1.1-rc4, could anyone do a
quick sanity check review before I call a release vote on this?

   ...ant

On Wed, Apr 2, 2008 at 8:32 AM, ant elder <an...@apache.org> wrote:

> Thats excellent Adriano. I'll go merge this into the 1.1 branch and respin
> an RC now.
>
>    ...ant
>
>
> On Tue, Apr 1, 2008 at 1:18 AM, Adriano Crestani <
> adrianocrestani@apache.org> wrote:
>
> > Hi Ant,
> >
> > The bug is fixed on revision 643224 ; )
> >
> > Adriano Crestani
> >
> > On Mon, Mar 31, 2008 at 8:56 AM, ant elder <an...@gmail.com> wrote:
> >
> > >
> > >
> > > On Sun, Mar 30, 2008 at 7:53 AM, Adriano Crestani <
> > > adrianocrestani@apache.org> wrote:
> > >
> > > > Adriano, you've assigned TUSCANY-1659 to yourself so does that mean
> > > > you're
> > > > working on a fix (which would be great!)? Anyone have any pointers
> > to
> > > > help
> > > > fix it? The jira has been open for over 6 months already so is
> > anyone
> > > > actually saying its a blocker for this 1.1 release?
> > > >
> > > > Yes, I'm trying to fix it : ). And I think it's not a blocker, cause
> > > > it's not so relevant, since it blocks only in few cases that are
> > > > env-dependent. So, for me it's ok if we add this fix only on next
> > release.
> > > >
> > >
> > > Does that email from Frank over on the SDO Date Format thread get you
> > > closer? I'm still happy hold of the repsin if you think you're likely
> > to get
> > > a fix for this done soon.
> > >
> > >    ...ant
> > >
> >
>
>

Re: [VOTE] SDO 1.1 rc3 release

Posted by ant elder <an...@apache.org>.
Thats excellent Adriano. I'll go merge this into the 1.1 branch and respin
an RC now.

   ...ant

On Tue, Apr 1, 2008 at 1:18 AM, Adriano Crestani <ad...@apache.org>
wrote:

> Hi Ant,
>
> The bug is fixed on revision 643224 ; )
>
> Adriano Crestani
>
> On Mon, Mar 31, 2008 at 8:56 AM, ant elder <an...@gmail.com> wrote:
>
> >
> >
> > On Sun, Mar 30, 2008 at 7:53 AM, Adriano Crestani <
> > adrianocrestani@apache.org> wrote:
> >
> > > Adriano, you've assigned TUSCANY-1659 to yourself so does that mean
> > > you're
> > > working on a fix (which would be great!)? Anyone have any pointers to
> > > help
> > > fix it? The jira has been open for over 6 months already so is anyone
> > > actually saying its a blocker for this 1.1 release?
> > >
> > > Yes, I'm trying to fix it : ). And I think it's not a blocker, cause
> > > it's not so relevant, since it blocks only in few cases that are
> > > env-dependent. So, for me it's ok if we add this fix only on next
> release.
> > >
> >
> > Does that email from Frank over on the SDO Date Format thread get you
> > closer? I'm still happy hold of the repsin if you think you're likely to
> get
> > a fix for this done soon.
> >
> >    ...ant
> >
>