You are viewing a plain text version of this content. The canonical link for it is here.
Posted to commits@myfaces.apache.org by Apache Jenkins Server <je...@builds.apache.org> on 2014/06/01 20:14:49 UTC
Build failed in Jenkins: myfaces-current12 #1163
See <https://builds.apache.org/job/myfaces-current12/1163/>
------------------------------------------
[...truncated 1520 lines...]
Jun 1, 2014 11:13:53 AM javax.faces.component.UIComponentBase getClientId
WARNING: WARNING: Component j_id0 just got an automatic id, because there was no id assigned yet. If this component was created dynamically (i.e. not by a JSP tag) you should assign it an explicit static id or assign it the id you get from the createUniqueId from the current UIViewRoot component right after creation! Path to Component: {Component-Path : [Class: javax.faces.component.html.HtmlInputText,Id: j_id0]}
Jun 1, 2014 11:13:53 AM org.apache.myfaces.webapp.AbstractFacesInitializer initFaces
SEVERE: An error occured while initializing MyFaces: null
java.lang.NullPointerException
at org.apache.myfaces.shared_impl.webapp.webxml.WebXml.getWebXml(WebXml.java:225)
at org.apache.myfaces.webapp.AbstractFacesInitializer.initFaces(AbstractFacesInitializer.java:80)
at org.apache.myfaces.webapp.Jsp21FacesInitializerTest.testInitFaces(Jsp21FacesInitializerTest.java:91)
at sun.reflect.NativeMethodAccessorImpl.invoke0(Native Method)
at sun.reflect.NativeMethodAccessorImpl.invoke(NativeMethodAccessorImpl.java:39)
at sun.reflect.DelegatingMethodAccessorImpl.invoke(DelegatingMethodAccessorImpl.java:25)
at java.lang.reflect.Method.invoke(Method.java:597)
at org.testng.internal.MethodHelper.invokeMethod(MethodHelper.java:552)
at org.testng.internal.Invoker.invokeMethod(Invoker.java:411)
at org.testng.internal.Invoker.invokeTestMethods(Invoker.java:785)
at org.testng.internal.TestMethodWorker.run(TestMethodWorker.java:114)
at org.testng.TestRunner.privateRun(TestRunner.java:693)
at org.testng.TestRunner.run(TestRunner.java:574)
at org.testng.SuiteRunner.privateRun(SuiteRunner.java:241)
at org.testng.SuiteRunner.run(SuiteRunner.java:145)
at org.testng.TestNG.createAndRunSuiteRunners(TestNG.java:901)
at org.testng.TestNG.runSuitesLocally(TestNG.java:863)
at org.testng.TestNG.run(TestNG.java:613)
at org.apache.maven.surefire.testng.TestNGExecutor.run(TestNGExecutor.java:62)
at org.apache.maven.surefire.testng.TestNGDirectoryTestSuite.execute(TestNGDirectoryTestSuite.java:155)
at org.apache.maven.surefire.Surefire.run(Surefire.java:180)
at sun.reflect.NativeMethodAccessorImpl.invoke0(Native Method)
at sun.reflect.NativeMethodAccessorImpl.invoke(NativeMethodAccessorImpl.java:39)
at sun.reflect.DelegatingMethodAccessorImpl.invoke(DelegatingMethodAccessorImpl.java:25)
at java.lang.reflect.Method.invoke(Method.java:597)
at org.apache.maven.surefire.booter.SurefireBooter.runSuitesInProcess(SurefireBooter.java:350)
at org.apache.maven.surefire.booter.SurefireBooter.main(SurefireBooter.java:1021)
Tests run: 143, Failures: 0, Errors: 0, Skipped: 0, Time elapsed: 5.383 sec
Results :
Tests run: 143, Failures: 0, Errors: 0, Skipped: 0
[JENKINS] Recording test results
[INFO]
[INFO] --- maven-jar-plugin:2.2:jar (default-jar) @ myfaces-impl ---
[INFO] Building jar: F:\jenkins\jenkins-slave\workspace\myfaces-current12\current12\core\impl\target\myfaces-impl-1.2.13-SNAPSHOT.jar
[INFO]
[INFO] --- maven-site-plugin:3.0:attach-descriptor (attach-descriptor) @ myfaces-impl ---
[INFO]
[INFO] >>> maven-source-plugin:2.0.4:jar (attach-source) @ myfaces-impl >>>
[INFO]
[INFO] --- myfaces-builder-plugin:1.0.8:build-metadata (makemyfacesmetadata) @ myfaces-impl ---
Artifact: myfaces-api-1.2.13-SNAPSHOT.jar have META-INF/myfaces-metadata.xml
[INFO]
[INFO] --- myfaces-builder-plugin:1.0.8:make-config (makefacesconfig) @ myfaces-impl ---
[WARNING] *******************************************************************
[WARNING] RuntimeInstance initializing.
[WARNING] Default ResourceManager initializing. (class org.apache.velocity.runtime.resource.ResourceManagerImpl)
[WARNING] FileResourceLoader : initialization starting.
[WARNING] FileResourceLoader : initialization complete.
[WARNING] RelativeClasspathResourceLoader : initialization complete.
[INFO] RelativeClasspathResourceLoader : adding path 'META-INF'
[WARNING] RelativeClasspathResourceLoader : initialization complete.
[WARNING] Default ResourceManager initialization complete.
[WARNING] Velocimacro : initialization starting.
[WARNING] Velocimacro : VM library registration complete.
[WARNING] Velocimacro : Velocimacro : initialization complete.
[WARNING] RuntimeInstance successfully initialized.
[INFO] using base content file: F:\jenkins\jenkins-slave\workspace\myfaces-current12\current12\core\impl\src\main\conf\META-INF\standard-faces-config-base.xml
[INFO]
[INFO] --- myfaces-builder-plugin:1.0.8:make-tags (make_tags) @ myfaces-impl ---
[INFO] Using template from file loader: F:\jenkins\jenkins-slave\workspace\myfaces-current12\current12\core\impl\src\main\resources\META-INF\tagClass12.vm
[WARNING] *******************************************************************
[WARNING] RuntimeInstance initializing.
[WARNING] Default ResourceManager initializing. (class org.apache.velocity.runtime.resource.ResourceManagerImpl)
[WARNING] FileResourceLoader : initialization starting.
[WARNING] FileResourceLoader : initialization complete.
[WARNING] RelativeClasspathResourceLoader : initialization complete.
[INFO] RelativeClasspathResourceLoader : adding path 'META-INF'
[WARNING] RelativeClasspathResourceLoader : initialization complete.
[WARNING] Default ResourceManager initialization complete.
[WARNING] Velocimacro : initialization starting.
[WARNING] Velocimacro : VM library registration complete.
[WARNING] Velocimacro : Velocimacro : initialization complete.
[WARNING] RuntimeInstance successfully initialized.
[INFO] Generating tag class:org.apache.myfaces.taglib.html.HtmlInputHiddenTag
[INFO] Generating tag class:org.apache.myfaces.taglib.html.HtmlColumnTag
[INFO] Generating tag class:org.apache.myfaces.taglib.html.HtmlCommandButtonTag
[INFO] Generating tag class:org.apache.myfaces.taglib.html.HtmlCommandLinkTag
[INFO] Generating tag class:org.apache.myfaces.taglib.html.HtmlDataTableTag
[INFO] Generating tag class:org.apache.myfaces.taglib.html.HtmlFormTag
[INFO] Generating tag class:org.apache.myfaces.taglib.html.HtmlGraphicImageTag
[INFO] Generating tag class:org.apache.myfaces.taglib.html.HtmlInputSecretTag
[INFO] Generating tag class:org.apache.myfaces.taglib.html.HtmlInputTextTag
[INFO] Generating tag class:org.apache.myfaces.taglib.html.HtmlInputTextareaTag
[INFO] Generating tag class:org.apache.myfaces.taglib.html.HtmlMessageTag
[INFO] Generating tag class:org.apache.myfaces.taglib.html.HtmlMessagesTag
[INFO] Generating tag class:org.apache.myfaces.taglib.html.HtmlOutputFormatTag
[INFO] Generating tag class:org.apache.myfaces.taglib.html.HtmlOutputLabelTag
[INFO] Generating tag class:org.apache.myfaces.taglib.html.HtmlOutputLinkTag
[INFO] Generating tag class:org.apache.myfaces.taglib.html.HtmlOutputTextTag
[INFO] Generating tag class:org.apache.myfaces.taglib.html.HtmlPanelGridTag
[INFO] Generating tag class:org.apache.myfaces.taglib.html.HtmlPanelGroupTag
[INFO] Generating tag class:org.apache.myfaces.taglib.html.HtmlSelectBooleanCheckboxTag
[INFO] Generating tag class:org.apache.myfaces.taglib.html.HtmlSelectManyCheckboxTag
[INFO] Generating tag class:org.apache.myfaces.taglib.html.HtmlSelectManyListboxTag
[INFO] Generating tag class:org.apache.myfaces.taglib.html.HtmlSelectManyMenuTag
[INFO] Generating tag class:org.apache.myfaces.taglib.html.HtmlSelectOneListboxTag
[INFO] Generating tag class:org.apache.myfaces.taglib.html.HtmlSelectOneMenuTag
[INFO] Generating tag class:org.apache.myfaces.taglib.html.HtmlSelectOneRadioTag
[INFO]
[INFO] --- myfaces-builder-plugin:1.0.8:make-config (makecoretld) @ myfaces-impl ---
[WARNING] *******************************************************************
[WARNING] RuntimeInstance initializing.
[WARNING] Default ResourceManager initializing. (class org.apache.velocity.runtime.resource.ResourceManagerImpl)
[WARNING] FileResourceLoader : initialization starting.
[WARNING] FileResourceLoader : initialization complete.
[WARNING] RelativeClasspathResourceLoader : initialization complete.
[INFO] RelativeClasspathResourceLoader : adding path 'META-INF'
[WARNING] RelativeClasspathResourceLoader : initialization complete.
[WARNING] Default ResourceManager initialization complete.
[WARNING] Velocimacro : initialization starting.
[WARNING] Velocimacro : VM library registration complete.
[WARNING] Velocimacro : Velocimacro : initialization complete.
[WARNING] RuntimeInstance successfully initialized.
[INFO] using base content file: F:\jenkins\jenkins-slave\workspace\myfaces-current12\current12\core\impl\src\main\conf\META-INF\myfaces_core-base.tld
[INFO]
[INFO] --- myfaces-builder-plugin:1.0.8:make-config (makehtmltld) @ myfaces-impl ---
[WARNING] *******************************************************************
[WARNING] RuntimeInstance initializing.
[WARNING] Default ResourceManager initializing. (class org.apache.velocity.runtime.resource.ResourceManagerImpl)
[WARNING] FileResourceLoader : initialization starting.
[WARNING] FileResourceLoader : initialization complete.
[WARNING] RelativeClasspathResourceLoader : initialization complete.
[INFO] RelativeClasspathResourceLoader : adding path 'META-INF'
[WARNING] RelativeClasspathResourceLoader : initialization complete.
[WARNING] Default ResourceManager initialization complete.
[WARNING] Velocimacro : initialization starting.
[WARNING] Velocimacro : VM library registration complete.
[WARNING] Velocimacro : Velocimacro : initialization complete.
[WARNING] RuntimeInstance successfully initialized.
[INFO] using base content file: F:\jenkins\jenkins-slave\workspace\myfaces-current12\current12\core\impl\src\main\conf\META-INF\myfaces_html-base.tld
[WARNING] Failed to getClass for org.apache.maven.plugin.source.SourceJarMojo
[INFO]
[INFO] <<< maven-source-plugin:2.0.4:jar (attach-source) @ myfaces-impl <<<
[INFO]
[INFO] --- maven-source-plugin:2.0.4:jar (attach-source) @ myfaces-impl ---
[INFO] Building jar: F:\jenkins\jenkins-slave\workspace\myfaces-current12\current12\core\impl\target\myfaces-impl-1.2.13-SNAPSHOT-sources.jar
[INFO]
[INFO] --- maven-checkstyle-plugin:2.6:check (verify-style) @ myfaces-impl ---
[INFO]
[INFO]
[INFO] --- maven-install-plugin:2.3.1:install (default-install) @ myfaces-impl ---
[INFO] Installing F:\jenkins\jenkins-slave\workspace\myfaces-current12\current12\core\impl\target\myfaces-impl-1.2.13-SNAPSHOT.jar to f:\jenkins\jenkins-slave\maven-repositories\0\org\apache\myfaces\core\myfaces-impl\1.2.13-SNAPSHOT\myfaces-impl-1.2.13-SNAPSHOT.jar
[INFO] Installing F:\jenkins\jenkins-slave\workspace\myfaces-current12\current12\core\impl\pom.xml to f:\jenkins\jenkins-slave\maven-repositories\0\org\apache\myfaces\core\myfaces-impl\1.2.13-SNAPSHOT\myfaces-impl-1.2.13-SNAPSHOT.pom
[INFO] Installing F:\jenkins\jenkins-slave\workspace\myfaces-current12\current12\core\impl\target\myfaces-impl-1.2.13-SNAPSHOT-sources.jar to f:\jenkins\jenkins-slave\maven-repositories\0\org\apache\myfaces\core\myfaces-impl\1.2.13-SNAPSHOT\myfaces-impl-1.2.13-SNAPSHOT-sources.jar
[INFO]
[INFO] ------------------------------------------------------------------------
[INFO] Building Build Project 1.2.10-SNAPSHOT
[INFO] ------------------------------------------------------------------------
[INFO]
[INFO] --- maven-remote-resources-plugin:1.1:process (default) @ myfaces-base ---
[INFO] Setting property: classpath.resource.loader.class => 'org.codehaus.plexus.velocity.ContextClassLoaderResourceLoader'.
[INFO] Setting property: velocimacro.messages.on => 'false'.
[INFO] Setting property: resource.loader => 'classpath'.
[INFO] Setting property: resource.manager.logwhenfound => 'false'.
[INFO]
[INFO] --- maven-install-plugin:2.3:install (default-install) @ myfaces-base ---
[INFO] Installing <https://builds.apache.org/job/myfaces-current12/ws/current12\pom.xml> to f:\jenkins\jenkins-slave\maven-repositories\0\org\apache\myfaces\myfaces-base\1.2.10-SNAPSHOT\myfaces-base-1.2.10-SNAPSHOT.pom
[INFO] ------------------------------------------------------------------------
[INFO] Reactor Summary:
[INFO]
[INFO] Apache MyFaces Shared For JSF 1.2 - Project ....... SUCCESS [15.792s]
[INFO] Apache MyFaces Shared For JSF 1.2 - Core .......... SUCCESS [23.711s]
[INFO] MyFaces Shared Impl ............................... SUCCESS [17.011s]
[INFO] MyFaces Shared Tomahawk ........................... SUCCESS [17.482s]
[INFO] Apache MyFaces JSF-1.2 Core Project ............... SUCCESS [5.670s]
[INFO] Apache Myfaces JSF Core-1.2 API ................... SUCCESS [54.038s]
[INFO] Apache MyFaces JSF-1.2 Core Impl .................. SUCCESS [53.093s]
[INFO] Build Project ..................................... SUCCESS [4.313s]
[INFO] ------------------------------------------------------------------------
[INFO] BUILD SUCCESS
[INFO] ------------------------------------------------------------------------
[INFO] Total time: 3:18.854s
[INFO] Finished at: Sun Jun 01 11:14:10 PDT 2014
[INFO] Final Memory: 54M/129M
[INFO] ------------------------------------------------------------------------
Waiting for Jenkins to finish collecting data
[JENKINS] Archiving F:\jenkins\jenkins-slave\workspace\myfaces-current12\current12\shared\shared-tomahawk\pom.xml to org.apache.myfaces.shared/myfaces-shared-tomahawk/3.0.13-SNAPSHOT/myfaces-shared-tomahawk-3.0.13-SNAPSHOT.pom
[JENKINS] Archiving F:\jenkins\jenkins-slave\workspace\myfaces-current12\current12\shared\shared-tomahawk\target\myfaces-shared-tomahawk-3.0.13-SNAPSHOT.jar to org.apache.myfaces.shared/myfaces-shared-tomahawk/3.0.13-SNAPSHOT/myfaces-shared-tomahawk-3.0.13-SNAPSHOT.jar
[JENKINS] Archiving F:\jenkins\jenkins-slave\workspace\myfaces-current12\current12\shared\shared-tomahawk\target\myfaces-shared-tomahawk-3.0.13-SNAPSHOT-sources.jar to org.apache.myfaces.shared/myfaces-shared-tomahawk/3.0.13-SNAPSHOT/myfaces-shared-tomahawk-3.0.13-SNAPSHOT-sources.jar
[JENKINS] Archiving F:\jenkins\jenkins-slave\workspace\myfaces-current12\current12\core\impl\pom.xml to org.apache.myfaces.core/myfaces-impl/1.2.13-SNAPSHOT/myfaces-impl-1.2.13-SNAPSHOT.pom
[JENKINS] Archiving F:\jenkins\jenkins-slave\workspace\myfaces-current12\current12\core\impl\target\myfaces-impl-1.2.13-SNAPSHOT.jar to org.apache.myfaces.core/myfaces-impl/1.2.13-SNAPSHOT/myfaces-impl-1.2.13-SNAPSHOT.jar
[JENKINS] Archiving F:\jenkins\jenkins-slave\workspace\myfaces-current12\current12\core\impl\target\myfaces-impl-1.2.13-SNAPSHOT-sources.jar to org.apache.myfaces.core/myfaces-impl/1.2.13-SNAPSHOT/myfaces-impl-1.2.13-SNAPSHOT-sources.jar
[JENKINS] Archiving F:\jenkins\jenkins-slave\workspace\myfaces-current12\current12\shared\shared-impl\pom.xml to org.apache.myfaces.shared/myfaces-shared-impl/3.0.13-SNAPSHOT/myfaces-shared-impl-3.0.13-SNAPSHOT.pom
[JENKINS] Archiving F:\jenkins\jenkins-slave\workspace\myfaces-current12\current12\shared\shared-impl\target\myfaces-shared-impl-3.0.13-SNAPSHOT.jar to org.apache.myfaces.shared/myfaces-shared-impl/3.0.13-SNAPSHOT/myfaces-shared-impl-3.0.13-SNAPSHOT.jar
[JENKINS] Archiving F:\jenkins\jenkins-slave\workspace\myfaces-current12\current12\shared\shared-impl\target\myfaces-shared-impl-3.0.13-SNAPSHOT-sources.jar to org.apache.myfaces.shared/myfaces-shared-impl/3.0.13-SNAPSHOT/myfaces-shared-impl-3.0.13-SNAPSHOT-sources.jar
[JENKINS] Archiving F:\jenkins\jenkins-slave\workspace\myfaces-current12\current12\shared\core\pom.xml to org.apache.myfaces.shared/myfaces-shared-core/3.0.13-SNAPSHOT/myfaces-shared-core-3.0.13-SNAPSHOT.pom
[JENKINS] Archiving F:\jenkins\jenkins-slave\workspace\myfaces-current12\current12\shared\core\target\myfaces-shared-core-3.0.13-SNAPSHOT.jar to org.apache.myfaces.shared/myfaces-shared-core/3.0.13-SNAPSHOT/myfaces-shared-core-3.0.13-SNAPSHOT.jar
[JENKINS] Archiving F:\jenkins\jenkins-slave\workspace\myfaces-current12\current12\shared\core\target\myfaces-shared-core-3.0.13-SNAPSHOT-sources.jar to org.apache.myfaces.shared/myfaces-shared-core/3.0.13-SNAPSHOT/myfaces-shared-core-3.0.13-SNAPSHOT-sources.jar
[JENKINS] Archiving F:\jenkins\jenkins-slave\workspace\myfaces-current12\current12\core\api\pom.xml to org.apache.myfaces.core/myfaces-api/1.2.13-SNAPSHOT/myfaces-api-1.2.13-SNAPSHOT.pom
[JENKINS] Archiving F:\jenkins\jenkins-slave\workspace\myfaces-current12\current12\core\api\target\myfaces-api-1.2.13-SNAPSHOT.jar to org.apache.myfaces.core/myfaces-api/1.2.13-SNAPSHOT/myfaces-api-1.2.13-SNAPSHOT.jar
[JENKINS] Archiving F:\jenkins\jenkins-slave\workspace\myfaces-current12\current12\core\api\target\myfaces-api-1.2.13-SNAPSHOT-sources.jar to org.apache.myfaces.core/myfaces-api/1.2.13-SNAPSHOT/myfaces-api-1.2.13-SNAPSHOT-sources.jar
[JENKINS] Archiving F:\jenkins\jenkins-slave\workspace\myfaces-current12\current12\core\api\target\myfaces-api-1.2.13-SNAPSHOT-tests.jar to org.apache.myfaces.core/myfaces-api/1.2.13-SNAPSHOT/myfaces-api-1.2.13-SNAPSHOT-tests.jar
[JENKINS] Archiving F:\jenkins\jenkins-slave\workspace\myfaces-current12\current12\shared\pom.xml to org.apache.myfaces.shared/myfaces-shared-project/3.0.13-SNAPSHOT/myfaces-shared-project-3.0.13-SNAPSHOT.pom
[JENKINS] Archiving F:\jenkins\jenkins-slave\workspace\myfaces-current12\current12\shared\target\myfaces-shared-project-3.0.13-SNAPSHOT-site.xml to org.apache.myfaces.shared/myfaces-shared-project/3.0.13-SNAPSHOT/myfaces-shared-project-3.0.13-SNAPSHOT-site.xml
[JENKINS] Archiving F:\jenkins\jenkins-slave\workspace\myfaces-current12\current12\core\pom.xml to org.apache.myfaces.core/myfaces-core-project/1.2.13-SNAPSHOT/myfaces-core-project-1.2.13-SNAPSHOT.pom
[JENKINS] Archiving F:\jenkins\jenkins-slave\workspace\myfaces-current12\current12\core\target\myfaces-core-project-1.2.13-SNAPSHOT-site.xml to org.apache.myfaces.core/myfaces-core-project/1.2.13-SNAPSHOT/myfaces-core-project-1.2.13-SNAPSHOT-site.xml
[JENKINS] Archiving <https://builds.apache.org/job/myfaces-current12/ws/current12\pom.xml> to org.apache.myfaces/myfaces-base/1.2.10-SNAPSHOT/myfaces-base-1.2.10-SNAPSHOT.pom
channel stopped
Maven RedeployPublisher use remote windows2 maven settings from : f:\jenkins\tools\maven\latest/conf/settings.xml
[ERROR] uniqueVersion == false is not anymore supported in maven 3
[INFO] Deployment in https://repository.apache.org/content/repositories/snapshots (id=apache.snapshots.https,uniqueVersion=false)
Deploying the main artifact jenkins-372530146512581228myfaces-base-1.2.10-SNAPSHOT.pom
Downloading: https://repository.apache.org/content/repositories/snapshots/org/apache/myfaces/myfaces-base/1.2.10-SNAPSHOT/maven-metadata.xml
Downloaded: https://repository.apache.org/content/repositories/snapshots/org/apache/myfaces/myfaces-base/1.2.10-SNAPSHOT/maven-metadata.xml (568 B at 5.5 KB/sec)
Uploading: https://repository.apache.org/content/repositories/snapshots/org/apache/myfaces/myfaces-base/1.2.10-SNAPSHOT/myfaces-base-1.2.10-20140601.181438-557.pom
ERROR: Failed to deploy artifacts: Could not transfer artifact org.apache.myfaces:myfaces-base:pom:1.2.10-20140601.181438-557 from/to apache.snapshots.https (https://repository.apache.org/content/repositories/snapshots): Failed to transfer file: https://repository.apache.org/content/repositories/snapshots/org/apache/myfaces/myfaces-base/1.2.10-SNAPSHOT/myfaces-base-1.2.10-20140601.181438-557.pom. Return code is: 401, ReasonPhrase: Unauthorized.
org.apache.maven.artifact.deployer.ArtifactDeploymentException: Failed to deploy artifacts: Could not transfer artifact org.apache.myfaces:myfaces-base:pom:1.2.10-20140601.181438-557 from/to apache.snapshots.https (https://repository.apache.org/content/repositories/snapshots): Failed to transfer file: https://repository.apache.org/content/repositories/snapshots/org/apache/myfaces/myfaces-base/1.2.10-SNAPSHOT/myfaces-base-1.2.10-20140601.181438-557.pom. Return code is: 401, ReasonPhrase: Unauthorized.
at org.apache.maven.artifact.deployer.DefaultArtifactDeployer.deploy(DefaultArtifactDeployer.java:143)
at hudson.maven.reporters.MavenArtifactRecord.deploy(MavenArtifactRecord.java:191)
at hudson.maven.RedeployPublisher.perform(RedeployPublisher.java:176)
at hudson.tasks.BuildStepMonitor$1.perform(BuildStepMonitor.java:20)
at hudson.model.AbstractBuild$AbstractBuildExecution.perform(AbstractBuild.java:804)
at hudson.model.AbstractBuild$AbstractBuildExecution.performAllBuildSteps(AbstractBuild.java:776)
at hudson.maven.MavenModuleSetBuild$MavenModuleSetBuildExecution.post2(MavenModuleSetBuild.java:1030)
at hudson.model.AbstractBuild$AbstractBuildExecution.post(AbstractBuild.java:725)
at hudson.model.Run.execute(Run.java:1701)
at hudson.maven.MavenModuleSetBuild.run(MavenModuleSetBuild.java:519)
at hudson.model.ResourceController.execute(ResourceController.java:88)
at hudson.model.Executor.run(Executor.java:231)
Caused by: org.eclipse.aether.deployment.DeploymentException: Failed to deploy artifacts: Could not transfer artifact org.apache.myfaces:myfaces-base:pom:1.2.10-20140601.181438-557 from/to apache.snapshots.https (https://repository.apache.org/content/repositories/snapshots): Failed to transfer file: https://repository.apache.org/content/repositories/snapshots/org/apache/myfaces/myfaces-base/1.2.10-SNAPSHOT/myfaces-base-1.2.10-20140601.181438-557.pom. Return code is: 401, ReasonPhrase: Unauthorized.
at org.eclipse.aether.internal.impl.DefaultDeployer.deploy(DefaultDeployer.java:341)
at org.eclipse.aether.internal.impl.DefaultDeployer.deploy(DefaultDeployer.java:269)
at org.eclipse.aether.internal.impl.DefaultRepositorySystem.deploy(DefaultRepositorySystem.java:413)
at org.apache.maven.artifact.deployer.DefaultArtifactDeployer.deploy(DefaultArtifactDeployer.java:139)
... 11 more
Caused by: org.eclipse.aether.transfer.ArtifactTransferException: Could not transfer artifact org.apache.myfaces:myfaces-base:pom:1.2.10-20140601.181438-557 from/to apache.snapshots.https (https://repository.apache.org/content/repositories/snapshots): Failed to transfer file: https://repository.apache.org/content/repositories/snapshots/org/apache/myfaces/myfaces-base/1.2.10-SNAPSHOT/myfaces-base-1.2.10-20140601.181438-557.pom. Return code is: 401, ReasonPhrase: Unauthorized.
at org.eclipse.aether.connector.wagon.WagonRepositoryConnector$6.wrap(WagonRepositoryConnector.java:1016)
at org.eclipse.aether.connector.wagon.WagonRepositoryConnector$6.wrap(WagonRepositoryConnector.java:1004)
at org.eclipse.aether.connector.wagon.WagonRepositoryConnector$PutTask.run(WagonRepositoryConnector.java:895)
at org.eclipse.aether.connector.wagon.WagonRepositoryConnector.put(WagonRepositoryConnector.java:522)
at org.eclipse.aether.internal.impl.DefaultDeployer.deploy(DefaultDeployer.java:335)
... 14 more
Caused by: org.apache.maven.wagon.TransferFailedException: Failed to transfer file: https://repository.apache.org/content/repositories/snapshots/org/apache/myfaces/myfaces-base/1.2.10-SNAPSHOT/myfaces-base-1.2.10-20140601.181438-557.pom. Return code is: 401, ReasonPhrase: Unauthorized.
at org.apache.maven.wagon.shared.http4.AbstractHttpClientWagon.put(AbstractHttpClientWagon.java:626)
at org.apache.maven.wagon.shared.http4.AbstractHttpClientWagon.put(AbstractHttpClientWagon.java:524)
at org.apache.maven.wagon.shared.http4.AbstractHttpClientWagon.put(AbstractHttpClientWagon.java:505)
at org.apache.maven.wagon.shared.http4.AbstractHttpClientWagon.put(AbstractHttpClientWagon.java:485)
at org.eclipse.aether.connector.wagon.WagonRepositoryConnector$PutTask.run(WagonRepositoryConnector.java:871)
... 16 more
[INFO] Deployment failed after 2.1 sec
Build step 'Deploy artifacts to Maven repository' changed build result to FAILURE
Jenkins build is back to normal : myfaces-current12 #1165
Posted by Apache Jenkins Server <je...@builds.apache.org>.
See <https://builds.apache.org/job/myfaces-current12/1165/>
Build failed in Jenkins: myfaces-current12 #1164
Posted by Apache Jenkins Server <je...@builds.apache.org>.
See <https://builds.apache.org/job/myfaces-current12/1164/>
------------------------------------------
[...truncated 1521 lines...]
WARNING: WARNING: Component j_id0 just got an automatic id, because there was no id assigned yet. If this component was created dynamically (i.e. not by a JSP tag) you should assign it an explicit static id or assign it the id you get from the createUniqueId from the current UIViewRoot component right after creation! Path to Component: {Component-Path : [Class: javax.faces.component.html.HtmlInputTextarea,Id: j_id0]}
Jun 2, 2014 5:31:30 PM javax.faces.component.UIComponentBase getClientId
WARNING: WARNING: Component j_id0 just got an automatic id, because there was no id assigned yet. If this component was created dynamically (i.e. not by a JSP tag) you should assign it an explicit static id or assign it the id you get from the createUniqueId from the current UIViewRoot component right after creation! Path to Component: {Component-Path : [Class: javax.faces.component.html.HtmlInputText,Id: j_id0]}
Jun 2, 2014 5:31:31 PM org.apache.myfaces.webapp.AbstractFacesInitializer initFaces
SEVERE: An error occured while initializing MyFaces: null
java.lang.NullPointerException
at org.apache.myfaces.shared_impl.webapp.webxml.WebXml.getWebXml(WebXml.java:225)
at org.apache.myfaces.webapp.AbstractFacesInitializer.initFaces(AbstractFacesInitializer.java:80)
at org.apache.myfaces.webapp.Jsp21FacesInitializerTest.testInitFaces(Jsp21FacesInitializerTest.java:91)
at sun.reflect.NativeMethodAccessorImpl.invoke0(Native Method)
at sun.reflect.NativeMethodAccessorImpl.invoke(NativeMethodAccessorImpl.java:39)
at sun.reflect.DelegatingMethodAccessorImpl.invoke(DelegatingMethodAccessorImpl.java:25)
at java.lang.reflect.Method.invoke(Method.java:597)
at org.testng.internal.MethodHelper.invokeMethod(MethodHelper.java:552)
at org.testng.internal.Invoker.invokeMethod(Invoker.java:411)
at org.testng.internal.Invoker.invokeTestMethods(Invoker.java:785)
at org.testng.internal.TestMethodWorker.run(TestMethodWorker.java:114)
at org.testng.TestRunner.privateRun(TestRunner.java:693)
at org.testng.TestRunner.run(TestRunner.java:574)
at org.testng.SuiteRunner.privateRun(SuiteRunner.java:241)
at org.testng.SuiteRunner.run(SuiteRunner.java:145)
at org.testng.TestNG.createAndRunSuiteRunners(TestNG.java:901)
at org.testng.TestNG.runSuitesLocally(TestNG.java:863)
at org.testng.TestNG.run(TestNG.java:613)
at org.apache.maven.surefire.testng.TestNGExecutor.run(TestNGExecutor.java:62)
at org.apache.maven.surefire.testng.TestNGDirectoryTestSuite.execute(TestNGDirectoryTestSuite.java:155)
at org.apache.maven.surefire.Surefire.run(Surefire.java:180)
at sun.reflect.NativeMethodAccessorImpl.invoke0(Native Method)
at sun.reflect.NativeMethodAccessorImpl.invoke(NativeMethodAccessorImpl.java:39)
at sun.reflect.DelegatingMethodAccessorImpl.invoke(DelegatingMethodAccessorImpl.java:25)
at java.lang.reflect.Method.invoke(Method.java:597)
at org.apache.maven.surefire.booter.SurefireBooter.runSuitesInProcess(SurefireBooter.java:350)
at org.apache.maven.surefire.booter.SurefireBooter.main(SurefireBooter.java:1021)
Tests run: 143, Failures: 0, Errors: 0, Skipped: 0, Time elapsed: 6.219 sec
Results :
Tests run: 143, Failures: 0, Errors: 0, Skipped: 0
[INFO]
[INFO] --- maven-jar-plugin:2.2:jar (default-jar) @ myfaces-impl ---
[INFO] Building jar: F:\jenkins\jenkins-slave\workspace\myfaces-current12\current12\core\impl\target\myfaces-impl-1.2.13-SNAPSHOT.jar
[INFO]
[INFO] --- maven-site-plugin:3.0:attach-descriptor (attach-descriptor) @ myfaces-impl ---
[INFO]
[INFO] >>> maven-source-plugin:2.0.4:jar (attach-source) @ myfaces-impl >>>
[INFO]
[INFO] --- myfaces-builder-plugin:1.0.8:build-metadata (makemyfacesmetadata) @ myfaces-impl ---
Artifact: myfaces-api-1.2.13-SNAPSHOT.jar have META-INF/myfaces-metadata.xml
[INFO]
[INFO] --- myfaces-builder-plugin:1.0.8:make-config (makefacesconfig) @ myfaces-impl ---
[WARNING] *******************************************************************
[WARNING] RuntimeInstance initializing.
[WARNING] Default ResourceManager initializing. (class org.apache.velocity.runtime.resource.ResourceManagerImpl)
[WARNING] FileResourceLoader : initialization starting.
[WARNING] FileResourceLoader : initialization complete.
[WARNING] RelativeClasspathResourceLoader : initialization complete.
[INFO] RelativeClasspathResourceLoader : adding path 'META-INF'
[WARNING] RelativeClasspathResourceLoader : initialization complete.
[WARNING] Default ResourceManager initialization complete.
[WARNING] Velocimacro : initialization starting.
[WARNING] Velocimacro : VM library registration complete.
[WARNING] Velocimacro : Velocimacro : initialization complete.
[WARNING] RuntimeInstance successfully initialized.
[INFO] using base content file: F:\jenkins\jenkins-slave\workspace\myfaces-current12\current12\core\impl\src\main\conf\META-INF\standard-faces-config-base.xml
[INFO]
[INFO] --- myfaces-builder-plugin:1.0.8:make-tags (make_tags) @ myfaces-impl ---
[INFO] Using template from file loader: F:\jenkins\jenkins-slave\workspace\myfaces-current12\current12\core\impl\src\main\resources\META-INF\tagClass12.vm
[WARNING] *******************************************************************
[WARNING] RuntimeInstance initializing.
[WARNING] Default ResourceManager initializing. (class org.apache.velocity.runtime.resource.ResourceManagerImpl)
[WARNING] FileResourceLoader : initialization starting.
[WARNING] FileResourceLoader : initialization complete.
[WARNING] RelativeClasspathResourceLoader : initialization complete.
[INFO] RelativeClasspathResourceLoader : adding path 'META-INF'
[WARNING] RelativeClasspathResourceLoader : initialization complete.
[WARNING] Default ResourceManager initialization complete.
[WARNING] Velocimacro : initialization starting.
[WARNING] Velocimacro : VM library registration complete.
[WARNING] Velocimacro : Velocimacro : initialization complete.
[WARNING] RuntimeInstance successfully initialized.
[INFO] Generating tag class:org.apache.myfaces.taglib.html.HtmlInputHiddenTag
[INFO] Generating tag class:org.apache.myfaces.taglib.html.HtmlColumnTag
[INFO] Generating tag class:org.apache.myfaces.taglib.html.HtmlCommandButtonTag
[INFO] Generating tag class:org.apache.myfaces.taglib.html.HtmlCommandLinkTag
[INFO] Generating tag class:org.apache.myfaces.taglib.html.HtmlDataTableTag
[INFO] Generating tag class:org.apache.myfaces.taglib.html.HtmlFormTag
[INFO] Generating tag class:org.apache.myfaces.taglib.html.HtmlGraphicImageTag
[INFO] Generating tag class:org.apache.myfaces.taglib.html.HtmlInputSecretTag
[INFO] Generating tag class:org.apache.myfaces.taglib.html.HtmlInputTextTag
[INFO] Generating tag class:org.apache.myfaces.taglib.html.HtmlInputTextareaTag
[INFO] Generating tag class:org.apache.myfaces.taglib.html.HtmlMessageTag
[INFO] Generating tag class:org.apache.myfaces.taglib.html.HtmlMessagesTag
[INFO] Generating tag class:org.apache.myfaces.taglib.html.HtmlOutputFormatTag
[INFO] Generating tag class:org.apache.myfaces.taglib.html.HtmlOutputLabelTag
[INFO] Generating tag class:org.apache.myfaces.taglib.html.HtmlOutputLinkTag
[INFO] Generating tag class:org.apache.myfaces.taglib.html.HtmlOutputTextTag
[INFO] Generating tag class:org.apache.myfaces.taglib.html.HtmlPanelGridTag
[INFO] Generating tag class:org.apache.myfaces.taglib.html.HtmlPanelGroupTag
[INFO] Generating tag class:org.apache.myfaces.taglib.html.HtmlSelectBooleanCheckboxTag
[INFO] Generating tag class:org.apache.myfaces.taglib.html.HtmlSelectManyCheckboxTag
[INFO] Generating tag class:org.apache.myfaces.taglib.html.HtmlSelectManyListboxTag
[INFO] Generating tag class:org.apache.myfaces.taglib.html.HtmlSelectManyMenuTag
[INFO] Generating tag class:org.apache.myfaces.taglib.html.HtmlSelectOneListboxTag
[INFO] Generating tag class:org.apache.myfaces.taglib.html.HtmlSelectOneMenuTag
[INFO] Generating tag class:org.apache.myfaces.taglib.html.HtmlSelectOneRadioTag
[INFO]
[INFO] --- myfaces-builder-plugin:1.0.8:make-config (makecoretld) @ myfaces-impl ---
[WARNING] *******************************************************************
[WARNING] RuntimeInstance initializing.
[WARNING] Default ResourceManager initializing. (class org.apache.velocity.runtime.resource.ResourceManagerImpl)
[WARNING] FileResourceLoader : initialization starting.
[WARNING] FileResourceLoader : initialization complete.
[WARNING] RelativeClasspathResourceLoader : initialization complete.
[INFO] RelativeClasspathResourceLoader : adding path 'META-INF'
[WARNING] RelativeClasspathResourceLoader : initialization complete.
[WARNING] Default ResourceManager initialization complete.
[WARNING] Velocimacro : initialization starting.
[WARNING] Velocimacro : VM library registration complete.
[WARNING] Velocimacro : Velocimacro : initialization complete.
[WARNING] RuntimeInstance successfully initialized.
[INFO] using base content file: F:\jenkins\jenkins-slave\workspace\myfaces-current12\current12\core\impl\src\main\conf\META-INF\myfaces_core-base.tld
[INFO]
[INFO] --- myfaces-builder-plugin:1.0.8:make-config (makehtmltld) @ myfaces-impl ---
[WARNING] *******************************************************************
[WARNING] RuntimeInstance initializing.
[WARNING] Default ResourceManager initializing. (class org.apache.velocity.runtime.resource.ResourceManagerImpl)
[WARNING] FileResourceLoader : initialization starting.
[WARNING] FileResourceLoader : initialization complete.
[WARNING] RelativeClasspathResourceLoader : initialization complete.
[INFO] RelativeClasspathResourceLoader : adding path 'META-INF'
[WARNING] RelativeClasspathResourceLoader : initialization complete.
[WARNING] Default ResourceManager initialization complete.
[WARNING] Velocimacro : initialization starting.
[WARNING] Velocimacro : VM library registration complete.
[WARNING] Velocimacro : Velocimacro : initialization complete.
[WARNING] RuntimeInstance successfully initialized.
[INFO] using base content file: F:\jenkins\jenkins-slave\workspace\myfaces-current12\current12\core\impl\src\main\conf\META-INF\myfaces_html-base.tld
[WARNING] Failed to getClass for org.apache.maven.plugin.source.SourceJarMojo
[INFO]
[INFO] <<< maven-source-plugin:2.0.4:jar (attach-source) @ myfaces-impl <<<
[INFO]
[INFO] --- maven-source-plugin:2.0.4:jar (attach-source) @ myfaces-impl ---
[INFO] Building jar: F:\jenkins\jenkins-slave\workspace\myfaces-current12\current12\core\impl\target\myfaces-impl-1.2.13-SNAPSHOT-sources.jar
[INFO]
[INFO] --- maven-checkstyle-plugin:2.6:check (verify-style) @ myfaces-impl ---
[INFO]
[INFO]
[INFO] --- maven-install-plugin:2.3.1:install (default-install) @ myfaces-impl ---
[INFO] Installing F:\jenkins\jenkins-slave\workspace\myfaces-current12\current12\core\impl\target\myfaces-impl-1.2.13-SNAPSHOT.jar to f:\jenkins\jenkins-slave\maven-repositories\1\org\apache\myfaces\core\myfaces-impl\1.2.13-SNAPSHOT\myfaces-impl-1.2.13-SNAPSHOT.jar
[INFO] Installing F:\jenkins\jenkins-slave\workspace\myfaces-current12\current12\core\impl\pom.xml to f:\jenkins\jenkins-slave\maven-repositories\1\org\apache\myfaces\core\myfaces-impl\1.2.13-SNAPSHOT\myfaces-impl-1.2.13-SNAPSHOT.pom
[INFO] Installing F:\jenkins\jenkins-slave\workspace\myfaces-current12\current12\core\impl\target\myfaces-impl-1.2.13-SNAPSHOT-sources.jar to f:\jenkins\jenkins-slave\maven-repositories\1\org\apache\myfaces\core\myfaces-impl\1.2.13-SNAPSHOT\myfaces-impl-1.2.13-SNAPSHOT-sources.jar
[INFO]
[INFO] ------------------------------------------------------------------------
[INFO] Building Build Project 1.2.10-SNAPSHOT
[INFO] ------------------------------------------------------------------------
[INFO]
[INFO] --- maven-remote-resources-plugin:1.1:process (default) @ myfaces-base ---
[INFO] Setting property: classpath.resource.loader.class => 'org.codehaus.plexus.velocity.ContextClassLoaderResourceLoader'.
[INFO] Setting property: velocimacro.messages.on => 'false'.
[INFO] Setting property: resource.loader => 'classpath'.
[INFO] Setting property: resource.manager.logwhenfound => 'false'.
[INFO]
[INFO] --- maven-install-plugin:2.3:install (default-install) @ myfaces-base ---
[INFO] Installing <https://builds.apache.org/job/myfaces-current12/ws/current12\pom.xml> to f:\jenkins\jenkins-slave\maven-repositories\1\org\apache\myfaces\myfaces-base\1.2.10-SNAPSHOT\myfaces-base-1.2.10-SNAPSHOT.pom
[INFO] ------------------------------------------------------------------------
[INFO] Reactor Summary:
[INFO]
[INFO] Apache MyFaces Shared For JSF 1.2 - Project ....... SUCCESS [16.281s]
[INFO] Apache MyFaces Shared For JSF 1.2 - Core .......... SUCCESS [14.562s]
[INFO] MyFaces Shared Impl ............................... SUCCESS [18.266s]
[INFO] MyFaces Shared Tomahawk ........................... SUCCESS [12.313s]
[INFO] Apache MyFaces JSF-1.2 Core Project ............... SUCCESS [5.766s]
[INFO] Apache Myfaces JSF Core-1.2 API ................... SUCCESS [40.485s]
[INFO] Apache MyFaces JSF-1.2 Core Impl .................. SUCCESS [42.656s]
[INFO] Build Project ..................................... SUCCESS [6.516s]
[INFO] ------------------------------------------------------------------------
[INFO] BUILD SUCCESS
[INFO] ------------------------------------------------------------------------
[INFO] Total time: 2:46.813s
[INFO] Finished at: Mon Jun 02 17:31:47 PDT 2014
[INFO] Final Memory: 57M/136M
[INFO] ------------------------------------------------------------------------
Waiting for Jenkins to finish collecting data
[JENKINS] Archiving F:\jenkins\jenkins-slave\workspace\myfaces-current12\current12\shared\shared-tomahawk\pom.xml to org.apache.myfaces.shared/myfaces-shared-tomahawk/3.0.13-SNAPSHOT/myfaces-shared-tomahawk-3.0.13-SNAPSHOT.pom
[JENKINS] Archiving F:\jenkins\jenkins-slave\workspace\myfaces-current12\current12\shared\shared-tomahawk\target\myfaces-shared-tomahawk-3.0.13-SNAPSHOT.jar to org.apache.myfaces.shared/myfaces-shared-tomahawk/3.0.13-SNAPSHOT/myfaces-shared-tomahawk-3.0.13-SNAPSHOT.jar
[JENKINS] Archiving F:\jenkins\jenkins-slave\workspace\myfaces-current12\current12\shared\shared-tomahawk\target\myfaces-shared-tomahawk-3.0.13-SNAPSHOT-sources.jar to org.apache.myfaces.shared/myfaces-shared-tomahawk/3.0.13-SNAPSHOT/myfaces-shared-tomahawk-3.0.13-SNAPSHOT-sources.jar
[JENKINS] Archiving F:\jenkins\jenkins-slave\workspace\myfaces-current12\current12\core\impl\pom.xml to org.apache.myfaces.core/myfaces-impl/1.2.13-SNAPSHOT/myfaces-impl-1.2.13-SNAPSHOT.pom
[JENKINS] Archiving F:\jenkins\jenkins-slave\workspace\myfaces-current12\current12\core\impl\target\myfaces-impl-1.2.13-SNAPSHOT.jar to org.apache.myfaces.core/myfaces-impl/1.2.13-SNAPSHOT/myfaces-impl-1.2.13-SNAPSHOT.jar
[JENKINS] Archiving F:\jenkins\jenkins-slave\workspace\myfaces-current12\current12\core\impl\target\myfaces-impl-1.2.13-SNAPSHOT-sources.jar to org.apache.myfaces.core/myfaces-impl/1.2.13-SNAPSHOT/myfaces-impl-1.2.13-SNAPSHOT-sources.jar
[JENKINS] Archiving F:\jenkins\jenkins-slave\workspace\myfaces-current12\current12\shared\shared-impl\pom.xml to org.apache.myfaces.shared/myfaces-shared-impl/3.0.13-SNAPSHOT/myfaces-shared-impl-3.0.13-SNAPSHOT.pom
[JENKINS] Archiving F:\jenkins\jenkins-slave\workspace\myfaces-current12\current12\shared\shared-impl\target\myfaces-shared-impl-3.0.13-SNAPSHOT.jar to org.apache.myfaces.shared/myfaces-shared-impl/3.0.13-SNAPSHOT/myfaces-shared-impl-3.0.13-SNAPSHOT.jar
[JENKINS] Archiving F:\jenkins\jenkins-slave\workspace\myfaces-current12\current12\shared\shared-impl\target\myfaces-shared-impl-3.0.13-SNAPSHOT-sources.jar to org.apache.myfaces.shared/myfaces-shared-impl/3.0.13-SNAPSHOT/myfaces-shared-impl-3.0.13-SNAPSHOT-sources.jar
[JENKINS] Archiving F:\jenkins\jenkins-slave\workspace\myfaces-current12\current12\shared\core\pom.xml to org.apache.myfaces.shared/myfaces-shared-core/3.0.13-SNAPSHOT/myfaces-shared-core-3.0.13-SNAPSHOT.pom
[JENKINS] Archiving F:\jenkins\jenkins-slave\workspace\myfaces-current12\current12\shared\core\target\myfaces-shared-core-3.0.13-SNAPSHOT.jar to org.apache.myfaces.shared/myfaces-shared-core/3.0.13-SNAPSHOT/myfaces-shared-core-3.0.13-SNAPSHOT.jar
[JENKINS] Archiving F:\jenkins\jenkins-slave\workspace\myfaces-current12\current12\shared\core\target\myfaces-shared-core-3.0.13-SNAPSHOT-sources.jar to org.apache.myfaces.shared/myfaces-shared-core/3.0.13-SNAPSHOT/myfaces-shared-core-3.0.13-SNAPSHOT-sources.jar
[JENKINS] Archiving F:\jenkins\jenkins-slave\workspace\myfaces-current12\current12\core\api\pom.xml to org.apache.myfaces.core/myfaces-api/1.2.13-SNAPSHOT/myfaces-api-1.2.13-SNAPSHOT.pom
[JENKINS] Archiving F:\jenkins\jenkins-slave\workspace\myfaces-current12\current12\core\api\target\myfaces-api-1.2.13-SNAPSHOT.jar to org.apache.myfaces.core/myfaces-api/1.2.13-SNAPSHOT/myfaces-api-1.2.13-SNAPSHOT.jar
[JENKINS] Archiving F:\jenkins\jenkins-slave\workspace\myfaces-current12\current12\core\api\target\myfaces-api-1.2.13-SNAPSHOT-sources.jar to org.apache.myfaces.core/myfaces-api/1.2.13-SNAPSHOT/myfaces-api-1.2.13-SNAPSHOT-sources.jar
[JENKINS] Archiving F:\jenkins\jenkins-slave\workspace\myfaces-current12\current12\core\api\target\myfaces-api-1.2.13-SNAPSHOT-tests.jar to org.apache.myfaces.core/myfaces-api/1.2.13-SNAPSHOT/myfaces-api-1.2.13-SNAPSHOT-tests.jar
[JENKINS] Archiving F:\jenkins\jenkins-slave\workspace\myfaces-current12\current12\shared\pom.xml to org.apache.myfaces.shared/myfaces-shared-project/3.0.13-SNAPSHOT/myfaces-shared-project-3.0.13-SNAPSHOT.pom
[JENKINS] Archiving F:\jenkins\jenkins-slave\workspace\myfaces-current12\current12\shared\target\myfaces-shared-project-3.0.13-SNAPSHOT-site.xml to org.apache.myfaces.shared/myfaces-shared-project/3.0.13-SNAPSHOT/myfaces-shared-project-3.0.13-SNAPSHOT-site.xml
[JENKINS] Archiving F:\jenkins\jenkins-slave\workspace\myfaces-current12\current12\core\pom.xml to org.apache.myfaces.core/myfaces-core-project/1.2.13-SNAPSHOT/myfaces-core-project-1.2.13-SNAPSHOT.pom
[JENKINS] Archiving F:\jenkins\jenkins-slave\workspace\myfaces-current12\current12\core\target\myfaces-core-project-1.2.13-SNAPSHOT-site.xml to org.apache.myfaces.core/myfaces-core-project/1.2.13-SNAPSHOT/myfaces-core-project-1.2.13-SNAPSHOT-site.xml
[JENKINS] Archiving <https://builds.apache.org/job/myfaces-current12/ws/current12\pom.xml> to org.apache.myfaces/myfaces-base/1.2.10-SNAPSHOT/myfaces-base-1.2.10-SNAPSHOT.pom
channel stopped
Maven RedeployPublisher use remote windows2 maven settings from : f:\jenkins\tools\maven\latest/conf/settings.xml
[ERROR] uniqueVersion == false is not anymore supported in maven 3
[INFO] Deployment in https://repository.apache.org/content/repositories/snapshots (id=apache.snapshots.https,uniqueVersion=false)
Deploying the main artifact jenkins-3040805021838258852myfaces-base-1.2.10-SNAPSHOT.pom
Downloading: https://repository.apache.org/content/repositories/snapshots/org/apache/myfaces/myfaces-base/1.2.10-SNAPSHOT/maven-metadata.xml
Downloaded: https://repository.apache.org/content/repositories/snapshots/org/apache/myfaces/myfaces-base/1.2.10-SNAPSHOT/maven-metadata.xml (613 B at 1.3 KB/sec)
Uploading: https://repository.apache.org/content/repositories/snapshots/org/apache/myfaces/myfaces-base/1.2.10-SNAPSHOT/myfaces-base-1.2.10-20140603.003217-556.pom
ERROR: Failed to deploy artifacts: Could not transfer artifact org.apache.myfaces:myfaces-base:pom:1.2.10-20140603.003217-556 from/to apache.snapshots.https (https://repository.apache.org/content/repositories/snapshots): Failed to transfer file: https://repository.apache.org/content/repositories/snapshots/org/apache/myfaces/myfaces-base/1.2.10-SNAPSHOT/myfaces-base-1.2.10-20140603.003217-556.pom. Return code is: 401, ReasonPhrase: Unauthorized.
org.apache.maven.artifact.deployer.ArtifactDeploymentException: Failed to deploy artifacts: Could not transfer artifact org.apache.myfaces:myfaces-base:pom:1.2.10-20140603.003217-556 from/to apache.snapshots.https (https://repository.apache.org/content/repositories/snapshots): Failed to transfer file: https://repository.apache.org/content/repositories/snapshots/org/apache/myfaces/myfaces-base/1.2.10-SNAPSHOT/myfaces-base-1.2.10-20140603.003217-556.pom. Return code is: 401, ReasonPhrase: Unauthorized.
at org.apache.maven.artifact.deployer.DefaultArtifactDeployer.deploy(DefaultArtifactDeployer.java:143)
at hudson.maven.reporters.MavenArtifactRecord.deploy(MavenArtifactRecord.java:191)
at hudson.maven.RedeployPublisher.perform(RedeployPublisher.java:176)
at hudson.tasks.BuildStepMonitor$1.perform(BuildStepMonitor.java:20)
at hudson.model.AbstractBuild$AbstractBuildExecution.perform(AbstractBuild.java:804)
at hudson.model.AbstractBuild$AbstractBuildExecution.performAllBuildSteps(AbstractBuild.java:776)
at hudson.maven.MavenModuleSetBuild$MavenModuleSetBuildExecution.post2(MavenModuleSetBuild.java:1030)
at hudson.model.AbstractBuild$AbstractBuildExecution.post(AbstractBuild.java:725)
at hudson.model.Run.execute(Run.java:1701)
at hudson.maven.MavenModuleSetBuild.run(MavenModuleSetBuild.java:519)
at hudson.model.ResourceController.execute(ResourceController.java:88)
at hudson.model.Executor.run(Executor.java:231)
Caused by: org.eclipse.aether.deployment.DeploymentException: Failed to deploy artifacts: Could not transfer artifact org.apache.myfaces:myfaces-base:pom:1.2.10-20140603.003217-556 from/to apache.snapshots.https (https://repository.apache.org/content/repositories/snapshots): Failed to transfer file: https://repository.apache.org/content/repositories/snapshots/org/apache/myfaces/myfaces-base/1.2.10-SNAPSHOT/myfaces-base-1.2.10-20140603.003217-556.pom. Return code is: 401, ReasonPhrase: Unauthorized.
at org.eclipse.aether.internal.impl.DefaultDeployer.deploy(DefaultDeployer.java:341)
at org.eclipse.aether.internal.impl.DefaultDeployer.deploy(DefaultDeployer.java:269)
at org.eclipse.aether.internal.impl.DefaultRepositorySystem.deploy(DefaultRepositorySystem.java:413)
at org.apache.maven.artifact.deployer.DefaultArtifactDeployer.deploy(DefaultArtifactDeployer.java:139)
... 11 more
Caused by: org.eclipse.aether.transfer.ArtifactTransferException: Could not transfer artifact org.apache.myfaces:myfaces-base:pom:1.2.10-20140603.003217-556 from/to apache.snapshots.https (https://repository.apache.org/content/repositories/snapshots): Failed to transfer file: https://repository.apache.org/content/repositories/snapshots/org/apache/myfaces/myfaces-base/1.2.10-SNAPSHOT/myfaces-base-1.2.10-20140603.003217-556.pom. Return code is: 401, ReasonPhrase: Unauthorized.
at org.eclipse.aether.connector.wagon.WagonRepositoryConnector$6.wrap(WagonRepositoryConnector.java:1016)
at org.eclipse.aether.connector.wagon.WagonRepositoryConnector$6.wrap(WagonRepositoryConnector.java:1004)
at org.eclipse.aether.connector.wagon.WagonRepositoryConnector$PutTask.run(WagonRepositoryConnector.java:895)
at org.eclipse.aether.connector.wagon.WagonRepositoryConnector.put(WagonRepositoryConnector.java:522)
at org.eclipse.aether.internal.impl.DefaultDeployer.deploy(DefaultDeployer.java:335)
... 14 more
Caused by: org.apache.maven.wagon.TransferFailedException: Failed to transfer file: https://repository.apache.org/content/repositories/snapshots/org/apache/myfaces/myfaces-base/1.2.10-SNAPSHOT/myfaces-base-1.2.10-20140603.003217-556.pom. Return code is: 401, ReasonPhrase: Unauthorized.
at org.apache.maven.wagon.shared.http4.AbstractHttpClientWagon.put(AbstractHttpClientWagon.java:626)
at org.apache.maven.wagon.shared.http4.AbstractHttpClientWagon.put(AbstractHttpClientWagon.java:524)
at org.apache.maven.wagon.shared.http4.AbstractHttpClientWagon.put(AbstractHttpClientWagon.java:505)
at org.apache.maven.wagon.shared.http4.AbstractHttpClientWagon.put(AbstractHttpClientWagon.java:485)
at org.eclipse.aether.connector.wagon.WagonRepositoryConnector$PutTask.run(WagonRepositoryConnector.java:871)
... 16 more
[INFO] Deployment failed after 2.9 sec
Build step 'Deploy artifacts to Maven repository' changed build result to FAILURE