You are viewing a plain text version of this content. The canonical link for it is here.
Posted to dev@beam.apache.org by Apache Jenkins Server <je...@builds.apache.org> on 2018/01/14 08:33:05 UTC
Build failed in Jenkins: beam_Release_NightlySnapshot #652
See <https://builds.apache.org/job/beam_Release_NightlySnapshot/652/display/redirect?page=changes>
Changes:
[iemejia] [BEAM-3467] Remove Java 7 from the docker development images
[klk] Temporarily disable permared Dataflow integration tests
[lcwik] [BEAM-3478] Fix checkstyle issue in runners/flink
[iemejia] Fix unused dependency error on Flink runner
------------------------------------------
[...truncated 3.07 MB...]
2018-01-14T08:31:05.407 [INFO] Excluding org.glassfish.hk2.external:aopalliance-repackaged:jar:2.4.0-b34 from the shaded jar.
2018-01-14T08:31:05.407 [INFO] Excluding org.glassfish.hk2.external:javax.inject:jar:2.4.0-b34 from the shaded jar.
2018-01-14T08:31:05.407 [INFO] Excluding org.glassfish.hk2:hk2-locator:jar:2.4.0-b34 from the shaded jar.
2018-01-14T08:31:05.407 [INFO] Excluding org.glassfish.jersey.core:jersey-common:jar:2.22.2 from the shaded jar.
2018-01-14T08:31:05.407 [INFO] Excluding javax.annotation:javax.annotation-api:jar:1.2 from the shaded jar.
2018-01-14T08:31:05.407 [INFO] Excluding org.glassfish.jersey.bundles.repackaged:jersey-guava:jar:2.22.2 from the shaded jar.
2018-01-14T08:31:05.407 [INFO] Excluding org.glassfish.hk2:osgi-resource-locator:jar:1.0.1 from the shaded jar.
2018-01-14T08:31:05.407 [INFO] Excluding org.glassfish.jersey.core:jersey-server:jar:2.22.2 from the shaded jar.
2018-01-14T08:31:05.407 [INFO] Excluding org.glassfish.jersey.media:jersey-media-jaxb:jar:2.22.2 from the shaded jar.
2018-01-14T08:31:05.407 [INFO] Excluding org.glassfish.jersey.containers:jersey-container-servlet:jar:2.22.2 from the shaded jar.
2018-01-14T08:31:05.407 [INFO] Excluding org.glassfish.jersey.containers:jersey-container-servlet-core:jar:2.22.2 from the shaded jar.
2018-01-14T08:31:05.407 [INFO] Excluding io.netty:netty-all:jar:4.0.43.Final from the shaded jar.
2018-01-14T08:31:05.407 [INFO] Excluding io.netty:netty:jar:3.9.9.Final from the shaded jar.
2018-01-14T08:31:05.407 [INFO] Excluding io.dropwizard.metrics:metrics-jvm:jar:3.1.2 from the shaded jar.
2018-01-14T08:31:05.407 [INFO] Excluding io.dropwizard.metrics:metrics-json:jar:3.1.2 from the shaded jar.
2018-01-14T08:31:05.407 [INFO] Excluding io.dropwizard.metrics:metrics-graphite:jar:3.1.2 from the shaded jar.
2018-01-14T08:31:05.407 [INFO] Excluding org.apache.ivy:ivy:jar:2.4.0 from the shaded jar.
2018-01-14T08:31:05.407 [INFO] Excluding oro:oro:jar:2.0.8 from the shaded jar.
2018-01-14T08:31:05.407 [INFO] Excluding net.razorvine:pyrolite:jar:4.13 from the shaded jar.
2018-01-14T08:31:05.407 [INFO] Excluding net.sf.py4j:py4j:jar:0.10.4 from the shaded jar.
2018-01-14T08:31:05.407 [INFO] Excluding org.apache.spark:spark-tags_2.11:jar:2.2.1 from the shaded jar.
2018-01-14T08:31:05.407 [INFO] Excluding org.apache.commons:commons-crypto:jar:1.0.0 from the shaded jar.
2018-01-14T08:31:05.407 [INFO] Excluding org.spark-project.spark:unused:jar:1.0.0 from the shaded jar.
2018-01-14T08:31:05.407 [INFO] Excluding org.apache.spark:spark-streaming_2.11:jar:2.2.1 from the shaded jar.
2018-01-14T08:31:07.858 [INFO] Replacing original artifact with shaded artifact.
2018-01-14T08:31:07.966 [INFO]
2018-01-14T08:31:07.966 [INFO] --- maven-javadoc-plugin:3.0.0-M1:jar (attach-javadocs) @ beam-sdks-java-javadoc ---
2018-01-14T08:31:07.971 [INFO] Not executing Javadoc as the project is not a Java classpath-capable package
2018-01-14T08:31:08.079 [INFO]
2018-01-14T08:31:08.079 [INFO] --- maven-source-plugin:3.0.1:jar-no-fork (attach-sources) @ beam-sdks-java-javadoc ---
2018-01-14T08:31:08.186 [INFO]
2018-01-14T08:31:08.186 [INFO] --- maven-source-plugin:3.0.1:test-jar-no-fork (attach-test-sources) @ beam-sdks-java-javadoc ---
2018-01-14T08:31:08.295 [INFO]
2018-01-14T08:31:08.295 [INFO] --- reproducible-build-maven-plugin:0.4:strip-jar (default) @ beam-sdks-java-javadoc ---
2018-01-14T08:31:08.296 [INFO] Stripping <https://builds.apache.org/job/beam_Release_NightlySnapshot/ws/src/sdks/java/javadoc/target/javadoc.jar>
2018-01-14T08:31:08.467 [INFO]
2018-01-14T08:31:08.467 [INFO] --- maven-dependency-plugin:3.0.1:analyze-only (default) @ beam-sdks-java-javadoc ---
2018-01-14T08:31:08.468 [INFO] Skipping plugin execution
2018-01-14T08:31:08.575 [INFO]
2018-01-14T08:31:08.575 [INFO] --- maven-install-plugin:2.5.2:install (default-install) @ beam-sdks-java-javadoc ---
2018-01-14T08:31:08.576 [INFO] Installing <https://builds.apache.org/job/beam_Release_NightlySnapshot/ws/src/sdks/java/javadoc/pom.xml> to <https://builds.apache.org/job/beam_Release_NightlySnapshot/ws/.repository/org/apache/beam/beam-sdks-java-javadoc/2.3.0-SNAPSHOT/beam-sdks-java-javadoc-2.3.0-SNAPSHOT.pom>
2018-01-14T08:31:08.630 [INFO] Installing <https://builds.apache.org/job/beam_Release_NightlySnapshot/ws/src/sdks/java/javadoc/target/javadoc.jar> to <https://builds.apache.org/job/beam_Release_NightlySnapshot/ws/.repository/org/apache/beam/beam-sdks-java-javadoc/2.3.0-SNAPSHOT/beam-sdks-java-javadoc-2.3.0-SNAPSHOT.jar>
2018-01-14T08:31:08.742 [INFO]
2018-01-14T08:31:08.742 [INFO] --- maven-deploy-plugin:2.8.2:deploy (default-deploy) @ beam-sdks-java-javadoc ---
2018-01-14T08:31:08.745 [INFO] Downloading: https://repository.apache.org/content/repositories/snapshots/org/apache/beam/beam-sdks-java-javadoc/2.3.0-SNAPSHOT/maven-metadata.xml
2018-01-14T08:31:08.985 [INFO] Downloaded: https://repository.apache.org/content/repositories/snapshots/org/apache/beam/beam-sdks-java-javadoc/2.3.0-SNAPSHOT/maven-metadata.xml (790 B at 3.2 KB/sec)
2018-01-14T08:31:08.989 [INFO] Uploading: https://repository.apache.org/content/repositories/snapshots/org/apache/beam/beam-sdks-java-javadoc/2.3.0-SNAPSHOT/beam-sdks-java-javadoc-2.3.0-20180114.083108-75.pom
2018-01-14T08:31:09.347 [INFO] Uploaded: https://repository.apache.org/content/repositories/snapshots/org/apache/beam/beam-sdks-java-javadoc/2.3.0-SNAPSHOT/beam-sdks-java-javadoc-2.3.0-20180114.083108-75.pom (10 KB at 26.8 KB/sec)
2018-01-14T08:31:09.347 [INFO] Downloading: https://repository.apache.org/content/repositories/snapshots/org/apache/beam/beam-sdks-java-javadoc/maven-metadata.xml
2018-01-14T08:31:09.574 [INFO] Downloaded: https://repository.apache.org/content/repositories/snapshots/org/apache/beam/beam-sdks-java-javadoc/maven-metadata.xml (397 B at 1.7 KB/sec)
2018-01-14T08:31:09.615 [INFO] Uploading: https://repository.apache.org/content/repositories/snapshots/org/apache/beam/beam-sdks-java-javadoc/2.3.0-SNAPSHOT/maven-metadata.xml
2018-01-14T08:31:10.008 [INFO] Uploaded: https://repository.apache.org/content/repositories/snapshots/org/apache/beam/beam-sdks-java-javadoc/2.3.0-SNAPSHOT/maven-metadata.xml (790 B at 2.0 KB/sec)
2018-01-14T08:31:10.008 [INFO] Uploading: https://repository.apache.org/content/repositories/snapshots/org/apache/beam/beam-sdks-java-javadoc/maven-metadata.xml
2018-01-14T08:31:10.357 [INFO] Uploaded: https://repository.apache.org/content/repositories/snapshots/org/apache/beam/beam-sdks-java-javadoc/maven-metadata.xml (397 B at 1.1 KB/sec)
2018-01-14T08:31:10.358 [INFO] Uploading: https://repository.apache.org/content/repositories/snapshots/org/apache/beam/beam-sdks-java-javadoc/2.3.0-SNAPSHOT/beam-sdks-java-javadoc-2.3.0-20180114.083108-75.jar
2018-01-14T08:31:11.236 [INFO] Uploaded: https://repository.apache.org/content/repositories/snapshots/org/apache/beam/beam-sdks-java-javadoc/2.3.0-SNAPSHOT/beam-sdks-java-javadoc-2.3.0-20180114.083108-75.jar (4740 KB at 5398.5 KB/sec)
2018-01-14T08:31:11.236 [INFO] Uploading: https://repository.apache.org/content/repositories/snapshots/org/apache/beam/beam-sdks-java-javadoc/2.3.0-SNAPSHOT/maven-metadata.xml
2018-01-14T08:31:11.582 [INFO] Uploaded: https://repository.apache.org/content/repositories/snapshots/org/apache/beam/beam-sdks-java-javadoc/2.3.0-SNAPSHOT/maven-metadata.xml (790 B at 2.2 KB/sec)
[JENKINS] Archiving disabled
[JENKINS] Archiving disabled
[JENKINS] Archiving disabled
[JENKINS] Archiving disabled
[JENKINS] Archiving disabled
[JENKINS] Archiving disabled
[JENKINS] Archiving disabled
[JENKINS] Archiving disabled
[JENKINS] Archiving disabled
[JENKINS] Archiving disabled
[JENKINS] Archiving disabled
[JENKINS] Archiving disabled
[JENKINS] Archiving disabled
[JENKINS] Archiving disabled
[JENKINS] Archiving disabled
[JENKINS] Archiving disabled
[JENKINS] Archiving disabled
[JENKINS] Archiving disabled
[JENKINS] Archiving disabled
[JENKINS] Archiving disabled
[JENKINS] Archiving disabled
[JENKINS] Archiving disabled
[JENKINS] Archiving disabled
[JENKINS] Archiving disabled
[JENKINS] Archiving disabled
[JENKINS] Archiving disabled
[JENKINS] Archiving disabled
[JENKINS] Archiving disabled
[JENKINS] Archiving disabled
[JENKINS] Archiving disabled
[JENKINS] Archiving disabled
[JENKINS] Archiving disabled
[JENKINS] Archiving disabled
[JENKINS] Archiving disabled
[JENKINS] Archiving disabled
[JENKINS] Archiving disabled
[JENKINS] Archiving disabled
[JENKINS] Archiving disabled
[JENKINS] Archiving disabled
[JENKINS] Archiving disabled
[JENKINS] Archiving disabled
[JENKINS] Archiving disabled
[JENKINS] Archiving disabled
[JENKINS] Archiving disabled
[JENKINS] Archiving disabled
[JENKINS] Archiving disabled
[JENKINS] Archiving disabled
[JENKINS] Archiving disabled
[JENKINS] Archiving disabled
[JENKINS] Archiving disabled
[JENKINS] Archiving disabled
[JENKINS] Archiving disabled
[JENKINS] Archiving disabled
[JENKINS] Archiving disabled
[JENKINS] Archiving disabled
[JENKINS] Archiving disabled
[JENKINS] Archiving disabled
[JENKINS] Archiving disabled
[JENKINS] Archiving disabled
[JENKINS] Archiving disabled
[JENKINS] Archiving disabled
[JENKINS] Archiving disabled
[JENKINS] Archiving disabled
[JENKINS] Archiving disabled
[JENKINS] Archiving disabled
[JENKINS] Archiving disabled
[JENKINS] Archiving disabled
[JENKINS] Archiving disabled
[JENKINS] Archiving disabled
[JENKINS] Archiving disabled
[JENKINS] Archiving disabled
[JENKINS] Archiving disabled
[JENKINS] Archiving disabled
[JENKINS] Archiving disabled
[JENKINS] Archiving disabled
[JENKINS] Archiving disabled
[JENKINS] Archiving disabled
[JENKINS] Archiving disabled
[JENKINS] Archiving disabled
[JENKINS] Archiving disabled
2018-01-14T08:32:23.600 [INFO] ------------------------------------------------------------------------
2018-01-14T08:32:23.600 [INFO] Reactor Summary:
2018-01-14T08:32:23.600 [INFO]
2018-01-14T08:32:23.600 [INFO] Apache Beam :: Parent .............................. SUCCESS [ 16.404 s]
2018-01-14T08:32:23.600 [INFO] Apache Beam :: SDKs :: Java :: Build Tools ......... SUCCESS [ 13.808 s]
2018-01-14T08:32:23.600 [INFO] Apache Beam :: Model ............................... SUCCESS [ 3.864 s]
2018-01-14T08:32:23.600 [INFO] Apache Beam :: Model :: Pipeline ................... SUCCESS [ 25.261 s]
2018-01-14T08:32:23.600 [INFO] Apache Beam :: Model :: Job Management ............. SUCCESS [ 18.390 s]
2018-01-14T08:32:23.600 [INFO] Apache Beam :: Model :: Fn Execution ............... SUCCESS [ 23.832 s]
2018-01-14T08:32:23.600 [INFO] Apache Beam :: SDKs ................................ SUCCESS [ 4.804 s]
2018-01-14T08:32:23.600 [INFO] Apache Beam :: SDKs :: Go .......................... SUCCESS [ 20.581 s]
2018-01-14T08:32:23.600 [INFO] Apache Beam :: SDKs :: Java ........................ SUCCESS [ 4.878 s]
2018-01-14T08:32:23.601 [INFO] Apache Beam :: SDKs :: Java :: Core ................ SUCCESS [02:48 min]
2018-01-14T08:32:23.601 [INFO] Apache Beam :: Runners ............................. SUCCESS [ 5.287 s]
2018-01-14T08:32:23.601 [INFO] Apache Beam :: Runners :: Local Java Core .......... SUCCESS [ 17.102 s]
2018-01-14T08:32:23.601 [INFO] Apache Beam :: Runners :: Core Construction Java ... SUCCESS [ 55.264 s]
2018-01-14T08:32:23.601 [INFO] Apache Beam :: Runners :: Core Java ................ SUCCESS [ 49.999 s]
2018-01-14T08:32:23.601 [INFO] Apache Beam :: Runners :: Direct Java .............. SUCCESS [04:52 min]
2018-01-14T08:32:23.601 [INFO] Apache Beam :: SDKs :: Java :: IO .................. SUCCESS [ 4.956 s]
2018-01-14T08:32:23.601 [INFO] Apache Beam :: SDKs :: Java :: IO :: AMQP .......... SUCCESS [ 29.790 s]
2018-01-14T08:32:23.601 [INFO] Apache Beam :: SDKs :: Java :: IO :: Common ........ SUCCESS [ 12.519 s]
2018-01-14T08:32:23.601 [INFO] Apache Beam :: SDKs :: Java :: IO :: Cassandra ..... SUCCESS [ 30.019 s]
2018-01-14T08:32:23.601 [INFO] Apache Beam :: SDKs :: Java :: IO :: Elasticsearch . SUCCESS [ 20.255 s]
2018-01-14T08:32:23.601 [INFO] Apache Beam :: SDKs :: Java :: IO :: Elasticsearch-Tests SUCCESS [ 5.919 s]
2018-01-14T08:32:23.601 [INFO] Apache Beam :: SDKs :: Java :: IO :: Elasticsearch-Tests :: Common SUCCESS [ 9.673 s]
2018-01-14T08:32:23.601 [INFO] Apache Beam :: SDKs :: Java :: IO :: Elasticsearch-Tests :: 2.x SUCCESS [ 28.285 s]
2018-01-14T08:32:23.601 [INFO] Apache Beam :: SDKs :: Java :: IO :: Elasticsearch-Tests :: 5.x SUCCESS [ 29.261 s]
2018-01-14T08:32:23.601 [INFO] Apache Beam :: SDKs :: Java :: Extensions .......... SUCCESS [ 4.885 s]
2018-01-14T08:32:23.601 [INFO] Apache Beam :: SDKs :: Java :: Extensions :: Google Cloud Platform Core SUCCESS [ 31.948 s]
2018-01-14T08:32:23.601 [INFO] Apache Beam :: SDKs :: Java :: Extensions :: Protobuf SUCCESS [ 24.351 s]
2018-01-14T08:32:23.601 [INFO] Apache Beam :: SDKs :: Java :: IO :: Google Cloud Platform SUCCESS [01:47 min]
2018-01-14T08:32:23.601 [INFO] Apache Beam :: Runners :: Google Cloud Dataflow .... SUCCESS [07:49 min]
2018-01-14T08:32:23.601 [INFO] Apache Beam :: SDKs :: Java :: IO :: File-based-io-tests SUCCESS [ 12.987 s]
2018-01-14T08:32:23.601 [INFO] Apache Beam :: SDKs :: Java :: IO :: Hadoop Common . SUCCESS [ 24.389 s]
2018-01-14T08:32:23.601 [INFO] Apache Beam :: SDKs :: Java :: IO :: Hadoop File System SUCCESS [ 40.124 s]
2018-01-14T08:32:23.601 [INFO] Apache Beam :: SDKs :: Java :: IO :: Hadoop ........ SUCCESS [ 7.599 s]
2018-01-14T08:32:23.601 [INFO] Apache Beam :: SDKs :: Java :: IO :: Hadoop :: input-format SUCCESS [ 26.468 s]
2018-01-14T08:32:23.601 [INFO] Apache Beam :: SDKs :: Java :: IO :: Hadoop :: jdk1.8-tests SUCCESS [01:07 min]
2018-01-14T08:32:23.601 [INFO] Apache Beam :: SDKs :: Java :: IO :: HBase ......... SUCCESS [01:19 min]
2018-01-14T08:32:23.601 [INFO] Apache Beam :: SDKs :: Java :: IO :: HCatalog ...... SUCCESS [ 56.772 s]
2018-01-14T08:32:23.601 [INFO] Apache Beam :: SDKs :: Java :: IO :: JDBC .......... SUCCESS [ 44.267 s]
2018-01-14T08:32:23.601 [INFO] Apache Beam :: SDKs :: Java :: IO :: JMS ........... SUCCESS [ 26.970 s]
2018-01-14T08:32:23.601 [INFO] Apache Beam :: SDKs :: Java :: IO :: Kafka ......... SUCCESS [ 41.053 s]
2018-01-14T08:32:23.601 [INFO] Apache Beam :: SDKs :: Java :: IO :: Kinesis ....... SUCCESS [ 46.255 s]
2018-01-14T08:32:23.601 [INFO] Apache Beam :: SDKs :: Java :: IO :: MongoDB ....... SUCCESS [ 43.439 s]
2018-01-14T08:32:23.601 [INFO] Apache Beam :: SDKs :: Java :: IO :: MQTT .......... SUCCESS [ 32.047 s]
2018-01-14T08:32:23.601 [INFO] Apache Beam :: SDKs :: Java :: IO :: Redis ......... SUCCESS [ 27.228 s]
2018-01-14T08:32:23.601 [INFO] Apache Beam :: SDKs :: Java :: IO :: Solr .......... SUCCESS [ 50.153 s]
2018-01-14T08:32:23.601 [INFO] Apache Beam :: SDKs :: Java :: IO :: Tika .......... SUCCESS [ 35.254 s]
2018-01-14T08:32:23.601 [INFO] Apache Beam :: SDKs :: Java :: IO :: XML ........... SUCCESS [ 44.523 s]
2018-01-14T08:32:23.601 [INFO] Apache Beam :: SDKs :: Java :: Maven Archetypes .... SUCCESS [ 4.678 s]
2018-01-14T08:32:23.601 [INFO] Apache Beam :: SDKs :: Java :: Maven Archetypes :: Starter SUCCESS [ 17.651 s]
2018-01-14T08:32:23.601 [INFO] Apache Beam :: Examples ............................ SUCCESS [ 5.350 s]
2018-01-14T08:32:23.601 [INFO] Apache Beam :: Examples :: Java .................... SUCCESS [07:17 min]
2018-01-14T08:32:23.601 [INFO] Apache Beam :: SDKs :: Java :: Maven Archetypes :: Examples SUCCESS [ 41.282 s]
2018-01-14T08:32:23.601 [INFO] Apache Beam :: Examples :: Java 8 .................. SUCCESS [ 50.375 s]
2018-01-14T08:32:23.601 [INFO] Apache Beam :: SDKs :: Java :: Maven Archetypes :: Examples - Java 8 SUCCESS [ 48.753 s]
2018-01-14T08:32:23.601 [INFO] Apache Beam :: SDKs :: Java :: Extensions :: Jackson SUCCESS [ 25.805 s]
2018-01-14T08:32:23.601 [INFO] Apache Beam :: SDKs :: Java :: Extensions :: Join library SUCCESS [ 30.929 s]
2018-01-14T08:32:23.601 [INFO] Apache Beam :: SDKs :: Java :: Extensions :: Sketching SUCCESS [ 33.379 s]
2018-01-14T08:32:23.601 [INFO] Apache Beam :: SDKs :: Java :: Extensions :: Sorter SUCCESS [ 53.614 s]
2018-01-14T08:32:23.601 [INFO] Apache Beam :: SDKs :: Java :: Extensions :: SQL ... SUCCESS [01:46 min]
2018-01-14T08:32:23.601 [INFO] Apache Beam :: SDKs :: Java :: Fn Execution ........ SUCCESS [ 40.277 s]
2018-01-14T08:32:23.601 [INFO] Apache Beam :: SDKs :: Java :: Nexmark ............. SUCCESS [01:53 min]
2018-01-14T08:32:23.601 [INFO] Apache Beam :: SDKs :: Java :: Harness ............. SUCCESS [ 47.828 s]
2018-01-14T08:32:23.601 [INFO] Apache Beam :: SDKs :: Java :: Container ........... SUCCESS [ 10.480 s]
2018-01-14T08:32:23.601 [INFO] Apache Beam :: SDKs :: Java :: Java 8 Tests ........ SUCCESS [ 26.633 s]
2018-01-14T08:32:23.601 [INFO] Apache Beam :: SDKs :: Python ...................... SUCCESS [24:48 min]
2018-01-14T08:32:23.601 [INFO] Apache Beam :: SDKs :: Python :: Container ......... SUCCESS [ 9.686 s]
2018-01-14T08:32:23.601 [INFO] Apache Beam :: Runners :: Java Fn Execution ........ FAILURE [ 22.545 s]
2018-01-14T08:32:23.601 [INFO] Apache Beam :: Runners :: Java Local Artifact Service SKIPPED
2018-01-14T08:32:23.601 [INFO] Apache Beam :: Runners :: Reference ................ SUCCESS [ 4.967 s]
2018-01-14T08:32:23.601 [INFO] Apache Beam :: Runners :: Reference :: Java ........ SUCCESS [ 16.905 s]
2018-01-14T08:32:23.601 [INFO] Apache Beam :: Runners :: Reference :: Job Orchestrator SKIPPED
2018-01-14T08:32:23.602 [INFO] Apache Beam :: Runners :: Flink .................... SUCCESS [ 57.456 s]
2018-01-14T08:32:23.602 [INFO] Apache Beam :: Runners :: Spark .................... SUCCESS [02:36 min]
2018-01-14T08:32:23.602 [INFO] Apache Beam :: Runners :: Apex ..................... SUCCESS [01:16 min]
2018-01-14T08:32:23.602 [INFO] Apache Beam :: Runners :: Google Cloud Platform .... SUCCESS [ 4.900 s]
2018-01-14T08:32:23.602 [INFO] Apache Beam :: Runners :: Google Cloud Platform :: GCE metadata provisioning SUCCESS [ 10.249 s]
2018-01-14T08:32:23.602 [INFO] Apache Beam :: Runners :: Google Cloud Platform :: GCS artifact proxy SUCCESS [ 11.083 s]
2018-01-14T08:32:23.602 [INFO] Apache Beam :: Runners :: Gearpump ................. SUCCESS [ 36.757 s]
2018-01-14T08:32:23.602 [INFO] Apache Beam :: SDKs :: Java :: Aggregated Javadoc .. SUCCESS [ 34.594 s]
2018-01-14T08:32:23.602 [INFO] ------------------------------------------------------------------------
2018-01-14T08:32:23.602 [INFO] BUILD FAILURE
2018-01-14T08:32:23.602 [INFO] ------------------------------------------------------------------------
2018-01-14T08:32:23.602 [INFO] Total time: 01:30 h
2018-01-14T08:32:23.602 [INFO] Finished at: 2018-01-14T08:32:23+00:00
2018-01-14T08:32:24.505 [INFO] Final Memory: 383M/1790M
2018-01-14T08:32:24.505 [INFO] ------------------------------------------------------------------------
2018-01-14T08:32:24.512 [ERROR] Failed to execute goal org.apache.maven.plugins:maven-dependency-plugin:3.0.1:analyze-only (default) on project beam-runners-java-fn-execution: Dependency problems found -> [Help 1]
2018-01-14T08:32:24.512 [ERROR]
2018-01-14T08:32:24.512 [ERROR] To see the full stack trace of the errors, re-run Maven with the -e switch.
2018-01-14T08:32:24.512 [ERROR] Re-run Maven using the -X switch to enable full debug logging.
2018-01-14T08:32:24.512 [ERROR]
2018-01-14T08:32:24.512 [ERROR] For more information about the errors and possible solutions, please read the following articles:
2018-01-14T08:32:24.512 [ERROR] [Help 1] http://cwiki.apache.org/confluence/display/MAVEN/MojoExecutionException
2018-01-14T08:32:24.512 [ERROR]
2018-01-14T08:32:24.512 [ERROR] After correcting the problems, you can resume the build with the command
2018-01-14T08:32:24.512 [ERROR] mvn <goals> -rf :beam-runners-java-fn-execution
channel stopped
Not sending mail to unregistered user sidhom@google.com
Not sending mail to unregistered user swegner@google.com
Not sending mail to unregistered user arostami@google.com
Not sending mail to unregistered user github@alasdairhodge.co.uk
Not sending mail to unregistered user mariagh@mariagh.svl.corp.google.com
Not sending mail to unregistered user ankurgoenka@gmail.com
Not sending mail to unregistered user ehudm@google.com
Not sending mail to unregistered user klk@google.com
Not sending mail to unregistered user batbat@batbat-linuxworkstation.sea.corp.google.com
Not sending mail to unregistered user dariusz.aniszewski@polidea.com
Not sending mail to unregistered user jb@nanthrax.net
Jenkins build is back to stable : beam_Release_NightlySnapshot #655
Posted by Apache Jenkins Server <je...@builds.apache.org>.
See <https://builds.apache.org/job/beam_Release_NightlySnapshot/655/display/redirect?page=changes>
Jenkins build is unstable: beam_Release_NightlySnapshot #654
Posted by Apache Jenkins Server <je...@builds.apache.org>.
See <https://builds.apache.org/job/beam_Release_NightlySnapshot/654/display/redirect?page=changes>
Build failed in Jenkins: beam_Release_NightlySnapshot #653
Posted by Apache Jenkins Server <je...@builds.apache.org>.
See <https://builds.apache.org/job/beam_Release_NightlySnapshot/653/display/redirect>
------------------------------------------
[...truncated 3.07 MB...]
2018-01-15T08:30:17.227 [INFO] Excluding org.glassfish.hk2.external:javax.inject:jar:2.4.0-b34 from the shaded jar.
2018-01-15T08:30:17.227 [INFO] Excluding org.glassfish.hk2:hk2-locator:jar:2.4.0-b34 from the shaded jar.
2018-01-15T08:30:17.227 [INFO] Excluding org.glassfish.jersey.core:jersey-common:jar:2.22.2 from the shaded jar.
2018-01-15T08:30:17.227 [INFO] Excluding javax.annotation:javax.annotation-api:jar:1.2 from the shaded jar.
2018-01-15T08:30:17.227 [INFO] Excluding org.glassfish.jersey.bundles.repackaged:jersey-guava:jar:2.22.2 from the shaded jar.
2018-01-15T08:30:17.227 [INFO] Excluding org.glassfish.hk2:osgi-resource-locator:jar:1.0.1 from the shaded jar.
2018-01-15T08:30:17.227 [INFO] Excluding org.glassfish.jersey.core:jersey-server:jar:2.22.2 from the shaded jar.
2018-01-15T08:30:17.227 [INFO] Excluding org.glassfish.jersey.media:jersey-media-jaxb:jar:2.22.2 from the shaded jar.
2018-01-15T08:30:17.227 [INFO] Excluding org.glassfish.jersey.containers:jersey-container-servlet:jar:2.22.2 from the shaded jar.
2018-01-15T08:30:17.227 [INFO] Excluding org.glassfish.jersey.containers:jersey-container-servlet-core:jar:2.22.2 from the shaded jar.
2018-01-15T08:30:17.227 [INFO] Excluding io.netty:netty-all:jar:4.0.43.Final from the shaded jar.
2018-01-15T08:30:17.227 [INFO] Excluding io.netty:netty:jar:3.9.9.Final from the shaded jar.
2018-01-15T08:30:17.227 [INFO] Excluding io.dropwizard.metrics:metrics-jvm:jar:3.1.2 from the shaded jar.
2018-01-15T08:30:17.227 [INFO] Excluding io.dropwizard.metrics:metrics-json:jar:3.1.2 from the shaded jar.
2018-01-15T08:30:17.227 [INFO] Excluding io.dropwizard.metrics:metrics-graphite:jar:3.1.2 from the shaded jar.
2018-01-15T08:30:17.227 [INFO] Excluding org.apache.ivy:ivy:jar:2.4.0 from the shaded jar.
2018-01-15T08:30:17.227 [INFO] Excluding oro:oro:jar:2.0.8 from the shaded jar.
2018-01-15T08:30:17.227 [INFO] Excluding net.razorvine:pyrolite:jar:4.13 from the shaded jar.
2018-01-15T08:30:17.227 [INFO] Excluding net.sf.py4j:py4j:jar:0.10.4 from the shaded jar.
2018-01-15T08:30:17.227 [INFO] Excluding org.apache.spark:spark-tags_2.11:jar:2.2.1 from the shaded jar.
2018-01-15T08:30:17.227 [INFO] Excluding org.apache.commons:commons-crypto:jar:1.0.0 from the shaded jar.
2018-01-15T08:30:17.227 [INFO] Excluding org.spark-project.spark:unused:jar:1.0.0 from the shaded jar.
2018-01-15T08:30:17.227 [INFO] Excluding org.apache.spark:spark-streaming_2.11:jar:2.2.1 from the shaded jar.
2018-01-15T08:30:18.916 [INFO] Replacing original artifact with shaded artifact.
2018-01-15T08:30:19.022 [INFO]
2018-01-15T08:30:19.022 [INFO] --- maven-javadoc-plugin:3.0.0-M1:jar (attach-javadocs) @ beam-sdks-java-javadoc ---
2018-01-15T08:30:19.026 [INFO] Not executing Javadoc as the project is not a Java classpath-capable package
2018-01-15T08:30:19.133 [INFO]
2018-01-15T08:30:19.133 [INFO] --- maven-source-plugin:3.0.1:jar-no-fork (attach-sources) @ beam-sdks-java-javadoc ---
2018-01-15T08:30:19.242 [INFO]
2018-01-15T08:30:19.242 [INFO] --- maven-source-plugin:3.0.1:test-jar-no-fork (attach-test-sources) @ beam-sdks-java-javadoc ---
2018-01-15T08:30:19.349 [INFO]
2018-01-15T08:30:19.349 [INFO] --- reproducible-build-maven-plugin:0.4:strip-jar (default) @ beam-sdks-java-javadoc ---
2018-01-15T08:30:19.350 [INFO] Stripping <https://builds.apache.org/job/beam_Release_NightlySnapshot/ws/src/sdks/java/javadoc/target/javadoc.jar>
2018-01-15T08:30:19.517 [INFO]
2018-01-15T08:30:19.517 [INFO] --- maven-dependency-plugin:3.0.1:analyze-only (default) @ beam-sdks-java-javadoc ---
2018-01-15T08:30:19.519 [INFO] Skipping plugin execution
2018-01-15T08:30:19.625 [INFO]
2018-01-15T08:30:19.625 [INFO] --- maven-install-plugin:2.5.2:install (default-install) @ beam-sdks-java-javadoc ---
2018-01-15T08:30:19.626 [INFO] Installing <https://builds.apache.org/job/beam_Release_NightlySnapshot/ws/src/sdks/java/javadoc/pom.xml> to <https://builds.apache.org/job/beam_Release_NightlySnapshot/ws/.repository/org/apache/beam/beam-sdks-java-javadoc/2.3.0-SNAPSHOT/beam-sdks-java-javadoc-2.3.0-SNAPSHOT.pom>
2018-01-15T08:30:19.628 [INFO] Installing <https://builds.apache.org/job/beam_Release_NightlySnapshot/ws/src/sdks/java/javadoc/target/javadoc.jar> to <https://builds.apache.org/job/beam_Release_NightlySnapshot/ws/.repository/org/apache/beam/beam-sdks-java-javadoc/2.3.0-SNAPSHOT/beam-sdks-java-javadoc-2.3.0-SNAPSHOT.jar>
2018-01-15T08:30:19.760 [INFO]
2018-01-15T08:30:19.760 [INFO] --- maven-deploy-plugin:2.8.2:deploy (default-deploy) @ beam-sdks-java-javadoc ---
2018-01-15T08:30:19.763 [INFO] Downloading: https://repository.apache.org/content/repositories/snapshots/org/apache/beam/beam-sdks-java-javadoc/2.3.0-SNAPSHOT/maven-metadata.xml
2018-01-15T08:30:19.998 [INFO] Downloaded: https://repository.apache.org/content/repositories/snapshots/org/apache/beam/beam-sdks-java-javadoc/2.3.0-SNAPSHOT/maven-metadata.xml (790 B at 3.3 KB/sec)
2018-01-15T08:30:19.999 [INFO] Uploading: https://repository.apache.org/content/repositories/snapshots/org/apache/beam/beam-sdks-java-javadoc/2.3.0-SNAPSHOT/beam-sdks-java-javadoc-2.3.0-20180115.083019-76.pom
2018-01-15T08:30:20.367 [INFO] Uploaded: https://repository.apache.org/content/repositories/snapshots/org/apache/beam/beam-sdks-java-javadoc/2.3.0-SNAPSHOT/beam-sdks-java-javadoc-2.3.0-20180115.083019-76.pom (10 KB at 26.1 KB/sec)
2018-01-15T08:30:20.367 [INFO] Downloading: https://repository.apache.org/content/repositories/snapshots/org/apache/beam/beam-sdks-java-javadoc/maven-metadata.xml
2018-01-15T08:30:20.641 [INFO] Downloaded: https://repository.apache.org/content/repositories/snapshots/org/apache/beam/beam-sdks-java-javadoc/maven-metadata.xml (397 B at 1.4 KB/sec)
2018-01-15T08:30:20.684 [INFO] Uploading: https://repository.apache.org/content/repositories/snapshots/org/apache/beam/beam-sdks-java-javadoc/2.3.0-SNAPSHOT/maven-metadata.xml
2018-01-15T08:30:21.076 [INFO] Uploaded: https://repository.apache.org/content/repositories/snapshots/org/apache/beam/beam-sdks-java-javadoc/2.3.0-SNAPSHOT/maven-metadata.xml (790 B at 2.0 KB/sec)
2018-01-15T08:30:21.076 [INFO] Uploading: https://repository.apache.org/content/repositories/snapshots/org/apache/beam/beam-sdks-java-javadoc/maven-metadata.xml
2018-01-15T08:30:21.445 [INFO] Uploaded: https://repository.apache.org/content/repositories/snapshots/org/apache/beam/beam-sdks-java-javadoc/maven-metadata.xml (397 B at 1.1 KB/sec)
2018-01-15T08:30:21.446 [INFO] Uploading: https://repository.apache.org/content/repositories/snapshots/org/apache/beam/beam-sdks-java-javadoc/2.3.0-SNAPSHOT/beam-sdks-java-javadoc-2.3.0-20180115.083019-76.jar
2018-01-15T08:30:22.372 [INFO] Uploaded: https://repository.apache.org/content/repositories/snapshots/org/apache/beam/beam-sdks-java-javadoc/2.3.0-SNAPSHOT/beam-sdks-java-javadoc-2.3.0-20180115.083019-76.jar (4740 KB at 5117.9 KB/sec)
2018-01-15T08:30:22.372 [INFO] Uploading: https://repository.apache.org/content/repositories/snapshots/org/apache/beam/beam-sdks-java-javadoc/2.3.0-SNAPSHOT/maven-metadata.xml
2018-01-15T08:30:22.740 [INFO] Uploaded: https://repository.apache.org/content/repositories/snapshots/org/apache/beam/beam-sdks-java-javadoc/2.3.0-SNAPSHOT/maven-metadata.xml (790 B at 2.1 KB/sec)
[JENKINS] Archiving disabled
[JENKINS] Archiving disabled
[JENKINS] Archiving disabled
[JENKINS] Archiving disabled
[JENKINS] Archiving disabled
[JENKINS] Archiving disabled
[JENKINS] Archiving disabled
[JENKINS] Archiving disabled
[JENKINS] Archiving disabled
[JENKINS] Archiving disabled
[JENKINS] Archiving disabled
[JENKINS] Archiving disabled
[JENKINS] Archiving disabled
[JENKINS] Archiving disabled
[JENKINS] Archiving disabled
[JENKINS] Archiving disabled
[JENKINS] Archiving disabled
[JENKINS] Archiving disabled
[JENKINS] Archiving disabled
[JENKINS] Archiving disabled
[JENKINS] Archiving disabled
[JENKINS] Archiving disabled
[JENKINS] Archiving disabled
[JENKINS] Archiving disabled
[JENKINS] Archiving disabled
[JENKINS] Archiving disabled
[JENKINS] Archiving disabled
[JENKINS] Archiving disabled
[JENKINS] Archiving disabled
[JENKINS] Archiving disabled
[JENKINS] Archiving disabled
[JENKINS] Archiving disabled
[JENKINS] Archiving disabled
[JENKINS] Archiving disabled
[JENKINS] Archiving disabled
[JENKINS] Archiving disabled
[JENKINS] Archiving disabled
[JENKINS] Archiving disabled
[JENKINS] Archiving disabled
[JENKINS] Archiving disabled
[JENKINS] Archiving disabled
[JENKINS] Archiving disabled
[JENKINS] Archiving disabled
[JENKINS] Archiving disabled
[JENKINS] Archiving disabled
[JENKINS] Archiving disabled
[JENKINS] Archiving disabled
[JENKINS] Archiving disabled
[JENKINS] Archiving disabled
[JENKINS] Archiving disabled
[JENKINS] Archiving disabled
[JENKINS] Archiving disabled
[JENKINS] Archiving disabled
[JENKINS] Archiving disabled
[JENKINS] Archiving disabled
[JENKINS] Archiving disabled
[JENKINS] Archiving disabled
[JENKINS] Archiving disabled
[JENKINS] Archiving disabled
[JENKINS] Archiving disabled
[JENKINS] Archiving disabled
[JENKINS] Archiving disabled
[JENKINS] Archiving disabled
[JENKINS] Archiving disabled
[JENKINS] Archiving disabled
[JENKINS] Archiving disabled
[JENKINS] Archiving disabled
[JENKINS] Archiving disabled
[JENKINS] Archiving disabled
[JENKINS] Archiving disabled
[JENKINS] Archiving disabled
[JENKINS] Archiving disabled
[JENKINS] Archiving disabled
[JENKINS] Archiving disabled
[JENKINS] Archiving disabled
[JENKINS] Archiving disabled
[JENKINS] Archiving disabled
[JENKINS] Archiving disabled
[JENKINS] Archiving disabled
[JENKINS] Archiving disabled2018-01-15T08:31:34.540 [INFO] ------------------------------------------------------------------------
2018-01-15T08:31:34.540 [INFO] Reactor Summary:
2018-01-15T08:31:34.540 [INFO]
2018-01-15T08:31:34.540 [INFO] Apache Beam :: Parent .............................. SUCCESS [ 11.539 s]
2018-01-15T08:31:34.540 [INFO] Apache Beam :: SDKs :: Java :: Build Tools ......... SUCCESS [ 12.069 s]
2018-01-15T08:31:34.540 [INFO] Apache Beam :: Model ............................... SUCCESS [ 4.099 s]
2018-01-15T08:31:34.540 [INFO] Apache Beam :: Model :: Pipeline ................... SUCCESS [ 25.247 s]
2018-01-15T08:31:34.540 [INFO] Apache Beam :: Model :: Job Management ............. SUCCESS [ 19.427 s]
2018-01-15T08:31:34.540 [INFO] Apache Beam :: Model :: Fn Execution ............... SUCCESS [ 23.481 s]
2018-01-15T08:31:34.540 [INFO] Apache Beam :: SDKs ................................ SUCCESS [ 4.820 s]
2018-01-15T08:31:34.540 [INFO] Apache Beam :: SDKs :: Go .......................... SUCCESS [ 14.611 s]
2018-01-15T08:31:34.540 [INFO] Apache Beam :: SDKs :: Java ........................ SUCCESS [ 5.071 s]
2018-01-15T08:31:34.540 [INFO] Apache Beam :: SDKs :: Java :: Core ................ SUCCESS [03:04 min]
2018-01-15T08:31:34.540 [INFO] Apache Beam :: Runners ............................. SUCCESS [ 4.989 s]
2018-01-15T08:31:34.540 [INFO] Apache Beam :: Runners :: Local Java Core .......... SUCCESS [ 17.652 s]
2018-01-15T08:31:34.540 [INFO] Apache Beam :: Runners :: Core Construction Java ... SUCCESS [ 36.156 s]
2018-01-15T08:31:34.540 [INFO] Apache Beam :: Runners :: Core Java ................ SUCCESS [ 48.548 s]
2018-01-15T08:31:34.540 [INFO] Apache Beam :: Runners :: Direct Java .............. SUCCESS [04:42 min]
2018-01-15T08:31:34.540 [INFO] Apache Beam :: SDKs :: Java :: IO .................. SUCCESS [ 4.781 s]
2018-01-15T08:31:34.540 [INFO] Apache Beam :: SDKs :: Java :: IO :: AMQP .......... SUCCESS [ 29.463 s]
2018-01-15T08:31:34.540 [INFO] Apache Beam :: SDKs :: Java :: IO :: Common ........ SUCCESS [ 12.702 s]
2018-01-15T08:31:34.540 [INFO] Apache Beam :: SDKs :: Java :: IO :: Cassandra ..... SUCCESS [ 29.885 s]
2018-01-15T08:31:34.540 [INFO] Apache Beam :: SDKs :: Java :: IO :: Elasticsearch . SUCCESS [ 19.887 s]
2018-01-15T08:31:34.540 [INFO] Apache Beam :: SDKs :: Java :: IO :: Elasticsearch-Tests SUCCESS [ 6.653 s]
2018-01-15T08:31:34.540 [INFO] Apache Beam :: SDKs :: Java :: IO :: Elasticsearch-Tests :: Common SUCCESS [ 10.515 s]
2018-01-15T08:31:34.540 [INFO] Apache Beam :: SDKs :: Java :: IO :: Elasticsearch-Tests :: 2.x SUCCESS [ 28.612 s]
2018-01-15T08:31:34.541 [INFO] Apache Beam :: SDKs :: Java :: IO :: Elasticsearch-Tests :: 5.x SUCCESS [ 31.614 s]
2018-01-15T08:31:34.541 [INFO] Apache Beam :: SDKs :: Java :: Extensions .......... SUCCESS [ 5.062 s]
2018-01-15T08:31:34.541 [INFO] Apache Beam :: SDKs :: Java :: Extensions :: Google Cloud Platform Core SUCCESS [ 32.506 s]
2018-01-15T08:31:34.541 [INFO] Apache Beam :: SDKs :: Java :: Extensions :: Protobuf SUCCESS [ 25.526 s]
2018-01-15T08:31:34.541 [INFO] Apache Beam :: SDKs :: Java :: IO :: Google Cloud Platform SUCCESS [02:03 min]
2018-01-15T08:31:34.541 [INFO] Apache Beam :: Runners :: Google Cloud Dataflow .... SUCCESS [07:19 min]
2018-01-15T08:31:34.541 [INFO] Apache Beam :: SDKs :: Java :: IO :: File-based-io-tests SUCCESS [ 13.142 s]
2018-01-15T08:31:34.541 [INFO] Apache Beam :: SDKs :: Java :: IO :: Hadoop Common . SUCCESS [ 22.720 s]
2018-01-15T08:31:34.541 [INFO] Apache Beam :: SDKs :: Java :: IO :: Hadoop File System SUCCESS [ 43.930 s]
2018-01-15T08:31:34.541 [INFO] Apache Beam :: SDKs :: Java :: IO :: Hadoop ........ SUCCESS [ 7.354 s]
2018-01-15T08:31:34.541 [INFO] Apache Beam :: SDKs :: Java :: IO :: Hadoop :: input-format SUCCESS [ 28.384 s]
2018-01-15T08:31:34.541 [INFO] Apache Beam :: SDKs :: Java :: IO :: Hadoop :: jdk1.8-tests SUCCESS [01:01 min]
2018-01-15T08:31:34.541 [INFO] Apache Beam :: SDKs :: Java :: IO :: HBase ......... SUCCESS [01:22 min]
2018-01-15T08:31:34.541 [INFO] Apache Beam :: SDKs :: Java :: IO :: HCatalog ...... SUCCESS [01:04 min]
2018-01-15T08:31:34.541 [INFO] Apache Beam :: SDKs :: Java :: IO :: JDBC .......... SUCCESS [ 54.269 s]
2018-01-15T08:31:34.541 [INFO] Apache Beam :: SDKs :: Java :: IO :: JMS ........... SUCCESS [ 33.184 s]
2018-01-15T08:31:34.541 [INFO] Apache Beam :: SDKs :: Java :: IO :: Kafka ......... SUCCESS [ 42.570 s]
2018-01-15T08:31:34.541 [INFO] Apache Beam :: SDKs :: Java :: IO :: Kinesis ....... SUCCESS [ 56.384 s]
2018-01-15T08:31:34.541 [INFO] Apache Beam :: SDKs :: Java :: IO :: MongoDB ....... SUCCESS [ 54.085 s]
2018-01-15T08:31:34.541 [INFO] Apache Beam :: SDKs :: Java :: IO :: MQTT .......... SUCCESS [ 36.354 s]
2018-01-15T08:31:34.541 [INFO] Apache Beam :: SDKs :: Java :: IO :: Redis ......... SUCCESS [ 30.977 s]
2018-01-15T08:31:34.541 [INFO] Apache Beam :: SDKs :: Java :: IO :: Solr .......... SUCCESS [ 53.205 s]
2018-01-15T08:31:34.541 [INFO] Apache Beam :: SDKs :: Java :: IO :: Tika .......... SUCCESS [ 29.011 s]
2018-01-15T08:31:34.541 [INFO] Apache Beam :: SDKs :: Java :: IO :: XML ........... SUCCESS [ 46.003 s]
2018-01-15T08:31:34.541 [INFO] Apache Beam :: SDKs :: Java :: Maven Archetypes .... SUCCESS [ 4.359 s]
2018-01-15T08:31:34.541 [INFO] Apache Beam :: SDKs :: Java :: Maven Archetypes :: Starter SUCCESS [ 16.633 s]
2018-01-15T08:31:34.541 [INFO] Apache Beam :: Examples ............................ SUCCESS [ 5.264 s]
2018-01-15T08:31:34.541 [INFO] Apache Beam :: Examples :: Java .................... SUCCESS [05:10 min]
2018-01-15T08:31:34.541 [INFO] Apache Beam :: SDKs :: Java :: Maven Archetypes :: Examples SUCCESS [ 44.025 s]
2018-01-15T08:31:34.541 [INFO] Apache Beam :: Examples :: Java 8 .................. SUCCESS [ 47.793 s]
2018-01-15T08:31:34.541 [INFO] Apache Beam :: SDKs :: Java :: Maven Archetypes :: Examples - Java 8 SUCCESS [ 50.557 s]
2018-01-15T08:31:34.541 [INFO] Apache Beam :: SDKs :: Java :: Extensions :: Jackson SUCCESS [ 30.458 s]
2018-01-15T08:31:34.541 [INFO] Apache Beam :: SDKs :: Java :: Extensions :: Join library SUCCESS [ 33.133 s]
2018-01-15T08:31:34.541 [INFO] Apache Beam :: SDKs :: Java :: Extensions :: Sketching SUCCESS [ 34.391 s]
2018-01-15T08:31:34.541 [INFO] Apache Beam :: SDKs :: Java :: Extensions :: Sorter SUCCESS [ 53.066 s]
2018-01-15T08:31:34.541 [INFO] Apache Beam :: SDKs :: Java :: Extensions :: SQL ... SUCCESS [01:46 min]
2018-01-15T08:31:34.541 [INFO] Apache Beam :: SDKs :: Java :: Fn Execution ........ SUCCESS [ 38.035 s]
2018-01-15T08:31:34.541 [INFO] Apache Beam :: SDKs :: Java :: Nexmark ............. SUCCESS [01:55 min]
2018-01-15T08:31:34.541 [INFO] Apache Beam :: SDKs :: Java :: Harness ............. SUCCESS [ 48.485 s]
2018-01-15T08:31:34.541 [INFO] Apache Beam :: SDKs :: Java :: Container ........... SUCCESS [ 11.303 s]
2018-01-15T08:31:34.541 [INFO] Apache Beam :: SDKs :: Java :: Java 8 Tests ........ SUCCESS [ 21.226 s]
2018-01-15T08:31:34.541 [INFO] Apache Beam :: SDKs :: Python ...................... SUCCESS [26:27 min]
2018-01-15T08:31:34.541 [INFO] Apache Beam :: SDKs :: Python :: Container ......... SUCCESS [ 8.949 s]
2018-01-15T08:31:34.541 [INFO] Apache Beam :: Runners :: Java Fn Execution ........ FAILURE [ 21.987 s]
2018-01-15T08:31:34.541 [INFO] Apache Beam :: Runners :: Java Local Artifact Service SKIPPED
2018-01-15T08:31:34.541 [INFO] Apache Beam :: Runners :: Reference ................ SUCCESS [ 4.755 s]
2018-01-15T08:31:34.541 [INFO] Apache Beam :: Runners :: Reference :: Java ........ SUCCESS [ 18.223 s]
2018-01-15T08:31:34.541 [INFO] Apache Beam :: Runners :: Reference :: Job Orchestrator SKIPPED
2018-01-15T08:31:34.541 [INFO] Apache Beam :: Runners :: Flink .................... SUCCESS [ 47.473 s]
2018-01-15T08:31:34.541 [INFO] Apache Beam :: Runners :: Spark .................... SUCCESS [02:32 min]
2018-01-15T08:31:34.541 [INFO] Apache Beam :: Runners :: Apex ..................... SUCCESS [01:16 min]
2018-01-15T08:31:34.541 [INFO] Apache Beam :: Runners :: Google Cloud Platform .... SUCCESS [ 5.548 s]
2018-01-15T08:31:34.541 [INFO] Apache Beam :: Runners :: Google Cloud Platform :: GCE metadata provisioning SUCCESS [ 9.429 s]
2018-01-15T08:31:34.541 [INFO] Apache Beam :: Runners :: Google Cloud Platform :: GCS artifact proxy SUCCESS [ 8.935 s]
2018-01-15T08:31:34.541 [INFO] Apache Beam :: Runners :: Gearpump ................. SUCCESS [ 36.066 s]
2018-01-15T08:31:34.541 [INFO] Apache Beam :: SDKs :: Java :: Aggregated Javadoc .. SUCCESS [ 33.544 s]
2018-01-15T08:31:34.541 [INFO] ------------------------------------------------------------------------
2018-01-15T08:31:34.541 [INFO] BUILD FAILURE
2018-01-15T08:31:34.541 [INFO] ------------------------------------------------------------------------
2018-01-15T08:31:34.542 [INFO] Total time: 01:30 h
2018-01-15T08:31:34.542 [INFO] Finished at: 2018-01-15T08:31:34+00:00
2018-01-15T08:31:35.454 [INFO] Final Memory: 384M/1786M
2018-01-15T08:31:35.455 [INFO] ------------------------------------------------------------------------
Waiting for Jenkins to finish collecting data
2018-01-15T08:31:35.994 [ERROR] Failed to execute goal org.apache.maven.plugins:maven-dependency-plugin:3.0.1:analyze-only (default) on project beam-runners-java-fn-execution: Dependency problems found -> [Help 1]
2018-01-15T08:31:35.994 [ERROR]
2018-01-15T08:31:35.995 [ERROR] To see the full stack trace of the errors, re-run Maven with the -e switch.
2018-01-15T08:31:35.995 [ERROR] Re-run Maven using the -X switch to enable full debug logging.
2018-01-15T08:31:35.995 [ERROR]
2018-01-15T08:31:35.995 [ERROR] For more information about the errors and possible solutions, please read the following articles:
2018-01-15T08:31:35.995 [ERROR] [Help 1] http://cwiki.apache.org/confluence/display/MAVEN/MojoExecutionException
2018-01-15T08:31:35.995 [ERROR]
2018-01-15T08:31:35.995 [ERROR] After correcting the problems, you can resume the build with the command
2018-01-15T08:31:35.995 [ERROR] mvn <goals> -rf :beam-runners-java-fn-execution
channel stopped
Not sending mail to unregistered user sidhom@google.com
Not sending mail to unregistered user swegner@google.com
Not sending mail to unregistered user arostami@google.com
Not sending mail to unregistered user github@alasdairhodge.co.uk
Not sending mail to unregistered user mariagh@mariagh.svl.corp.google.com
Not sending mail to unregistered user ankurgoenka@gmail.com
Not sending mail to unregistered user ehudm@google.com
Not sending mail to unregistered user klk@google.com
Not sending mail to unregistered user batbat@batbat-linuxworkstation.sea.corp.google.com
Not sending mail to unregistered user dariusz.aniszewski@polidea.com
Not sending mail to unregistered user jb@nanthrax.net