You are viewing a plain text version of this content. The canonical link for it is here.
Posted to dev@kafka.apache.org by Apache Jenkins Server <je...@builds.apache.org> on 2017/05/31 07:10:21 UTC

Build failed in Jenkins: kafka-trunk-jdk8 #1616

See <https://builds.apache.org/job/kafka-trunk-jdk8/1616/display/redirect?page=changes>

Changes:

[jason] KAFKA-5211; Do not skip a corrupted record in consumer

------------------------------------------
[...truncated 3.54 MB...]
org.apache.kafka.common.security.scram.ScramMessagesTest > validServerFirstMessage STARTED

org.apache.kafka.common.security.scram.ScramMessagesTest > validServerFirstMessage PASSED

org.apache.kafka.common.security.scram.ScramMessagesTest > invalidServerFinalMessage STARTED

org.apache.kafka.common.security.scram.ScramMessagesTest > invalidServerFinalMessage PASSED

org.apache.kafka.common.security.scram.ScramMessagesTest > invalidClientFirstMessage STARTED

org.apache.kafka.common.security.scram.ScramMessagesTest > invalidClientFirstMessage PASSED

org.apache.kafka.common.security.scram.ScramMessagesTest > validClientFinalMessage STARTED

org.apache.kafka.common.security.scram.ScramMessagesTest > validClientFinalMessage PASSED

org.apache.kafka.common.security.scram.ScramMessagesTest > invalidServerFirstMessage STARTED

org.apache.kafka.common.security.scram.ScramMessagesTest > invalidServerFirstMessage PASSED

org.apache.kafka.common.security.scram.ScramMessagesTest > validServerFinalMessage STARTED

org.apache.kafka.common.security.scram.ScramMessagesTest > validServerFinalMessage PASSED

org.apache.kafka.common.security.ssl.SslFactoryTest > testSslFactoryWithoutPasswordConfiguration STARTED

org.apache.kafka.common.security.ssl.SslFactoryTest > testSslFactoryWithoutPasswordConfiguration PASSED

org.apache.kafka.common.security.ssl.SslFactoryTest > testClientMode STARTED

org.apache.kafka.common.security.ssl.SslFactoryTest > testClientMode PASSED

org.apache.kafka.common.security.ssl.SslFactoryTest > testSslFactoryConfiguration STARTED

org.apache.kafka.common.security.ssl.SslFactoryTest > testSslFactoryConfiguration PASSED

org.apache.kafka.common.security.kerberos.KerberosNameTest > testParse STARTED

org.apache.kafka.common.security.kerberos.KerberosNameTest > testParse PASSED

org.apache.kafka.common.security.auth.KafkaPrincipalTest > testPrincipalNameCanContainSeparator STARTED

org.apache.kafka.common.security.auth.KafkaPrincipalTest > testPrincipalNameCanContainSeparator PASSED

org.apache.kafka.common.security.auth.KafkaPrincipalTest > testEqualsAndHashCode STARTED

org.apache.kafka.common.security.auth.KafkaPrincipalTest > testEqualsAndHashCode PASSED

org.apache.kafka.common.security.JaasContextTest > testLoadForServerWithListenerNameOverride STARTED

org.apache.kafka.common.security.JaasContextTest > testLoadForServerWithListenerNameOverride PASSED

org.apache.kafka.common.security.JaasContextTest > testMissingOptionValue STARTED

org.apache.kafka.common.security.JaasContextTest > testMissingOptionValue PASSED

org.apache.kafka.common.security.JaasContextTest > testSingleOption STARTED

org.apache.kafka.common.security.JaasContextTest > testSingleOption PASSED

org.apache.kafka.common.security.JaasContextTest > testNumericOptionWithoutQuotes STARTED

org.apache.kafka.common.security.JaasContextTest > testNumericOptionWithoutQuotes PASSED

org.apache.kafka.common.security.JaasContextTest > testConfigNoOptions STARTED

org.apache.kafka.common.security.JaasContextTest > testConfigNoOptions PASSED

org.apache.kafka.common.security.JaasContextTest > testLoadForServerWithWrongListenerName STARTED

org.apache.kafka.common.security.JaasContextTest > testLoadForServerWithWrongListenerName PASSED

org.apache.kafka.common.security.JaasContextTest > testNumericOptionWithQuotes STARTED

org.apache.kafka.common.security.JaasContextTest > testNumericOptionWithQuotes PASSED

org.apache.kafka.common.security.JaasContextTest > testQuotedOptionValue STARTED

org.apache.kafka.common.security.JaasContextTest > testQuotedOptionValue PASSED

org.apache.kafka.common.security.JaasContextTest > testMissingLoginModule STARTED

org.apache.kafka.common.security.JaasContextTest > testMissingLoginModule PASSED

org.apache.kafka.common.security.JaasContextTest > testMissingSemicolon STARTED

org.apache.kafka.common.security.JaasContextTest > testMissingSemicolon PASSED

org.apache.kafka.common.security.JaasContextTest > testMultipleOptions STARTED

org.apache.kafka.common.security.JaasContextTest > testMultipleOptions PASSED

org.apache.kafka.common.security.JaasContextTest > testLoadForClientWithListenerName STARTED

org.apache.kafka.common.security.JaasContextTest > testLoadForClientWithListenerName PASSED

org.apache.kafka.common.security.JaasContextTest > testMultipleLoginModules STARTED

org.apache.kafka.common.security.JaasContextTest > testMultipleLoginModules PASSED

org.apache.kafka.common.security.JaasContextTest > testMissingControlFlag STARTED

org.apache.kafka.common.security.JaasContextTest > testMissingControlFlag PASSED

org.apache.kafka.common.security.JaasContextTest > testLoadForServerWithListenerNameAndFallback STARTED

org.apache.kafka.common.security.JaasContextTest > testLoadForServerWithListenerNameAndFallback PASSED

org.apache.kafka.common.security.JaasContextTest > testQuotedOptionName STARTED

org.apache.kafka.common.security.JaasContextTest > testQuotedOptionName PASSED

org.apache.kafka.common.security.JaasContextTest > testControlFlag STARTED

org.apache.kafka.common.security.JaasContextTest > testControlFlag PASSED

org.apache.kafka.common.security.authenticator.SaslAuthenticatorTest > testMissingUsernameSaslPlain STARTED

org.apache.kafka.common.security.authenticator.SaslAuthenticatorTest > testMissingUsernameSaslPlain PASSED

org.apache.kafka.common.security.authenticator.SaslAuthenticatorTest > testValidSaslScramMechanisms STARTED

org.apache.kafka.common.security.authenticator.SaslAuthenticatorTest > testValidSaslScramMechanisms PASSED

org.apache.kafka.common.security.authenticator.SaslAuthenticatorTest > testUnauthenticatedApiVersionsRequestOverPlaintext STARTED

org.apache.kafka.common.security.authenticator.SaslAuthenticatorTest > testUnauthenticatedApiVersionsRequestOverPlaintext PASSED

org.apache.kafka.common.security.authenticator.SaslAuthenticatorTest > testMechanismPluggability STARTED

org.apache.kafka.common.security.authenticator.SaslAuthenticatorTest > testMechanismPluggability PASSED

org.apache.kafka.common.security.authenticator.SaslAuthenticatorTest > testScramUsernameWithSpecialCharacters STARTED

org.apache.kafka.common.security.authenticator.SaslAuthenticatorTest > testScramUsernameWithSpecialCharacters PASSED

org.apache.kafka.common.security.authenticator.SaslAuthenticatorTest > testApiVersionsRequestWithUnsupportedVersion STARTED

org.apache.kafka.common.security.authenticator.SaslAuthenticatorTest > testApiVersionsRequestWithUnsupportedVersion PASSED

org.apache.kafka.common.security.authenticator.SaslAuthenticatorTest > testMissingPasswordSaslPlain STARTED

org.apache.kafka.common.security.authenticator.SaslAuthenticatorTest > testMissingPasswordSaslPlain PASSED

org.apache.kafka.common.security.authenticator.SaslAuthenticatorTest > testInvalidLoginModule STARTED

org.apache.kafka.common.security.authenticator.SaslAuthenticatorTest > testInvalidLoginModule PASSED

org.apache.kafka.common.security.authenticator.SaslAuthenticatorTest > testValidSaslScramSha256 STARTED

org.apache.kafka.common.security.authenticator.SaslAuthenticatorTest > testValidSaslScramSha256 PASSED

org.apache.kafka.common.security.authenticator.SaslAuthenticatorTest > testInvalidMechanism STARTED

org.apache.kafka.common.security.authenticator.SaslAuthenticatorTest > testInvalidMechanism PASSED

org.apache.kafka.common.security.authenticator.SaslAuthenticatorTest > testDisabledMechanism STARTED

org.apache.kafka.common.security.authenticator.SaslAuthenticatorTest > testDisabledMechanism PASSED

org.apache.kafka.common.security.authenticator.SaslAuthenticatorTest > testDynamicJaasConfiguration STARTED

org.apache.kafka.common.security.authenticator.SaslAuthenticatorTest > testDynamicJaasConfiguration PASSED

org.apache.kafka.common.security.authenticator.SaslAuthenticatorTest > testPacketSizeTooBig STARTED

org.apache.kafka.common.security.authenticator.SaslAuthenticatorTest > testPacketSizeTooBig PASSED

org.apache.kafka.common.security.authenticator.SaslAuthenticatorTest > testInvalidUsernameSaslPlain STARTED

org.apache.kafka.common.security.authenticator.SaslAuthenticatorTest > testInvalidUsernameSaslPlain PASSED

org.apache.kafka.common.security.authenticator.SaslAuthenticatorTest > testUserCredentialsUnavailableForScramMechanism STARTED

org.apache.kafka.common.security.authenticator.SaslAuthenticatorTest > testUserCredentialsUnavailableForScramMechanism PASSED

org.apache.kafka.common.security.authenticator.SaslAuthenticatorTest > testMultipleServerMechanisms STARTED

org.apache.kafka.common.security.authenticator.SaslAuthenticatorTest > testMultipleServerMechanisms PASSED

org.apache.kafka.common.security.authenticator.SaslAuthenticatorTest > testValidSaslPlainOverPlaintext STARTED

org.apache.kafka.common.security.authenticator.SaslAuthenticatorTest > testValidSaslPlainOverPlaintext PASSED

org.apache.kafka.common.security.authenticator.SaslAuthenticatorTest > testValidSaslPlainOverSsl STARTED

org.apache.kafka.common.security.authenticator.SaslAuthenticatorTest > testValidSaslPlainOverSsl PASSED

org.apache.kafka.common.security.authenticator.SaslAuthenticatorTest > testInvalidApiVersionsRequestSequence STARTED

org.apache.kafka.common.security.authenticator.SaslAuthenticatorTest > testInvalidApiVersionsRequestSequence PASSED

org.apache.kafka.common.security.authenticator.SaslAuthenticatorTest > testDisallowedKafkaRequestsBeforeAuthentication STARTED

org.apache.kafka.common.security.authenticator.SaslAuthenticatorTest > testDisallowedKafkaRequestsBeforeAuthentication PASSED

org.apache.kafka.common.security.authenticator.SaslAuthenticatorTest > testUnauthenticatedApiVersionsRequestOverSsl STARTED

org.apache.kafka.common.security.authenticator.SaslAuthenticatorTest > testUnauthenticatedApiVersionsRequestOverSsl PASSED

org.apache.kafka.common.security.authenticator.SaslAuthenticatorTest > testInvalidPasswordSaslPlain STARTED

org.apache.kafka.common.security.authenticator.SaslAuthenticatorTest > testInvalidPasswordSaslPlain PASSED

org.apache.kafka.common.security.authenticator.SaslAuthenticatorTest > testInvalidPasswordSaslScram STARTED

org.apache.kafka.common.security.authenticator.SaslAuthenticatorTest > testInvalidPasswordSaslScram PASSED

org.apache.kafka.common.security.authenticator.SaslAuthenticatorTest > testInvalidSaslPacket STARTED

org.apache.kafka.common.security.authenticator.SaslAuthenticatorTest > testInvalidSaslPacket PASSED

org.apache.kafka.common.security.authenticator.SaslAuthenticatorTest > testSaslHandshakeRequestWithUnsupportedVersion STARTED

org.apache.kafka.common.security.authenticator.SaslAuthenticatorTest > testSaslHandshakeRequestWithUnsupportedVersion PASSED

org.apache.kafka.common.security.authenticator.SaslAuthenticatorTest > testJaasConfigurationForListener STARTED

org.apache.kafka.common.security.authenticator.SaslAuthenticatorTest > testJaasConfigurationForListener PASSED

org.apache.kafka.common.security.authenticator.SaslAuthenticatorTest > testUnknownUserSaslScram STARTED

org.apache.kafka.common.security.authenticator.SaslAuthenticatorTest > testUnknownUserSaslScram PASSED

3648 tests completed, 1 failed
:clients:test FAILED

FAILURE: Build failed with an exception.

* What went wrong:
Execution failed for task ':clients:test'.
> There were failing tests. See the report at: file://<https://builds.apache.org/job/kafka-trunk-jdk8/ws/clients/build/reports/tests/test/index.html>

* Try:
Run with --stacktrace option to get the stack trace. Run with --info or --debug option to get more log output.

BUILD FAILED

Total time: 2 mins 31.485 secs
Build step 'Execute shell' marked build as failure
[FINDBUGS] Collecting findbugs analysis files...
Setting GRADLE_3_4_RC_2_HOME=/home/jenkins/jenkins-slave/tools/hudson.plugins.gradle.GradleInstallation/Gradle_3.4-rc-2
[FINDBUGS] Searching for all files in <https://builds.apache.org/job/kafka-trunk-jdk8/ws/> that match the pattern **/build/reports/findbugs/*.xml
[FINDBUGS] Parsing 1 file in <https://builds.apache.org/job/kafka-trunk-jdk8/ws/>
[FINDBUGS] Successfully parsed file <https://builds.apache.org/job/kafka-trunk-jdk8/ws/clients/build/reports/findbugs/main.xml> with 0 unique warnings and 0 duplicates.
[FINDBUGS] Computing warning deltas based on reference build #1614
Recording test results
Setting GRADLE_3_4_RC_2_HOME=/home/jenkins/jenkins-slave/tools/hudson.plugins.gradle.GradleInstallation/Gradle_3.4-rc-2
Setting GRADLE_3_4_RC_2_HOME=/home/jenkins/jenkins-slave/tools/hudson.plugins.gradle.GradleInstallation/Gradle_3.4-rc-2

Jenkins build is back to normal : kafka-trunk-jdk8 #1618

Posted by Apache Jenkins Server <je...@builds.apache.org>.
See <https://builds.apache.org/job/kafka-trunk-jdk8/1618/display/redirect?page=changes>


Build failed in Jenkins: kafka-trunk-jdk8 #1617

Posted by Apache Jenkins Server <je...@builds.apache.org>.
See <https://builds.apache.org/job/kafka-trunk-jdk8/1617/display/redirect?page=changes>

Changes:

[wangguoz] KAKFA-5334: Allow rocksdb.config.setter to be specified as a String or

[wangguoz] KAFKA-5308; TC should handle UNSUPPORTED_FOR_MESSAGE_FORMAT in

------------------------------------------
[...truncated 903.63 KB...]
kafka.security.auth.SimpleAclAuthorizerTest > testLoadCache PASSED

kafka.integration.PrimitiveApiTest > testMultiProduce STARTED

kafka.integration.PrimitiveApiTest > testMultiProduce PASSED

kafka.integration.PrimitiveApiTest > testDefaultEncoderProducerAndFetch STARTED

kafka.integration.PrimitiveApiTest > testDefaultEncoderProducerAndFetch PASSED

kafka.integration.PrimitiveApiTest > testFetchRequestCanProperlySerialize STARTED

kafka.integration.PrimitiveApiTest > testFetchRequestCanProperlySerialize PASSED

kafka.integration.PrimitiveApiTest > testPipelinedProduceRequests STARTED

kafka.integration.PrimitiveApiTest > testPipelinedProduceRequests PASSED

kafka.integration.PrimitiveApiTest > testProduceAndMultiFetch STARTED

kafka.integration.PrimitiveApiTest > testProduceAndMultiFetch PASSED

kafka.integration.PrimitiveApiTest > testDefaultEncoderProducerAndFetchWithCompression STARTED

kafka.integration.PrimitiveApiTest > testDefaultEncoderProducerAndFetchWithCompression PASSED

kafka.integration.PrimitiveApiTest > testConsumerEmptyTopic STARTED

kafka.integration.PrimitiveApiTest > testConsumerEmptyTopic PASSED

kafka.integration.PrimitiveApiTest > testEmptyFetchRequest STARTED

kafka.integration.PrimitiveApiTest > testEmptyFetchRequest PASSED

kafka.integration.MetricsDuringTopicCreationDeletionTest > testMetricsDuringTopicCreateDelete STARTED

kafka.integration.MetricsDuringTopicCreationDeletionTest > testMetricsDuringTopicCreateDelete PASSED

kafka.integration.AutoOffsetResetTest > testResetToLatestWhenOffsetTooLow STARTED

kafka.integration.AutoOffsetResetTest > testResetToLatestWhenOffsetTooLow PASSED

kafka.integration.AutoOffsetResetTest > testResetToEarliestWhenOffsetTooLow STARTED

kafka.integration.AutoOffsetResetTest > testResetToEarliestWhenOffsetTooLow PASSED

kafka.integration.AutoOffsetResetTest > testResetToEarliestWhenOffsetTooHigh STARTED

kafka.integration.AutoOffsetResetTest > testResetToEarliestWhenOffsetTooHigh PASSED

kafka.integration.AutoOffsetResetTest > testResetToLatestWhenOffsetTooHigh STARTED

kafka.integration.AutoOffsetResetTest > testResetToLatestWhenOffsetTooHigh PASSED

kafka.integration.TopicMetadataTest > testIsrAfterBrokerShutDownAndJoinsBack STARTED

kafka.integration.TopicMetadataTest > testIsrAfterBrokerShutDownAndJoinsBack PASSED

kafka.integration.TopicMetadataTest > testAutoCreateTopicWithCollision STARTED

kafka.integration.TopicMetadataTest > testAutoCreateTopicWithCollision PASSED

kafka.integration.TopicMetadataTest > testAliveBrokerListWithNoTopics STARTED

kafka.integration.TopicMetadataTest > testAliveBrokerListWithNoTopics PASSED

kafka.integration.TopicMetadataTest > testAutoCreateTopic STARTED

kafka.integration.TopicMetadataTest > testAutoCreateTopic PASSED

kafka.integration.TopicMetadataTest > testGetAllTopicMetadata STARTED

kafka.integration.TopicMetadataTest > testGetAllTopicMetadata PASSED

kafka.integration.TopicMetadataTest > testAliveBrokersListWithNoTopicsAfterNewBrokerStartup STARTED

kafka.integration.TopicMetadataTest > testAliveBrokersListWithNoTopicsAfterNewBrokerStartup PASSED

kafka.integration.TopicMetadataTest > testBasicTopicMetadata STARTED

kafka.integration.TopicMetadataTest > testBasicTopicMetadata PASSED

kafka.integration.TopicMetadataTest > testAutoCreateTopicWithInvalidReplication STARTED

kafka.integration.TopicMetadataTest > testAutoCreateTopicWithInvalidReplication PASSED

kafka.integration.TopicMetadataTest > testAliveBrokersListWithNoTopicsAfterABrokerShutdown STARTED

kafka.integration.TopicMetadataTest > testAliveBrokersListWithNoTopicsAfterABrokerShutdown PASSED

kafka.integration.FetcherTest > testFetcher STARTED

kafka.integration.FetcherTest > testFetcher PASSED

kafka.integration.UncleanLeaderElectionTest > testUncleanLeaderElectionEnabled STARTED

kafka.integration.UncleanLeaderElectionTest > testUncleanLeaderElectionEnabled PASSED

kafka.integration.UncleanLeaderElectionTest > testCleanLeaderElectionDisabledByTopicOverride STARTED

kafka.integration.UncleanLeaderElectionTest > testCleanLeaderElectionDisabledByTopicOverride SKIPPED

kafka.integration.UncleanLeaderElectionTest > testUncleanLeaderElectionDisabled STARTED

kafka.integration.UncleanLeaderElectionTest > testUncleanLeaderElectionDisabled SKIPPED

kafka.integration.UncleanLeaderElectionTest > testUncleanLeaderElectionInvalidTopicOverride STARTED

kafka.integration.UncleanLeaderElectionTest > testUncleanLeaderElectionInvalidTopicOverride PASSED

kafka.integration.UncleanLeaderElectionTest > testUncleanLeaderElectionEnabledByTopicOverride STARTED

kafka.integration.UncleanLeaderElectionTest > testUncleanLeaderElectionEnabledByTopicOverride PASSED

kafka.integration.MinIsrConfigTest > testDefaultKafkaConfig STARTED

kafka.integration.MinIsrConfigTest > testDefaultKafkaConfig PASSED

unit.kafka.server.KafkaApisTest > shouldRespondWithUnsupportedForMessageFormatOnHandleWriteTxnMarkersWhenMagicLowerThanRequired STARTED

unit.kafka.server.KafkaApisTest > shouldRespondWithUnsupportedForMessageFormatOnHandleWriteTxnMarkersWhenMagicLowerThanRequired PASSED

unit.kafka.server.KafkaApisTest > shouldThrowUnsupportedVersionExceptionOnHandleTxnOffsetCommitRequestWhenInterBrokerProtocolNotSupported STARTED

unit.kafka.server.KafkaApisTest > shouldThrowUnsupportedVersionExceptionOnHandleTxnOffsetCommitRequestWhenInterBrokerProtocolNotSupported PASSED

unit.kafka.server.KafkaApisTest > shouldThrowUnsupportedVersionExceptionOnHandleAddPartitionsToTxnRequestWhenInterBrokerProtocolNotSupported STARTED

unit.kafka.server.KafkaApisTest > shouldThrowUnsupportedVersionExceptionOnHandleAddPartitionsToTxnRequestWhenInterBrokerProtocolNotSupported PASSED

unit.kafka.server.KafkaApisTest > shouldAppendToLogOnWriteTxnMarkersWhenCorrectMagicVersion STARTED

unit.kafka.server.KafkaApisTest > shouldAppendToLogOnWriteTxnMarkersWhenCorrectMagicVersion PASSED

unit.kafka.server.KafkaApisTest > shouldThrowUnsupportedVersionExceptionOnHandleWriteTxnMarkersRequestWhenInterBrokerProtocolNotSupported STARTED

unit.kafka.server.KafkaApisTest > shouldThrowUnsupportedVersionExceptionOnHandleWriteTxnMarkersRequestWhenInterBrokerProtocolNotSupported PASSED

unit.kafka.server.KafkaApisTest > shouldThrowUnsupportedVersionExceptionOnHandleAddOffsetToTxnRequestWhenInterBrokerProtocolNotSupported STARTED

unit.kafka.server.KafkaApisTest > shouldThrowUnsupportedVersionExceptionOnHandleAddOffsetToTxnRequestWhenInterBrokerProtocolNotSupported PASSED

unit.kafka.server.KafkaApisTest > shouldRespondWithUnsupportedMessageFormatForBadPartitionAndNoErrorsForGoodPartition STARTED

unit.kafka.server.KafkaApisTest > shouldRespondWithUnsupportedMessageFormatForBadPartitionAndNoErrorsForGoodPartition PASSED

unit.kafka.server.KafkaApisTest > shouldThrowUnsupportedVersionExceptionOnHandleEndTxnRequestWhenInterBrokerProtocolNotSupported STARTED

unit.kafka.server.KafkaApisTest > shouldThrowUnsupportedVersionExceptionOnHandleEndTxnRequestWhenInterBrokerProtocolNotSupported PASSED

unit.kafka.admin.ResetConsumerGroupOffsetTest > testResetOffsetsShiftByHigherThanLatest STARTED

unit.kafka.admin.ResetConsumerGroupOffsetTest > testResetOffsetsShiftByHigherThanLatest PASSED

unit.kafka.admin.ResetConsumerGroupOffsetTest > testResetOffsetsShiftMinus STARTED

unit.kafka.admin.ResetConsumerGroupOffsetTest > testResetOffsetsShiftMinus PASSED

unit.kafka.admin.ResetConsumerGroupOffsetTest > testResetOffsetsToCurrentOffset STARTED

unit.kafka.admin.ResetConsumerGroupOffsetTest > testResetOffsetsToCurrentOffset PASSED

unit.kafka.admin.ResetConsumerGroupOffsetTest > testResetOffsetsToEarliestOnOneTopicAndPartition STARTED

unit.kafka.admin.ResetConsumerGroupOffsetTest > testResetOffsetsToEarliestOnOneTopicAndPartition PASSED

unit.kafka.admin.ResetConsumerGroupOffsetTest > testResetOffsetsByDurationToEarliest STARTED

unit.kafka.admin.ResetConsumerGroupOffsetTest > testResetOffsetsByDurationToEarliest PASSED

unit.kafka.admin.ResetConsumerGroupOffsetTest > testResetOffsetsToEarliestOnOneTopic STARTED

unit.kafka.admin.ResetConsumerGroupOffsetTest > testResetOffsetsToEarliestOnOneTopic PASSED

unit.kafka.admin.ResetConsumerGroupOffsetTest > testResetOffsetsNotExistingGroup STARTED

unit.kafka.admin.ResetConsumerGroupOffsetTest > testResetOffsetsNotExistingGroup PASSED

unit.kafka.admin.ResetConsumerGroupOffsetTest > testResetOffsetsToZonedDateTime STARTED

unit.kafka.admin.ResetConsumerGroupOffsetTest > testResetOffsetsToZonedDateTime PASSED

unit.kafka.admin.ResetConsumerGroupOffsetTest > testResetOffsetsToEarliest STARTED

unit.kafka.admin.ResetConsumerGroupOffsetTest > testResetOffsetsToEarliest PASSED

unit.kafka.admin.ResetConsumerGroupOffsetTest > testResetOffsetsExportImportPlan STARTED

unit.kafka.admin.ResetConsumerGroupOffsetTest > testResetOffsetsExportImportPlan PASSED

unit.kafka.admin.ResetConsumerGroupOffsetTest > testResetOffsetsToSpecificOffset STARTED

unit.kafka.admin.ResetConsumerGroupOffsetTest > testResetOffsetsToSpecificOffset PASSED

unit.kafka.admin.ResetConsumerGroupOffsetTest > testResetOffsetsShiftPlus STARTED

unit.kafka.admin.ResetConsumerGroupOffsetTest > testResetOffsetsShiftPlus PASSED

unit.kafka.admin.ResetConsumerGroupOffsetTest > testResetOffsetsToLatest STARTED

unit.kafka.admin.ResetConsumerGroupOffsetTest > testResetOffsetsToLatest PASSED

unit.kafka.admin.ResetConsumerGroupOffsetTest > testResetOffsetsShiftByLowerThanEarliest STARTED

unit.kafka.admin.ResetConsumerGroupOffsetTest > testResetOffsetsShiftByLowerThanEarliest PASSED

unit.kafka.admin.ResetConsumerGroupOffsetTest > testResetOffsetsByDuration STARTED

unit.kafka.admin.ResetConsumerGroupOffsetTest > testResetOffsetsByDuration PASSED

unit.kafka.admin.ResetConsumerGroupOffsetTest > testResetOffsetsToLocalDateTime STARTED

unit.kafka.admin.ResetConsumerGroupOffsetTest > testResetOffsetsToLocalDateTime PASSED

unit.kafka.admin.ResetConsumerGroupOffsetTest > testResetOffsetsToEarliestOnTopicsAndPartitions STARTED

unit.kafka.admin.ResetConsumerGroupOffsetTest > testResetOffsetsToEarliestOnTopicsAndPartitions PASSED

unit.kafka.admin.ResetConsumerGroupOffsetTest > testResetOffsetsToEarliestOnTopics STARTED

unit.kafka.admin.ResetConsumerGroupOffsetTest > testResetOffsetsToEarliestOnTopics PASSED

1405 tests completed, 1 failed, 5 skipped
:kafka-trunk-jdk8:core:test FAILED
:test_core_2_11 FAILED

FAILURE: Build failed with an exception.

* What went wrong:
Execution failed for task ':kafka-trunk-jdk8:core:test'.
> There were failing tests. See the report at: file://<https://builds.apache.org/job/kafka-trunk-jdk8/ws/core/build/reports/tests/test/index.html>

* Try:
Run with --stacktrace option to get the stack trace. Run with --info or --debug option to get more log output.

BUILD FAILED

Total time: 56 mins 24.784 secs
Build step 'Execute shell' marked build as failure
[FINDBUGS] Collecting findbugs analysis files...
Setting GRADLE_3_4_RC_2_HOME=/home/jenkins/jenkins-slave/tools/hudson.plugins.gradle.GradleInstallation/Gradle_3.4-rc-2
[FINDBUGS] Searching for all files in <https://builds.apache.org/job/kafka-trunk-jdk8/ws/> that match the pattern **/build/reports/findbugs/*.xml
[FINDBUGS] Parsing 1 file in <https://builds.apache.org/job/kafka-trunk-jdk8/ws/>
[FINDBUGS] Successfully parsed file <https://builds.apache.org/job/kafka-trunk-jdk8/ws/core/build/reports/findbugs/main.xml> with 0 unique warnings and 0 duplicates.
[FINDBUGS] Computing warning deltas based on reference build #1614
Recording test results
Setting GRADLE_3_4_RC_2_HOME=/home/jenkins/jenkins-slave/tools/hudson.plugins.gradle.GradleInstallation/Gradle_3.4-rc-2
Setting GRADLE_3_4_RC_2_HOME=/home/jenkins/jenkins-slave/tools/hudson.plugins.gradle.GradleInstallation/Gradle_3.4-rc-2
Not sending mail to unregistered user wangguoz@gmail.com