You are viewing a plain text version of this content. The canonical link for it is here.
Posted to builds@beam.apache.org by Apache Jenkins Server <je...@builds.apache.org> on 2019/03/13 06:15:26 UTC
Build failed in Jenkins: beam_PreCommit_Website_Cron #771
See <https://builds.apache.org/job/beam_PreCommit_Website_Cron/771/display/redirect>
------------------------------------------
Started by timer
[EnvInject] - Loading node environment variables.
Building remotely on beam15 (beam) in workspace <https://builds.apache.org/job/beam_PreCommit_Website_Cron/ws/>
No credentials specified
> git rev-parse --is-inside-work-tree # timeout=10
Fetching changes from the remote Git repository
> git config remote.origin.url https://github.com/apache/beam.git # timeout=10
Fetching upstream changes from https://github.com/apache/beam.git
> git --version # timeout=10
> git fetch --tags --progress https://github.com/apache/beam.git +refs/heads/*:refs/remotes/origin/* +refs/pull/${ghprbPullId}/*:refs/remotes/origin/pr/${ghprbPullId}/*
> git rev-parse origin/master^{commit} # timeout=10
Checking out Revision 58db009dca64d3c0bc578222e7a0a110ebf3eb4b (origin/master)
> git config core.sparsecheckout # timeout=10
> git checkout -f 58db009dca64d3c0bc578222e7a0a110ebf3eb4b
Commit message: "Merge pull request #8029 from Ardagan/GoFormatter"
> git rev-list --no-walk 58db009dca64d3c0bc578222e7a0a110ebf3eb4b # timeout=10
Cleaning workspace
> git rev-parse --verify HEAD # timeout=10
Resetting working tree
> git reset --hard # timeout=10
> git clean -fdx # timeout=10
[EnvInject] - Executing scripts and injecting environment variables after the SCM step.
[EnvInject] - Injecting as environment variables the properties content
SPARK_LOCAL_IP=127.0.0.1
[EnvInject] - Variables injected successfully.
[Gradle] - Launching build.
[src] $ <https://builds.apache.org/job/beam_PreCommit_Website_Cron/ws/src/gradlew> --continue --max-workers=12 -Dorg.gradle.jvmargs=-Xms2g -Dorg.gradle.jvmargs=-Xmx4g :websitePreCommit
To honour the JVM settings for this build a new JVM will be forked. Please consider using the daemon: https://docs.gradle.org/5.2.1/userguide/gradle_daemon.html.
Daemon will be stopped at the end of the build stopping after processing
> Task :buildSrc:compileJava NO-SOURCE
> Task :buildSrc:compileGroovy FROM-CACHE
> Task :buildSrc:pluginDescriptors
> Task :buildSrc:processResources
> Task :buildSrc:classes
> Task :buildSrc:jar
> Task :buildSrc:assemble
> Task :buildSrc:spotlessGroovy
> Task :buildSrc:spotlessGroovyCheck
> Task :buildSrc:spotlessGroovyGradle
> Task :buildSrc:spotlessGroovyGradleCheck
> Task :buildSrc:spotlessCheck
> Task :buildSrc:pluginUnderTestMetadata
> Task :buildSrc:compileTestJava NO-SOURCE
> Task :buildSrc:compileTestGroovy NO-SOURCE
> Task :buildSrc:processTestResources NO-SOURCE
> Task :buildSrc:testClasses UP-TO-DATE
> Task :buildSrc:test NO-SOURCE
> Task :buildSrc:validateTaskProperties FROM-CACHE
> Task :buildSrc:check
> Task :buildSrc:build
Configuration on demand is an incubating feature.
> Task :beam-website:setupBuildDir
> Task :beam-website:buildDockerImage
Sending build context to Docker daemon 26.44MB
Step 1/7 : FROM ruby:2.5
2.5: Pulling from library/ruby
Digest: sha256:ae790cc668ca4dd837399a801fbb235d22769ad3e899f8e1b409490d011ff2ba
Status: Downloaded newer image for ruby:2.5
---> 72aaaee1eea4
Step 2/7 : WORKDIR /ruby
---> Using cache
---> 88df58cdd741
Step 3/7 : RUN gem install bundler
---> Using cache
---> a0e0c124e66c
Step 4/7 : ADD Gemfile Gemfile.lock /ruby/
---> Using cache
---> 2ae01b5a3e8f
Step 5/7 : RUN bundle install --deployment --path $GEM_HOME
---> Using cache
---> 0b7792d9e03f
Step 6/7 : ENV LC_ALL C.UTF-8
---> Using cache
---> ae777808f5f9
Step 7/7 : CMD sleep 3600
---> Using cache
---> b6a6db3fa224
Successfully built b6a6db3fa224
Successfully tagged beam-website:latest
> Task :beam-website:createDockerContainer
> Task :beam-website:startDockerContainer
fc129d90bc1b4017a37507a067b7bf69512dc8767bd81e4497a05a5bbde8eb7b
> Task :beam-website:buildLocalWebsite
`/` is not writable.
Bundler will use `/tmp/bundler/home/unknown' as your home directory temporarily.
Configuration file: /repo/website/_config.yml
Configuration file: /repo/website/_config_test.yml
Source: /repo/website/src
Destination: generated-local-content
Incremental build: enabled
Generating...
done in 13.862 seconds.
Auto-regeneration: disabled. Use --watch to enable.
> Task :beam-website:testWebsite
`/` is not writable.
Bundler will use `/tmp/bundler/home/unknown' as your home directory temporarily.
Running ["ScriptCheck", "ImageCheck", "HtmlCheck", "LinkCheck"] on ["./generated-local-content"] on *.html...
Checking 891 external links...
Ran on 191 files!
- ./generated-local-content/contribute/become-a-committer/index.html
* External link https://www.apache.org/dev/committers.html#committer-responsibilities failed: got a time out (response code 0)
- ./generated-local-content/get-started/downloads/index.html
* External link https://www.apache.org/dist/beam/2.10.0/apache-beam-2.10.0-source-release.zip.sha512 failed: got a time out (response code 0)
rake aborted!
HTML-Proofer found 2 failures!
/usr/local/bundle/ruby/2.5.0/gems/html-proofer-3.9.3/lib/html-proofer/runner.rb:167:in `print_failed_tests'
/usr/local/bundle/ruby/2.5.0/gems/html-proofer-3.9.3/lib/html-proofer/runner.rb:48:in `run'
/repo/build/website/Rakefile:23:in `block in <top (required)>'
/usr/local/bundle/ruby/2.5.0/gems/rake-12.3.0/exe/rake:27:in `<top (required)>'
/usr/local/bundle/bin/bundle:23:in `load'
/usr/local/bundle/bin/bundle:23:in `<main>'
Tasks: TOP => test
(See full trace by running task with --trace)
> Task :beam-website:testWebsite FAILED
> Task :beam-website:stopAndRemoveDockerContainer
fc129d90bc1b4017a37507a067b7bf69512dc8767bd81e4497a05a5bbde8eb7b
FAILURE: Build failed with an exception.
* What went wrong:
Execution failed for task ':beam-website:testWebsite'.
> Process 'command 'docker'' finished with non-zero exit value 1
* Try:
Run with --stacktrace option to get the stack trace. Run with --info or --debug option to get more log output. Run with --scan to get full insights.
* Get more help at https://help.gradle.org
BUILD FAILED in 3m 40s
7 actionable tasks: 7 executed
Publishing build scan...
https://gradle.com/s/y6b35f3zugyfy
Build step 'Invoke Gradle script' changed build result to FAILURE
Build step 'Invoke Gradle script' marked build as failure
---------------------------------------------------------------------
To unsubscribe, e-mail: builds-unsubscribe@beam.apache.org
For additional commands, e-mail: builds-help@beam.apache.org
Jenkins build is back to normal : beam_PreCommit_Website_Cron #772
Posted by Apache Jenkins Server <je...@builds.apache.org>.
See <https://builds.apache.org/job/beam_PreCommit_Website_Cron/772/display/redirect>
---------------------------------------------------------------------
To unsubscribe, e-mail: builds-unsubscribe@beam.apache.org
For additional commands, e-mail: builds-help@beam.apache.org