You are viewing a plain text version of this content. The canonical link for it is here.
Posted to commits@tomee.apache.org by Apache Jenkins Server <je...@builds.apache.org> on 2024/12/18 20:08:39 UTC
Build failed in Jenkins: TomEE » tomee-9.x-build-full » TomEE :: Arquillian Adaptors Parent :: Tests #701
See <https://ci-builds.apache.org/job/Tomee/job/tomee-9.x-build-full/org.apache.tomee$arquillian-tomee-tests/701/display/redirect>
Changes:
------------------------------------------
[INFO]
[INFO] --------------< org.apache.tomee:arquillian-tomee-tests >---------------
[INFO] Building TomEE :: Arquillian Adaptors Parent :: Tests 9.1.4-SNAPSHOT [334/346]
[INFO] from arquillian/arquillian-tomee-tests/pom.xml
[INFO] --------------------------------[ pom ]---------------------------------
[INFO]
[INFO] --- clean:3.2.0:clean (default-clean) @ arquillian-tomee-tests ---
[INFO]
[INFO] --- enforcer:3.0.0:enforce (enforce-maven-version) @ arquillian-tomee-tests ---
[INFO]
[INFO] --- enforcer:3.0.0:enforce (enforce-java-version) @ arquillian-tomee-tests ---
[INFO]
[INFO] --- remote-resources:1.5:process (process-resource-bundles) @ arquillian-tomee-tests ---
[INFO]
[INFO] --- dependency-report:1.0.2:report (default) @ arquillian-tomee-tests ---
[INFO] Couldn't find parent for org.jboss.shrinkwrap.descriptors:shrinkwrap-descriptors-spi:jar:2.0.0
[INFO] Couldn't find parent for org.glassfish.jaxb:jaxb-runtime:jar:3.0.2
[INFO] Couldn't find parent for org.jboss.arquillian.test:arquillian-test-spi:jar:1.7.0.Final
[INFO] Couldn't find parent for org.jboss.arquillian.container:arquillian-container-test-impl-base:jar:1.7.0.Final
[INFO] Couldn't find parent for org.jboss.arquillian.config:arquillian-config-impl-base:jar:1.7.0.Final
[INFO] Couldn't find parent for org.jboss.arquillian.test:arquillian-test-api:jar:1.7.0.Final
[INFO] Couldn't find parent for org.jboss.arquillian.container:arquillian-container-test-spi:jar:1.7.0.Final
[INFO] Couldn't find parent for org.jboss.arquillian.config:arquillian-config-api:jar:1.7.0.Final
[INFO] Couldn't find parent for org.jboss.arquillian.container:arquillian-container-test-api:jar:1.7.0.Final
[INFO]
[INFO] --- bundle:3.3.0:manifest (bundle-manifest) @ arquillian-tomee-tests ---
[WARNING] Ignoring project type pom - supportedProjectTypes = [bundle, jar, maven-plugin]
[INFO]
[INFO] --- groovy:2.0:execute (configure-adapters) @ arquillian-tomee-tests ---
java.lang.reflect.InaccessibleObjectException: Unable to make protected void java.lang.Object.finalize() throws java.lang.Throwable accessible: module java.base does not "opens java.lang" to unnamed module @334d3896
at java.base/java.lang.reflect.AccessibleObject.checkCanSetAccessible(AccessibleObject.java:354)
at java.base/java.lang.reflect.AccessibleObject.checkCanSetAccessible(AccessibleObject.java:297)
at java.base/java.lang.reflect.Method.checkCanSetAccessible(Method.java:200)
at java.base/java.lang.reflect.AccessibleObject.setAccessible(AccessibleObject.java:130)
at org.codehaus.groovy.reflection.CachedClass$3$1.run(CachedClass.java:86)
at java.base/java.security.AccessController.doPrivileged(AccessController.java:318)
at org.codehaus.groovy.reflection.CachedClass$3.initValue(CachedClass.java:81)
at org.codehaus.groovy.reflection.CachedClass$3.initValue(CachedClass.java:79)
at org.codehaus.groovy.util.LazyReference.getLocked(LazyReference.java:46)
at org.codehaus.groovy.util.LazyReference.get(LazyReference.java:33)
at org.codehaus.groovy.reflection.CachedClass.getMethods(CachedClass.java:250)
at org.codehaus.groovy.reflection.CachedClass$3.initValue(CachedClass.java:116)
at org.codehaus.groovy.reflection.CachedClass$3.initValue(CachedClass.java:79)
at org.codehaus.groovy.util.LazyReference.getLocked(LazyReference.java:46)
at org.codehaus.groovy.util.LazyReference.get(LazyReference.java:33)
at org.codehaus.groovy.reflection.CachedClass.getMethods(CachedClass.java:250)
at org.codehaus.groovy.reflection.CachedClass$3.initValue(CachedClass.java:116)
at org.codehaus.groovy.reflection.CachedClass$3.initValue(CachedClass.java:79)
at org.codehaus.groovy.util.LazyReference.getLocked(LazyReference.java:46)
at org.codehaus.groovy.util.LazyReference.get(LazyReference.java:33)
at org.codehaus.groovy.reflection.CachedClass.getMethods(CachedClass.java:250)
at org.codehaus.groovy.reflection.stdclasses.CachedClosureClass.<init>(CachedClosureClass.java:29)
at org.codehaus.groovy.reflection.ClassInfo.createCachedClass(ClassInfo.java:269)
at org.codehaus.groovy.reflection.ClassInfo.access$400(ClassInfo.java:36)
at org.codehaus.groovy.reflection.ClassInfo$LazyCachedClassRef.initValue(ClassInfo.java:435)
at org.codehaus.groovy.reflection.ClassInfo$LazyCachedClassRef.initValue(ClassInfo.java:426)
at org.codehaus.groovy.util.LazyReference.getLocked(LazyReference.java:46)
at org.codehaus.groovy.util.LazyReference.get(LazyReference.java:33)
at org.codehaus.groovy.reflection.ClassInfo.getCachedClass(ClassInfo.java:89)
at org.codehaus.groovy.reflection.ReflectionCache.getCachedClass(ReflectionCache.java:107)
at org.codehaus.groovy.runtime.metaclass.MetaClassRegistryImpl.registerMethods(MetaClassRegistryImpl.java:189)
at org.codehaus.groovy.runtime.metaclass.MetaClassRegistryImpl.<init>(MetaClassRegistryImpl.java:93)
at org.codehaus.groovy.runtime.metaclass.MetaClassRegistryImpl.<init>(MetaClassRegistryImpl.java:71)
at groovy.lang.GroovySystem.<clinit>(GroovySystem.java:33)
at java.base/jdk.internal.reflect.NativeMethodAccessorImpl.invoke0(Native Method)
at java.base/jdk.internal.reflect.NativeMethodAccessorImpl.invoke(NativeMethodAccessorImpl.java:77)
at java.base/jdk.internal.reflect.DelegatingMethodAccessorImpl.invoke(DelegatingMethodAccessorImpl.java:43)
at java.base/java.lang.reflect.Method.invoke(Method.java:569)
at org.codehaus.gmaven.plugin.util.GroovyVersionHelper.getVersion(GroovyVersionHelper.java:81)
at org.codehaus.gmaven.plugin.util.GroovyVersionHelper.detectVersion(GroovyVersionHelper.java:55)
at org.codehaus.gmaven.plugin.RuntimeMojoSupport.ensureGroovyComparability(RuntimeMojoSupport.java:240)
at org.codehaus.gmaven.plugin.RuntimeMojoSupport.prepare(RuntimeMojoSupport.java:171)
at org.codehaus.gmaven.plugin.MojoSupport.execute(MojoSupport.java:42)
at org.apache.maven.plugin.DefaultBuildPluginManager.executeMojo(DefaultBuildPluginManager.java:126)
at org.apache.maven.lifecycle.internal.MojoExecutor.doExecute2(MojoExecutor.java:328)
at org.apache.maven.lifecycle.internal.MojoExecutor.doExecute(MojoExecutor.java:316)
at org.apache.maven.lifecycle.internal.MojoExecutor.execute(MojoExecutor.java:212)
at org.apache.maven.lifecycle.internal.MojoExecutor.execute(MojoExecutor.java:174)
at org.apache.maven.lifecycle.internal.MojoExecutor.access$000(MojoExecutor.java:75)
at org.apache.maven.lifecycle.internal.MojoExecutor$1.run(MojoExecutor.java:162)
at org.apache.maven.plugin.DefaultMojosExecutionStrategy.execute(DefaultMojosExecutionStrategy.java:39)
at org.apache.maven.lifecycle.internal.MojoExecutor.execute(MojoExecutor.java:159)
at org.apache.maven.lifecycle.internal.LifecycleModuleBuilder.buildProject(LifecycleModuleBuilder.java:105)
at org.apache.maven.lifecycle.internal.LifecycleModuleBuilder.buildProject(LifecycleModuleBuilder.java:73)
at org.apache.maven.lifecycle.internal.builder.singlethreaded.SingleThreadedBuilder.build(SingleThreadedBuilder.java:53)
at org.apache.maven.lifecycle.internal.LifecycleStarter.execute(LifecycleStarter.java:118)
at org.apache.maven.DefaultMaven.doExecute(DefaultMaven.java:261)
at org.apache.maven.DefaultMaven.doExecute(DefaultMaven.java:173)
at org.apache.maven.DefaultMaven.execute(DefaultMaven.java:101)
at org.jvnet.hudson.maven3.launcher.Maven35Launcher.main(Maven35Launcher.java:138)
at java.base/jdk.internal.reflect.NativeMethodAccessorImpl.invoke0(Native Method)
at java.base/jdk.internal.reflect.NativeMethodAccessorImpl.invoke(NativeMethodAccessorImpl.java:77)
at java.base/jdk.internal.reflect.DelegatingMethodAccessorImpl.invoke(DelegatingMethodAccessorImpl.java:43)
at java.base/java.lang.reflect.Method.invoke(Method.java:569)
at org.codehaus.plexus.classworlds.launcher.Launcher.launchEnhanced(Launcher.java:255)
at org.codehaus.plexus.classworlds.launcher.Launcher.launch(Launcher.java:201)
at jenkins.maven3.agent.Maven35Main.launch(Maven35Main.java:179)
at java.base/jdk.internal.reflect.NativeMethodAccessorImpl.invoke0(Native Method)
at java.base/jdk.internal.reflect.NativeMethodAccessorImpl.invoke(NativeMethodAccessorImpl.java:77)
at java.base/jdk.internal.reflect.DelegatingMethodAccessorImpl.invoke(DelegatingMethodAccessorImpl.java:43)
at java.base/java.lang.reflect.Method.invoke(Method.java:569)
at PluginClassLoader for maven-plugin//hudson.maven.Maven3Builder.call(Maven3Builder.java:140)
at PluginClassLoader for maven-plugin//hudson.maven.Maven3Builder.call(Maven3Builder.java:71)
at hudson.remoting.UserRequest.perform(UserRequest.java:225)
at hudson.remoting.UserRequest.perform(UserRequest.java:50)
at hudson.remoting.Request$2.run(Request.java:391)
at hudson.remoting.InterceptingExecutorService.lambda$wrap$0(InterceptingExecutorService.java:81)
at java.base/java.util.concurrent.FutureTask.run(FutureTask.java:264)
at java.base/java.util.concurrent.ThreadPoolExecutor.runWorker(ThreadPoolExecutor.java:1136)
at java.base/java.util.concurrent.ThreadPoolExecutor$Worker.run(ThreadPoolExecutor.java:635)
at java.base/java.lang.Thread.run(Thread.java:840)
[ERROR] Unable to determine Groovy version
WARNING: A terminally deprecated method in java.lang.System has been called
WARNING: System::setSecurityManager has been called by org.codehaus.gmaven.plugin.util.SystemNoExitGuard (file:/home/jenkins/.m2/repository/org/codehaus/gmaven/groovy-maven-plugin/2.0/groovy-maven-plugin-2.0.jar)
WARNING: Please consider reporting this to the maintainers of org.codehaus.gmaven.plugin.util.SystemNoExitGuard
WARNING: System::setSecurityManager will be removed in a future release
Build failed in Jenkins: TomEE » tomee-9.x-build-full » TomEE :: Arquillian Adaptors Parent :: Tests #702
Posted by Apache Jenkins Server <je...@builds.apache.org>.
See <https://ci-builds.apache.org/job/Tomee/job/tomee-9.x-build-full/org.apache.tomee$arquillian-tomee-tests/702/display/redirect>
Changes:
------------------------------------------
[INFO]
[INFO] --------------< org.apache.tomee:arquillian-tomee-tests >---------------
[INFO] Building TomEE :: Arquillian Adaptors Parent :: Tests 9.1.4-SNAPSHOT [334/346]
[INFO] from arquillian/arquillian-tomee-tests/pom.xml
[INFO] --------------------------------[ pom ]---------------------------------
[INFO]
[INFO] --- clean:3.2.0:clean (default-clean) @ arquillian-tomee-tests ---
[INFO]
[INFO] --- enforcer:3.0.0:enforce (enforce-maven-version) @ arquillian-tomee-tests ---
[INFO]
[INFO] --- enforcer:3.0.0:enforce (enforce-java-version) @ arquillian-tomee-tests ---
[INFO]
[INFO] --- remote-resources:1.5:process (process-resource-bundles) @ arquillian-tomee-tests ---
[INFO]
[INFO] --- dependency-report:1.0.2:report (default) @ arquillian-tomee-tests ---
[INFO] Couldn't find parent for org.jboss.shrinkwrap.descriptors:shrinkwrap-descriptors-spi:jar:2.0.0
[INFO] Couldn't find parent for org.glassfish.jaxb:jaxb-runtime:jar:3.0.2
[INFO] Couldn't find parent for org.jboss.arquillian.test:arquillian-test-spi:jar:1.7.0.Final
[INFO] Couldn't find parent for org.jboss.arquillian.container:arquillian-container-test-impl-base:jar:1.7.0.Final
[INFO] Couldn't find parent for org.jboss.arquillian.config:arquillian-config-impl-base:jar:1.7.0.Final
[INFO] Couldn't find parent for org.jboss.arquillian.test:arquillian-test-api:jar:1.7.0.Final
[INFO] Couldn't find parent for org.jboss.arquillian.container:arquillian-container-test-spi:jar:1.7.0.Final
[INFO] Couldn't find parent for org.jboss.arquillian.config:arquillian-config-api:jar:1.7.0.Final
[INFO] Couldn't find parent for org.jboss.arquillian.container:arquillian-container-test-api:jar:1.7.0.Final
[INFO]
[INFO] --- bundle:3.3.0:manifest (bundle-manifest) @ arquillian-tomee-tests ---
[WARNING] Ignoring project type pom - supportedProjectTypes = [bundle, jar, maven-plugin]
[INFO]
[INFO] --- groovy:2.0:execute (configure-adapters) @ arquillian-tomee-tests ---
java.lang.reflect.InaccessibleObjectException: Unable to make protected void java.lang.Object.finalize() throws java.lang.Throwable accessible: module java.base does not "opens java.lang" to unnamed module @5773a77b
at java.base/java.lang.reflect.AccessibleObject.checkCanSetAccessible(AccessibleObject.java:354)
at java.base/java.lang.reflect.AccessibleObject.checkCanSetAccessible(AccessibleObject.java:297)
at java.base/java.lang.reflect.Method.checkCanSetAccessible(Method.java:199)
at java.base/java.lang.reflect.AccessibleObject.setAccessible(AccessibleObject.java:130)
at org.codehaus.groovy.reflection.CachedClass$3$1.run(CachedClass.java:86)
at java.base/java.security.AccessController.doPrivileged(AccessController.java:318)
at org.codehaus.groovy.reflection.CachedClass$3.initValue(CachedClass.java:81)
at org.codehaus.groovy.reflection.CachedClass$3.initValue(CachedClass.java:79)
at org.codehaus.groovy.util.LazyReference.getLocked(LazyReference.java:46)
at org.codehaus.groovy.util.LazyReference.get(LazyReference.java:33)
at org.codehaus.groovy.reflection.CachedClass.getMethods(CachedClass.java:250)
at org.codehaus.groovy.reflection.CachedClass$3.initValue(CachedClass.java:116)
at org.codehaus.groovy.reflection.CachedClass$3.initValue(CachedClass.java:79)
at org.codehaus.groovy.util.LazyReference.getLocked(LazyReference.java:46)
at org.codehaus.groovy.util.LazyReference.get(LazyReference.java:33)
at org.codehaus.groovy.reflection.CachedClass.getMethods(CachedClass.java:250)
at org.codehaus.groovy.reflection.CachedClass$3.initValue(CachedClass.java:116)
at org.codehaus.groovy.reflection.CachedClass$3.initValue(CachedClass.java:79)
at org.codehaus.groovy.util.LazyReference.getLocked(LazyReference.java:46)
at org.codehaus.groovy.util.LazyReference.get(LazyReference.java:33)
at org.codehaus.groovy.reflection.CachedClass.getMethods(CachedClass.java:250)
at org.codehaus.groovy.reflection.stdclasses.CachedClosureClass.<init>(CachedClosureClass.java:29)
at org.codehaus.groovy.reflection.ClassInfo.createCachedClass(ClassInfo.java:269)
at org.codehaus.groovy.reflection.ClassInfo.access$400(ClassInfo.java:36)
at org.codehaus.groovy.reflection.ClassInfo$LazyCachedClassRef.initValue(ClassInfo.java:435)
at org.codehaus.groovy.reflection.ClassInfo$LazyCachedClassRef.initValue(ClassInfo.java:426)
at org.codehaus.groovy.util.LazyReference.getLocked(LazyReference.java:46)
at org.codehaus.groovy.util.LazyReference.get(LazyReference.java:33)
at org.codehaus.groovy.reflection.ClassInfo.getCachedClass(ClassInfo.java:89)
at org.codehaus.groovy.reflection.ReflectionCache.getCachedClass(ReflectionCache.java:107)
at org.codehaus.groovy.runtime.metaclass.MetaClassRegistryImpl.registerMethods(MetaClassRegistryImpl.java:189)
at org.codehaus.groovy.runtime.metaclass.MetaClassRegistryImpl.<init>(MetaClassRegistryImpl.java:93)
at org.codehaus.groovy.runtime.metaclass.MetaClassRegistryImpl.<init>(MetaClassRegistryImpl.java:71)
at groovy.lang.GroovySystem.<clinit>(GroovySystem.java:33)
at java.base/jdk.internal.reflect.NativeMethodAccessorImpl.invoke0(Native Method)
at java.base/jdk.internal.reflect.NativeMethodAccessorImpl.invoke(NativeMethodAccessorImpl.java:77)
at java.base/jdk.internal.reflect.DelegatingMethodAccessorImpl.invoke(DelegatingMethodAccessorImpl.java:43)
at java.base/java.lang.reflect.Method.invoke(Method.java:568)
at org.codehaus.gmaven.plugin.util.GroovyVersionHelper.getVersion(GroovyVersionHelper.java:81)
at org.codehaus.gmaven.plugin.util.GroovyVersionHelper.detectVersion(GroovyVersionHelper.java:55)
at org.codehaus.gmaven.plugin.RuntimeMojoSupport.ensureGroovyComparability(RuntimeMojoSupport.java:240)
at org.codehaus.gmaven.plugin.RuntimeMojoSupport.prepare(RuntimeMojoSupport.java:171)
at org.codehaus.gmaven.plugin.MojoSupport.execute(MojoSupport.java:42)
at org.apache.maven.plugin.DefaultBuildPluginManager.executeMojo(DefaultBuildPluginManager.java:126)
at org.apache.maven.lifecycle.internal.MojoExecutor.doExecute2(MojoExecutor.java:328)
at org.apache.maven.lifecycle.internal.MojoExecutor.doExecute(MojoExecutor.java:316)
at org.apache.maven.lifecycle.internal.MojoExecutor.execute(MojoExecutor.java:212)
at org.apache.maven.lifecycle.internal.MojoExecutor.execute(MojoExecutor.java:174)
at org.apache.maven.lifecycle.internal.MojoExecutor.access$000(MojoExecutor.java:75)
at org.apache.maven.lifecycle.internal.MojoExecutor$1.run(MojoExecutor.java:162)
at org.apache.maven.plugin.DefaultMojosExecutionStrategy.execute(DefaultMojosExecutionStrategy.java:39)
at org.apache.maven.lifecycle.internal.MojoExecutor.execute(MojoExecutor.java:159)
at org.apache.maven.lifecycle.internal.LifecycleModuleBuilder.buildProject(LifecycleModuleBuilder.java:105)
at org.apache.maven.lifecycle.internal.LifecycleModuleBuilder.buildProject(LifecycleModuleBuilder.java:73)
at org.apache.maven.lifecycle.internal.builder.singlethreaded.SingleThreadedBuilder.build(SingleThreadedBuilder.java:53)
at org.apache.maven.lifecycle.internal.LifecycleStarter.execute(LifecycleStarter.java:118)
at org.apache.maven.DefaultMaven.doExecute(DefaultMaven.java:261)
at org.apache.maven.DefaultMaven.doExecute(DefaultMaven.java:173)
at org.apache.maven.DefaultMaven.execute(DefaultMaven.java:101)
at org.jvnet.hudson.maven3.launcher.Maven35Launcher.main(Maven35Launcher.java:138)
at java.base/jdk.internal.reflect.NativeMethodAccessorImpl.invoke0(Native Method)
at java.base/jdk.internal.reflect.NativeMethodAccessorImpl.invoke(NativeMethodAccessorImpl.java:77)
at java.base/jdk.internal.reflect.DelegatingMethodAccessorImpl.invoke(DelegatingMethodAccessorImpl.java:43)
at java.base/java.lang.reflect.Method.invoke(Method.java:568)
at org.codehaus.plexus.classworlds.launcher.Launcher.launchEnhanced(Launcher.java:255)
at org.codehaus.plexus.classworlds.launcher.Launcher.launch(Launcher.java:201)
at jenkins.maven3.agent.Maven35Main.launch(Maven35Main.java:179)
at java.base/jdk.internal.reflect.NativeMethodAccessorImpl.invoke0(Native Method)
at java.base/jdk.internal.reflect.NativeMethodAccessorImpl.invoke(NativeMethodAccessorImpl.java:77)
at java.base/jdk.internal.reflect.DelegatingMethodAccessorImpl.invoke(DelegatingMethodAccessorImpl.java:43)
at java.base/java.lang.reflect.Method.invoke(Method.java:568)
at PluginClassLoader for maven-plugin//hudson.maven.Maven3Builder.call(Maven3Builder.java:140)
at PluginClassLoader for maven-plugin//hudson.maven.Maven3Builder.call(Maven3Builder.java:71)
at hudson.remoting.UserRequest.perform(UserRequest.java:225)
at hudson.remoting.UserRequest.perform(UserRequest.java:50)
at hudson.remoting.Request$2.run(Request.java:391)
at hudson.remoting.InterceptingExecutorService.lambda$wrap$0(InterceptingExecutorService.java:81)
at java.base/java.util.concurrent.FutureTask.run(FutureTask.java:264)
at java.base/java.util.concurrent.ThreadPoolExecutor.runWorker(ThreadPoolExecutor.java:1136)
at java.base/java.util.concurrent.ThreadPoolExecutor$Worker.run(ThreadPoolExecutor.java:635)
at java.base/java.lang.Thread.run(Thread.java:833)
[ERROR] Unable to determine Groovy version
WARNING: A terminally deprecated method in java.lang.System has been called
WARNING: System::setSecurityManager has been called by org.codehaus.gmaven.plugin.util.SystemNoExitGuard (file:/home/jenkins/.m2/repository/org/codehaus/gmaven/groovy-maven-plugin/2.0/groovy-maven-plugin-2.0.jar)
WARNING: Please consider reporting this to the maintainers of org.codehaus.gmaven.plugin.util.SystemNoExitGuard
WARNING: System::setSecurityManager will be removed in a future release