You are viewing a plain text version of this content. The canonical link for it is here.
Posted to dev@tuscany.apache.org by "Luciano Resende (JIRA)" <de...@tuscany.apache.org> on 2008/07/29 00:18:35 UTC
[jira] Commented: (TUSCANY-2508) build-dependency.xml missing from
zipcode-jaxws, alert-aggregator-webapp and xml-bigbank
[ https://issues.apache.org/jira/browse/TUSCANY-2508?page=com.atlassian.jira.plugin.system.issuetabpanels:comment-tabpanel&focusedCommentId=12617589#action_12617589 ]
Luciano Resende commented on TUSCANY-2508:
------------------------------------------
Building the actual demo with maven (from source distro) and copying the build-dependency.xml works (build successfully) . so it's a matter of providing the file with the binary distro.
> build-dependency.xml missing from zipcode-jaxws, alert-aggregator-webapp and xml-bigbank
> ----------------------------------------------------------------------------------------
>
> Key: TUSCANY-2508
> URL: https://issues.apache.org/jira/browse/TUSCANY-2508
> Project: Tuscany
> Issue Type: Bug
> Components: Java SCA Samples
> Affects Versions: Java-SCA-1.3
> Environment: WinXP SP2 IBM JDK 5
> Reporter: Simon Laws
> Fix For: Java-SCA-1.3
>
>
> zipcode-jaxws
> BUILD FAILED
> java.io.FileNotFoundException: C:\simon\tuscany\release\sca-r1.3-rc2\tuscany-sca
> -1.3\samples\zipcode-jaxws\build-dependency.xml (The system cannot find the file
> specified.)
> alert-aggregator-webapp
> BUILD FAILED
> java.io.FileNotFoundException: C:\simon\tuscany\release\sca-r1.3-rc2\tuscany-sca
> -1.3\demos\alert-aggregator-webapp\build-dependency.xml (The system cannot find
> the file specified.)
> xml-bigbank
> BUILD FAILED
> java.io.FileNotFoundException: C:\simon\tuscany\release\sca-r1.3-rc2\tuscany-sca
> -1.3\demos\xml-bigbank\build-dependency.xml (The system cannot find the file spe
> cified.)
--
This message is automatically generated by JIRA.
-
You can reply to this email to add a comment to the issue online.