You are viewing a plain text version of this content. The canonical link for it is here.
Posted to notifications@commons.apache.org by Apache Jenkins Server <je...@builds.apache.org> on 2026/10/03 19:41:35 UTC
Build failed in Jenkins: Commons » commons-net-windows #349
See <https://ci-builds.apache.org/job/Commons/job/commons-net-windows/349/display/redirect?page=changes>
Changes:
[garydgregory] Add Java 27 to GH CI
------------------------------------------
Started by an SCM change
Running as SYSTEM
[EnvInject] - Loading node environment variables.
Building remotely on jenkins-win-azr-10 (Windows-Docker Windows) in workspace <https://ci-builds.apache.org/job/Commons/job/commons-net-windows/ws/>
The recommended git tool is: NONE
No credentials specified
> git rev-parse --resolve-git-dir <https://ci-builds.apache.org/job/Commons/job/commons-net-windows/ws/.git> # timeout=10
Fetching changes from the remote Git repository
> git config remote.origin.url https://gitbox.apache.org/repos/asf/commons-net.git # timeout=10
Fetching upstream changes from https://gitbox.apache.org/repos/asf/commons-net.git
> git --version # timeout=10
> git --version # 'git version 2.14.3.windows.1'
> git fetch --tags --progress -- https://gitbox.apache.org/repos/asf/commons-net.git +refs/heads/*:refs/remotes/origin/* # timeout=10
> git rev-parse "refs/remotes/origin/master^{commit}" # timeout=10
Checking out Revision 3356e9978f10cd0dfbbe095ab3a8d1d07919da04 (refs/remotes/origin/master)
> git config core.sparsecheckout # timeout=10
> git checkout -f 3356e9978f10cd0dfbbe095ab3a8d1d07919da04 # timeout=10
Commit message: "Add Java 27 to GH CI"
> git rev-list --no-walk 10d17795f5a5a5d8c6c2f59ec0d0f401106c3227 # timeout=10
[EnvInject] - Injecting environment variables from a build step.
ERROR: No tool found matching JDK_1_7_LATEST__HOME
Setting JDK_1_8_LATEST_WINDOWS_HOME=F:\jenkins\tools\java\latest1.8
[EnvInject] - Injecting as environment variables the properties content
JAVA_1_8_HOME=F:\jenkins\tools\java\latest1.8
[EnvInject] - Variables injected successfully.
ERROR: No tool found matching JDK_1_7_LATEST__HOME
Setting JDK_1_8_LATEST_WINDOWS_HOME=F:\jenkins\tools\java\latest1.8
Parsing POMs
ERROR: No tool found matching JDK_1_7_LATEST__HOME
Setting JDK_1_8_LATEST_WINDOWS_HOME=F:\jenkins\tools\java\latest1.8
Established TCP socket on 56258
maven35-agent.jar already up to date
maven35-interceptor.jar already up to date
maven3-interceptor-commons.jar already up to date
[commons-net-windows] $ java -cp f:\jenkins\jenkins-home\712657a4\maven35-agent.jar;f:\jenkins\tools\maven\latest\boot\plexus-classworlds-2.11.0.jar;f:\\jenkins\\tools\\maven\\latest/conf/logging jenkins.maven3.agent.Maven35Main f:\\jenkins\\tools\\maven\\latest F:\jenkins\jenkins-home\agent.jar f:\jenkins\jenkins-home\712657a4\maven35-interceptor.jar f:\jenkins\jenkins-home\712657a4\maven3-interceptor-commons.jar 56258
<===[JENKINS REMOTING CAPACITY]===> channel started
ERROR: No tool found matching JDK_1_7_LATEST__HOME
Setting JDK_1_8_LATEST_WINDOWS_HOME=F:\jenkins\tools\java\latest1.8
Executing Maven: -B -f <https://ci-builds.apache.org/job/Commons/job/commons-net-windows/ws/pom.xml> -V clean install --no-transfer-progress --batch-mode -Pjava-1.8
[1mApache Maven 3.9.16 (2bdd9fddda4b155ebf8000e807eb73fd829a51d5)[m
Maven home: F:\jenkins\tools\maven\latest
Java version: 17.0.7, vendor: Eclipse Adoptium, runtime: F:\jenkins\tools\java\latest17
Default locale: en_US, platform encoding: Cp1252
OS name: "windows server 2019", version: "10.0", arch: "amd64", family: "windows"
[INFO] Scanning for projects...
[HUDSON] Collecting dependencies info
[INFO]
[INFO] ----------------------< commons-net:commons-net >-----------------------
[INFO] Building Apache Commons Net 3.13.1-SNAPSHOT
[INFO] from pom.xml
[INFO] --------------------------------[ jar ]---------------------------------
[INFO] Downloading from central: https://repo.maven.apache.org/maven2/org/apache/commons/commons-lang3/3.21.0/commons-lang3-3.21.0.pom
[INFO] Downloaded from central: https://repo.maven.apache.org/maven2/org/apache/commons/commons-lang3/3.21.0/commons-lang3-3.21.0.pom (36 kB at 73 kB/s)
[INFO] Downloading from central: https://repo.maven.apache.org/maven2/org/apache/commons/commons-lang3/3.21.0/commons-lang3-3.21.0.jar
[INFO] Downloaded from central: https://repo.maven.apache.org/maven2/org/apache/commons/commons-lang3/3.21.0/commons-lang3-3.21.0.jar (749 kB at 4.3 MB/s)
[INFO]
[INFO] --- clean:3.5.0:clean (default-clean) @ commons-net ---
[INFO]
[INFO] --- enforcer:3.6.3:enforce (enforce-maven-version) @ commons-net ---
[INFO] Rule 0: org.apache.maven.enforcer.rules.version.RequireMavenVersion passed
[INFO]
[INFO] --- enforcer:3.6.3:enforce (enforce-java-version) @ commons-net ---
[INFO] Rule 0: org.apache.maven.enforcer.rules.version.RequireJavaVersion passed
[INFO]
[INFO] --- apache-rat:0.18:check (rat-check) @ commons-net ---
[ERROR] Could not create report parent directory <https://ci-builds.apache.org/job/Commons/job/commons-net-windows/ws/f>:\jenkins\jenkins-home\712657a4\workspace\Commons\commons-net-windows\target\rat.txt
[WARNING] Unable to create directory: <https://ci-builds.apache.org/job/Commons/job/commons-net-windows/ws/f>:\jenkins\jenkins-home\712657a4\workspace\Commons\commons-net-windows\target
[WARNING] Attempt to (de-)serialize anonymous class org.jfrog.hudson.maven2.MavenDependenciesRecorder$1; see: https://jenkins.io/redirect/serialization-of-anonymous-classes/
[INFO] ------------------------------------------------------------------------
[INFO] BUILD FAILURE
[INFO] ------------------------------------------------------------------------
[INFO] Total time: 33.918 s
[INFO] Finished at: 2026-10-03T19:41:31Z
[INFO] ------------------------------------------------------------------------
Waiting for Jenkins to finish collecting data
[ERROR] Failed to execute goal org.apache.rat:apache-rat-plugin:0.18:check (rat-check) on project commons-net: java.io.FileNotFoundException: <https://ci-builds.apache.org/job/Commons/job/commons-net-windows/ws/f>:\jenkins\jenkins-home\712657a4\workspace\Commons\commons-net-windows\target\rat.txt (The filename, directory name, or volume label syntax is incorrect) -> [Help 1]
[ERROR]
[ERROR] To see the full stack trace of the errors, re-run Maven with the -e switch.
[ERROR] Re-run Maven using the -X switch to enable full debug logging.
[ERROR]
[ERROR] For more information about the errors and possible solutions, please read the following articles:
[ERROR] [Help 1] http://cwiki.apache.org/confluence/display/MAVEN/MojoExecutionException
[JENKINS] Archiving <https://ci-builds.apache.org/job/Commons/job/commons-net-windows/ws/pom.xml> to commons-net/commons-net/3.13.1-SNAPSHOT/commons-net-3.13.1-SNAPSHOT.pom
Sending e-mails to: notifications@commons.apache.org
channel stopped
ERROR: No tool found matching JDK_1_7_LATEST__HOME
Setting JDK_1_8_LATEST_WINDOWS_HOME=F:\jenkins\tools\java\latest1.8
ERROR: No tool found matching JDK_1_7_LATEST__HOME
Setting JDK_1_8_LATEST_WINDOWS_HOME=F:\jenkins\tools\java\latest1.8
Build failed in Jenkins: Commons » commons-net-windows #356
Posted by Apache Jenkins Server <je...@builds.apache.org>.
See <https://ci-builds.apache.org/job/Commons/job/commons-net-windows/356/display/redirect?page=changes>
Changes:
[garydgregory] Bump ossf/scorecard-action from 2.4.4 to 2.5.0
------------------------------------------
Started by an SCM change
Running as SYSTEM
[EnvInject] - Loading node environment variables.
Building remotely on jenkins-win-azr-6 (Windows-Docker Windows) in workspace <https://ci-builds.apache.org/job/Commons/job/commons-net-windows/ws/>
The recommended git tool is: NONE
No credentials specified
> git rev-parse --resolve-git-dir <https://ci-builds.apache.org/job/Commons/job/commons-net-windows/ws/.git> # timeout=10
Fetching changes from the remote Git repository
> git config remote.origin.url https://gitbox.apache.org/repos/asf/commons-net.git # timeout=10
Fetching upstream changes from https://gitbox.apache.org/repos/asf/commons-net.git
> git --version # timeout=10
> git --version # 'git version 2.14.3.windows.1'
> git fetch --tags --progress -- https://gitbox.apache.org/repos/asf/commons-net.git +refs/heads/*:refs/remotes/origin/* # timeout=10
> git rev-parse "refs/remotes/origin/master^{commit}" # timeout=10
Checking out Revision b347d06f0946e2f018747951e92dae74df41672a (refs/remotes/origin/master)
> git config core.sparsecheckout # timeout=10
> git checkout -f b347d06f0946e2f018747951e92dae74df41672a # timeout=10
Commit message: "Bump ossf/scorecard-action from 2.4.4 to 2.5.0"
> git rev-list --no-walk cf9da6e7b2ded2b515a14b009cc0e95411eb246a # timeout=10
[EnvInject] - Injecting environment variables from a build step.
ERROR: No tool found matching JDK_1_7_LATEST__HOME
Setting JDK_1_8_LATEST_WINDOWS_HOME=F:\jenkins\tools\java\latest1.8
[EnvInject] - Injecting as environment variables the properties content
JAVA_1_8_HOME=F:\jenkins\tools\java\latest1.8
[EnvInject] - Variables injected successfully.
ERROR: No tool found matching JDK_1_7_LATEST__HOME
Setting JDK_1_8_LATEST_WINDOWS_HOME=F:\jenkins\tools\java\latest1.8
Parsing POMs
ERROR: No tool found matching JDK_1_7_LATEST__HOME
Setting JDK_1_8_LATEST_WINDOWS_HOME=F:\jenkins\tools\java\latest1.8
Downloaded artifact https://repo.maven.apache.org/maven2/org/apache/commons/commons-parent/106/commons-parent-106.pom
Downloaded artifact https://repo.maven.apache.org/maven2/org/apache/apache/40/apache-40.pom
Established TCP socket on 54141
maven35-agent.jar already up to date
maven35-interceptor.jar already up to date
maven3-interceptor-commons.jar already up to date
[commons-net-windows] $ java -cp f:\jenkins\jenkins-home\712657a4\maven35-agent.jar;f:\jenkins\tools\maven\latest\boot\plexus-classworlds-2.11.0.jar;f:\\jenkins\\tools\\maven\\latest/conf/logging jenkins.maven3.agent.Maven35Main f:\\jenkins\\tools\\maven\\latest F:\jenkins\jenkins-home\agent.jar f:\jenkins\jenkins-home\712657a4\maven35-interceptor.jar f:\jenkins\jenkins-home\712657a4\maven3-interceptor-commons.jar 54141
<===[JENKINS REMOTING CAPACITY]===> channel started
ERROR: No tool found matching JDK_1_7_LATEST__HOME
Setting JDK_1_8_LATEST_WINDOWS_HOME=F:\jenkins\tools\java\latest1.8
Executing Maven: -B -f <https://ci-builds.apache.org/job/Commons/job/commons-net-windows/ws/pom.xml> -V clean install --no-transfer-progress --batch-mode -Pjava-1.8
[1mApache Maven 3.9.16 (2bdd9fddda4b155ebf8000e807eb73fd829a51d5)[m
Maven home: F:\jenkins\tools\maven\latest
Java version: 17.0.7, vendor: Eclipse Adoptium, runtime: F:\jenkins\tools\java\latest17
Default locale: en_US, platform encoding: Cp1252
OS name: "windows server 2019", version: "10.0", arch: "amd64", family: "windows"
[INFO] Scanning for projects...
[HUDSON] Collecting dependencies info
[INFO]
[INFO] ----------------------< commons-net:commons-net >-----------------------
[INFO] Building Apache Commons Net 3.13.1-SNAPSHOT
[INFO] from pom.xml
[INFO] --------------------------------[ jar ]---------------------------------
[INFO] Downloading from central: https://repo.maven.apache.org/maven2/org/codehaus/mojo/build-helper-maven-plugin/3.6.2/build-helper-maven-plugin-3.6.2.pom
[INFO] Downloaded from central: https://repo.maven.apache.org/maven2/org/codehaus/mojo/build-helper-maven-plugin/3.6.2/build-helper-maven-plugin-3.6.2.pom (7.9 kB at 18 kB/s)
[INFO] Downloading from central: https://repo.maven.apache.org/maven2/org/codehaus/mojo/mojo-parent/97/mojo-parent-97.pom
[INFO] Downloaded from central: https://repo.maven.apache.org/maven2/org/codehaus/mojo/mojo-parent/97/mojo-parent-97.pom (39 kB at 344 kB/s)
[INFO] Downloading from central: https://repo.maven.apache.org/maven2/org/codehaus/mojo/build-helper-maven-plugin/3.6.2/build-helper-maven-plugin-3.6.2.jar
[INFO] Downloaded from central: https://repo.maven.apache.org/maven2/org/codehaus/mojo/build-helper-maven-plugin/3.6.2/build-helper-maven-plugin-3.6.2.jar (72 kB at 635 kB/s)
[INFO] Downloading from central: https://repo.maven.apache.org/maven2/org/codehaus/mojo/exec-maven-plugin/3.6.4/exec-maven-plugin-3.6.4.pom
[INFO] Downloaded from central: https://repo.maven.apache.org/maven2/org/codehaus/mojo/exec-maven-plugin/3.6.4/exec-maven-plugin-3.6.4.pom (16 kB at 166 kB/s)
[INFO] Downloading from central: https://repo.maven.apache.org/maven2/org/codehaus/mojo/exec-maven-plugin/3.6.4/exec-maven-plugin-3.6.4.jar
[INFO] Downloaded from central: https://repo.maven.apache.org/maven2/org/codehaus/mojo/exec-maven-plugin/3.6.4/exec-maven-plugin-3.6.4.jar (94 kB at 1.2 MB/s)
[INFO] Downloading from central: https://repo.maven.apache.org/maven2/org/apache/maven/plugins/maven-artifact-plugin/3.7.0/maven-artifact-plugin-3.7.0.pom
[INFO] Downloaded from central: https://repo.maven.apache.org/maven2/org/apache/maven/plugins/maven-artifact-plugin/3.7.0/maven-artifact-plugin-3.7.0.pom (9.8 kB at 97 kB/s)
[INFO] Downloading from central: https://repo.maven.apache.org/maven2/org/apache/maven/plugins/maven-artifact-plugin/3.7.0/maven-artifact-plugin-3.7.0.jar
[INFO] Downloaded from central: https://repo.maven.apache.org/maven2/org/apache/maven/plugins/maven-artifact-plugin/3.7.0/maven-artifact-plugin-3.7.0.jar (85 kB at 929 kB/s)
[INFO] Downloading from central: https://repo.maven.apache.org/maven2/org/apache/felix/maven-bundle-plugin/6.2.0/maven-bundle-plugin-6.2.0.pom
[INFO] Downloaded from central: https://repo.maven.apache.org/maven2/org/apache/felix/maven-bundle-plugin/6.2.0/maven-bundle-plugin-6.2.0.pom (12 kB at 141 kB/s)
[INFO] Downloading from central: https://repo.maven.apache.org/maven2/org/apache/felix/maven-bundle-plugin/6.2.0/maven-bundle-plugin-6.2.0.jar
[INFO] Downloaded from central: https://repo.maven.apache.org/maven2/org/apache/felix/maven-bundle-plugin/6.2.0/maven-bundle-plugin-6.2.0.jar (215 kB at 2.3 MB/s)
[INFO] Downloading from central: https://repo.maven.apache.org/maven2/org/cyclonedx/cyclonedx-maven-plugin/2.9.3/cyclonedx-maven-plugin-2.9.3.pom
[INFO] Downloaded from central: https://repo.maven.apache.org/maven2/org/cyclonedx/cyclonedx-maven-plugin/2.9.3/cyclonedx-maven-plugin-2.9.3.pom (19 kB at 224 kB/s)
[INFO] Downloading from central: https://repo.maven.apache.org/maven2/org/cyclonedx/cyclonedx-maven-plugin/2.9.3/cyclonedx-maven-plugin-2.9.3.jar
[INFO] Downloaded from central: https://repo.maven.apache.org/maven2/org/cyclonedx/cyclonedx-maven-plugin/2.9.3/cyclonedx-maven-plugin-2.9.3.jar (52 kB at 579 kB/s)
[INFO] Downloading from central: https://repo.maven.apache.org/maven2/org/apache/maven/plugins/maven-install-plugin/3.2.0/maven-install-plugin-3.2.0.pom
[INFO] Downloaded from central: https://repo.maven.apache.org/maven2/org/apache/maven/plugins/maven-install-plugin/3.2.0/maven-install-plugin-3.2.0.pom (7.9 kB at 113 kB/s)
[INFO] Downloading from central: https://repo.maven.apache.org/maven2/org/apache/maven/plugins/maven-install-plugin/3.2.0/maven-install-plugin-3.2.0.jar
[INFO] Downloaded from central: https://repo.maven.apache.org/maven2/org/apache/maven/plugins/maven-install-plugin/3.2.0/maven-install-plugin-3.2.0.jar (37 kB at 130 kB/s)
[INFO] Downloading from central: https://repo.maven.apache.org/maven2/org/apache/commons/commons-collections4/4.6.0/commons-collections4-4.6.0.pom
[INFO] Downloaded from central: https://repo.maven.apache.org/maven2/org/apache/commons/commons-collections4/4.6.0/commons-collections4-4.6.0.pom (28 kB at 299 kB/s)
[INFO] Downloading from central: https://repo.maven.apache.org/maven2/org/apache/commons/commons-collections4/4.6.0/commons-collections4-4.6.0.jar
[INFO] Downloaded from central: https://repo.maven.apache.org/maven2/org/apache/commons/commons-collections4/4.6.0/commons-collections4-4.6.0.jar (934 kB at 6.8 MB/s)
[INFO]
[INFO] --- clean:3.5.0:clean (default-clean) @ commons-net ---
[INFO]
[INFO] --- enforcer:3.6.3:enforce (enforce-maven-version) @ commons-net ---
[INFO] Rule 0: org.apache.maven.enforcer.rules.version.RequireMavenVersion passed
[INFO]
[INFO] --- enforcer:3.6.3:enforce (enforce-java-version) @ commons-net ---
[INFO] Rule 0: org.apache.maven.enforcer.rules.version.RequireJavaVersion passed
[INFO]
[INFO] --- apache-rat:0.18:check (rat-check) @ commons-net ---
[ERROR] Could not create report parent directory <https://ci-builds.apache.org/job/Commons/job/commons-net-windows/ws/f>:\jenkins\jenkins-home\712657a4\workspace\Commons\commons-net-windows\target\rat.txt
[WARNING] Unable to create directory: <https://ci-builds.apache.org/job/Commons/job/commons-net-windows/ws/f>:\jenkins\jenkins-home\712657a4\workspace\Commons\commons-net-windows\target
[WARNING] Attempt to (de-)serialize anonymous class org.jfrog.hudson.maven2.MavenDependenciesRecorder$1; see: https://jenkins.io/redirect/serialization-of-anonymous-classes/
[INFO] ------------------------------------------------------------------------
[INFO] BUILD FAILURE
[INFO] ------------------------------------------------------------------------
[INFO] Total time: 34.411 s
[INFO] Finished at: 2026-10-21T19:41:56Z
[INFO] ------------------------------------------------------------------------
Waiting for Jenkins to finish collecting data
[ERROR] Failed to execute goal org.apache.rat:apache-rat-plugin:0.18:check (rat-check) on project commons-net: java.io.FileNotFoundException: <https://ci-builds.apache.org/job/Commons/job/commons-net-windows/ws/f>:\jenkins\jenkins-home\712657a4\workspace\Commons\commons-net-windows\target\rat.txt (The filename, directory name, or volume label syntax is incorrect) -> [Help 1]
[ERROR]
[ERROR] To see the full stack trace of the errors, re-run Maven with the -e switch.
[ERROR] Re-run Maven using the -X switch to enable full debug logging.
[ERROR]
[ERROR] For more information about the errors and possible solutions, please read the following articles:
[ERROR] [Help 1] http://cwiki.apache.org/confluence/display/MAVEN/MojoExecutionException
[JENKINS] Archiving <https://ci-builds.apache.org/job/Commons/job/commons-net-windows/ws/pom.xml> to commons-net/commons-net/3.13.1-SNAPSHOT/commons-net-3.13.1-SNAPSHOT.pom
Sending e-mails to: notifications@commons.apache.org
channel stopped
ERROR: No tool found matching JDK_1_7_LATEST__HOME
Setting JDK_1_8_LATEST_WINDOWS_HOME=F:\jenkins\tools\java\latest1.8
ERROR: No tool found matching JDK_1_7_LATEST__HOME
Setting JDK_1_8_LATEST_WINDOWS_HOME=F:\jenkins\tools\java\latest1.8
Build failed in Jenkins: Commons » commons-net-windows #355
Posted by Apache Jenkins Server <je...@builds.apache.org>.
See <https://ci-builds.apache.org/job/Commons/job/commons-net-windows/355/display/redirect?page=changes>
Changes:
[garydgregory] Bump github/codeql-action from 4.38.3 to 4.39.0
------------------------------------------
Started by an SCM change
Running as SYSTEM
[EnvInject] - Loading node environment variables.
Building remotely on jenkins-win-azr-8 (Windows-Docker Windows) in workspace <https://ci-builds.apache.org/job/Commons/job/commons-net-windows/ws/>
The recommended git tool is: NONE
No credentials specified
> git rev-parse --resolve-git-dir <https://ci-builds.apache.org/job/Commons/job/commons-net-windows/ws/.git> # timeout=10
Fetching changes from the remote Git repository
> git config remote.origin.url https://gitbox.apache.org/repos/asf/commons-net.git # timeout=10
Fetching upstream changes from https://gitbox.apache.org/repos/asf/commons-net.git
> git --version # timeout=10
> git --version # 'git version 2.14.3.windows.1'
> git fetch --tags --progress -- https://gitbox.apache.org/repos/asf/commons-net.git +refs/heads/*:refs/remotes/origin/* # timeout=10
> git rev-parse "refs/remotes/origin/master^{commit}" # timeout=10
Checking out Revision cf9da6e7b2ded2b515a14b009cc0e95411eb246a (refs/remotes/origin/master)
> git config core.sparsecheckout # timeout=10
> git checkout -f cf9da6e7b2ded2b515a14b009cc0e95411eb246a # timeout=10
Commit message: "Bump github/codeql-action from 4.38.3 to 4.39.0"
> git rev-list --no-walk 39a85646d21002de4df6082342485dc2dedecd5a # timeout=10
[EnvInject] - Injecting environment variables from a build step.
ERROR: No tool found matching JDK_1_7_LATEST__HOME
Setting JDK_1_8_LATEST_WINDOWS_HOME=F:\jenkins\tools\java\latest1.8
[EnvInject] - Injecting as environment variables the properties content
JAVA_1_8_HOME=F:\jenkins\tools\java\latest1.8
[EnvInject] - Variables injected successfully.
ERROR: No tool found matching JDK_1_7_LATEST__HOME
Setting JDK_1_8_LATEST_WINDOWS_HOME=F:\jenkins\tools\java\latest1.8
Parsing POMs
ERROR: No tool found matching JDK_1_7_LATEST__HOME
Setting JDK_1_8_LATEST_WINDOWS_HOME=F:\jenkins\tools\java\latest1.8
Established TCP socket on 63587
maven35-agent.jar already up to date
maven35-interceptor.jar already up to date
maven3-interceptor-commons.jar already up to date
[commons-net-windows] $ java -cp f:\jenkins\jenkins-home\712657a4\maven35-agent.jar;f:\jenkins\tools\maven\latest\boot\plexus-classworlds-2.11.0.jar;f:\\jenkins\\tools\\maven\\latest/conf/logging jenkins.maven3.agent.Maven35Main f:\\jenkins\\tools\\maven\\latest F:\jenkins\jenkins-home\agent.jar f:\jenkins\jenkins-home\712657a4\maven35-interceptor.jar f:\jenkins\jenkins-home\712657a4\maven3-interceptor-commons.jar 63587
<===[JENKINS REMOTING CAPACITY]===> channel started
ERROR: No tool found matching JDK_1_7_LATEST__HOME
Setting JDK_1_8_LATEST_WINDOWS_HOME=F:\jenkins\tools\java\latest1.8
Executing Maven: -B -f <https://ci-builds.apache.org/job/Commons/job/commons-net-windows/ws/pom.xml> -V clean install --no-transfer-progress --batch-mode -Pjava-1.8
[1mApache Maven 3.9.16 (2bdd9fddda4b155ebf8000e807eb73fd829a51d5)[m
Maven home: F:\jenkins\tools\maven\latest
Java version: 17.0.7, vendor: Eclipse Adoptium, runtime: F:\jenkins\tools\java\latest17
Default locale: en_US, platform encoding: Cp1252
OS name: "windows server 2019", version: "10.0", arch: "amd64", family: "windows"
[INFO] Scanning for projects...
[HUDSON] Collecting dependencies info
[INFO]
[INFO] ----------------------< commons-net:commons-net >-----------------------
[INFO] Building Apache Commons Net 3.13.1-SNAPSHOT
[INFO] from pom.xml
[INFO] --------------------------------[ jar ]---------------------------------
[INFO]
[INFO] --- clean:3.5.0:clean (default-clean) @ commons-net ---
[INFO]
[INFO] --- enforcer:3.6.3:enforce (enforce-maven-version) @ commons-net ---
[INFO] Rule 0: org.apache.maven.enforcer.rules.version.RequireMavenVersion passed
[INFO]
[INFO] --- enforcer:3.6.3:enforce (enforce-java-version) @ commons-net ---
[INFO] Rule 0: org.apache.maven.enforcer.rules.version.RequireJavaVersion passed
[INFO]
[INFO] --- apache-rat:0.18:check (rat-check) @ commons-net ---
[ERROR] Could not create report parent directory <https://ci-builds.apache.org/job/Commons/job/commons-net-windows/ws/f>:\jenkins\jenkins-home\712657a4\workspace\Commons\commons-net-windows\target\rat.txt
[WARNING] Unable to create directory: <https://ci-builds.apache.org/job/Commons/job/commons-net-windows/ws/f>:\jenkins\jenkins-home\712657a4\workspace\Commons\commons-net-windows\target
[WARNING] Attempt to (de-)serialize anonymous class org.jfrog.hudson.maven2.MavenDependenciesRecorder$1; see: https://jenkins.io/redirect/serialization-of-anonymous-classes/
[INFO] ------------------------------------------------------------------------
[INFO] BUILD FAILURE
[INFO] ------------------------------------------------------------------------
[INFO] Total time: 30.462 s
[INFO] Finished at: 2026-10-21T00:41:44Z
[INFO] ------------------------------------------------------------------------
Waiting for Jenkins to finish collecting data
[ERROR] Failed to execute goal org.apache.rat:apache-rat-plugin:0.18:check (rat-check) on project commons-net: java.io.FileNotFoundException: <https://ci-builds.apache.org/job/Commons/job/commons-net-windows/ws/f>:\jenkins\jenkins-home\712657a4\workspace\Commons\commons-net-windows\target\rat.txt (The filename, directory name, or volume label syntax is incorrect) -> [Help 1]
[ERROR]
[ERROR] To see the full stack trace of the errors, re-run Maven with the -e switch.
[ERROR] Re-run Maven using the -X switch to enable full debug logging.
[ERROR]
[ERROR] For more information about the errors and possible solutions, please read the following articles:
[ERROR] [Help 1] http://cwiki.apache.org/confluence/display/MAVEN/MojoExecutionException
[JENKINS] Archiving <https://ci-builds.apache.org/job/Commons/job/commons-net-windows/ws/pom.xml> to commons-net/commons-net/3.13.1-SNAPSHOT/commons-net-3.13.1-SNAPSHOT.pom
Sending e-mails to: notifications@commons.apache.org
channel stopped
ERROR: No tool found matching JDK_1_7_LATEST__HOME
Setting JDK_1_8_LATEST_WINDOWS_HOME=F:\jenkins\tools\java\latest1.8
ERROR: No tool found matching JDK_1_7_LATEST__HOME
Setting JDK_1_8_LATEST_WINDOWS_HOME=F:\jenkins\tools\java\latest1.8
Build failed in Jenkins: Commons » commons-net-windows #354
Posted by Apache Jenkins Server <je...@builds.apache.org>.
See <https://ci-builds.apache.org/job/Commons/job/commons-net-windows/354/display/redirect?page=changes>
Changes:
[garydgregory] Bump actions/setup-java from 6.0.1 to 6.1.0
------------------------------------------
Started by an SCM change
Running as SYSTEM
[EnvInject] - Loading node environment variables.
Building remotely on jenkins-win-azr-8 (Windows-Docker Windows) in workspace <https://ci-builds.apache.org/job/Commons/job/commons-net-windows/ws/>
The recommended git tool is: NONE
No credentials specified
> git rev-parse --resolve-git-dir <https://ci-builds.apache.org/job/Commons/job/commons-net-windows/ws/.git> # timeout=10
Fetching changes from the remote Git repository
> git config remote.origin.url https://gitbox.apache.org/repos/asf/commons-net.git # timeout=10
Fetching upstream changes from https://gitbox.apache.org/repos/asf/commons-net.git
> git --version # timeout=10
> git --version # 'git version 2.14.3.windows.1'
> git fetch --tags --progress -- https://gitbox.apache.org/repos/asf/commons-net.git +refs/heads/*:refs/remotes/origin/* # timeout=10
> git rev-parse "refs/remotes/origin/master^{commit}" # timeout=10
Checking out Revision 39a85646d21002de4df6082342485dc2dedecd5a (refs/remotes/origin/master)
> git config core.sparsecheckout # timeout=10
> git checkout -f 39a85646d21002de4df6082342485dc2dedecd5a # timeout=10
Commit message: "Bump actions/setup-java from 6.0.1 to 6.1.0"
> git rev-list --no-walk fced3979f79530f5ee01806164062f05fbbd470a # timeout=10
[EnvInject] - Injecting environment variables from a build step.
ERROR: No tool found matching JDK_1_7_LATEST__HOME
Setting JDK_1_8_LATEST_WINDOWS_HOME=F:\jenkins\tools\java\latest1.8
[EnvInject] - Injecting as environment variables the properties content
JAVA_1_8_HOME=F:\jenkins\tools\java\latest1.8
[EnvInject] - Variables injected successfully.
ERROR: No tool found matching JDK_1_7_LATEST__HOME
Setting JDK_1_8_LATEST_WINDOWS_HOME=F:\jenkins\tools\java\latest1.8
Parsing POMs
ERROR: No tool found matching JDK_1_7_LATEST__HOME
Setting JDK_1_8_LATEST_WINDOWS_HOME=F:\jenkins\tools\java\latest1.8
Established TCP socket on 53924
maven35-agent.jar already up to date
maven35-interceptor.jar already up to date
maven3-interceptor-commons.jar already up to date
[commons-net-windows] $ java -cp f:\jenkins\jenkins-home\712657a4\maven35-agent.jar;f:\jenkins\tools\maven\latest\boot\plexus-classworlds-2.11.0.jar;f:\\jenkins\\tools\\maven\\latest/conf/logging jenkins.maven3.agent.Maven35Main f:\\jenkins\\tools\\maven\\latest F:\jenkins\jenkins-home\agent.jar f:\jenkins\jenkins-home\712657a4\maven35-interceptor.jar f:\jenkins\jenkins-home\712657a4\maven3-interceptor-commons.jar 53924
<===[JENKINS REMOTING CAPACITY]===> channel started
ERROR: No tool found matching JDK_1_7_LATEST__HOME
Setting JDK_1_8_LATEST_WINDOWS_HOME=F:\jenkins\tools\java\latest1.8
Executing Maven: -B -f <https://ci-builds.apache.org/job/Commons/job/commons-net-windows/ws/pom.xml> -V clean install --no-transfer-progress --batch-mode -Pjava-1.8
[1mApache Maven 3.9.16 (2bdd9fddda4b155ebf8000e807eb73fd829a51d5)[m
Maven home: F:\jenkins\tools\maven\latest
Java version: 17.0.7, vendor: Eclipse Adoptium, runtime: F:\jenkins\tools\java\latest17
Default locale: en_US, platform encoding: Cp1252
OS name: "windows server 2019", version: "10.0", arch: "amd64", family: "windows"
[INFO] Scanning for projects...
[HUDSON] Collecting dependencies info
[INFO]
[INFO] ----------------------< commons-net:commons-net >-----------------------
[INFO] Building Apache Commons Net 3.13.1-SNAPSHOT
[INFO] from pom.xml
[INFO] --------------------------------[ jar ]---------------------------------
[INFO]
[INFO] --- clean:3.5.0:clean (default-clean) @ commons-net ---
[INFO]
[INFO] --- enforcer:3.6.3:enforce (enforce-maven-version) @ commons-net ---
[INFO] Rule 0: org.apache.maven.enforcer.rules.version.RequireMavenVersion passed
[INFO]
[INFO] --- enforcer:3.6.3:enforce (enforce-java-version) @ commons-net ---
[INFO] Rule 0: org.apache.maven.enforcer.rules.version.RequireJavaVersion passed
[INFO]
[INFO] --- apache-rat:0.18:check (rat-check) @ commons-net ---
[ERROR] Could not create report parent directory <https://ci-builds.apache.org/job/Commons/job/commons-net-windows/ws/f>:\jenkins\jenkins-home\712657a4\workspace\Commons\commons-net-windows\target\rat.txt
[WARNING] Unable to create directory: <https://ci-builds.apache.org/job/Commons/job/commons-net-windows/ws/f>:\jenkins\jenkins-home\712657a4\workspace\Commons\commons-net-windows\target
[WARNING] Attempt to (de-)serialize anonymous class org.jfrog.hudson.maven2.MavenDependenciesRecorder$1; see: https://jenkins.io/redirect/serialization-of-anonymous-classes/
[INFO] ------------------------------------------------------------------------
[INFO] BUILD FAILURE
[INFO] ------------------------------------------------------------------------
[INFO] Total time: 29.564 s
[INFO] Finished at: 2026-10-17T20:41:47Z
[INFO] ------------------------------------------------------------------------
Waiting for Jenkins to finish collecting data
[ERROR] Failed to execute goal org.apache.rat:apache-rat-plugin:0.18:check (rat-check) on project commons-net: java.io.FileNotFoundException: <https://ci-builds.apache.org/job/Commons/job/commons-net-windows/ws/f>:\jenkins\jenkins-home\712657a4\workspace\Commons\commons-net-windows\target\rat.txt (The filename, directory name, or volume label syntax is incorrect) -> [Help 1]
[ERROR]
[ERROR] To see the full stack trace of the errors, re-run Maven with the -e switch.
[ERROR] Re-run Maven using the -X switch to enable full debug logging.
[ERROR]
[ERROR] For more information about the errors and possible solutions, please read the following articles:
[ERROR] [Help 1] http://cwiki.apache.org/confluence/display/MAVEN/MojoExecutionException
[JENKINS] Archiving <https://ci-builds.apache.org/job/Commons/job/commons-net-windows/ws/pom.xml> to commons-net/commons-net/3.13.1-SNAPSHOT/commons-net-3.13.1-SNAPSHOT.pom
Sending e-mails to: notifications@commons.apache.org
channel stopped
ERROR: No tool found matching JDK_1_7_LATEST__HOME
Setting JDK_1_8_LATEST_WINDOWS_HOME=F:\jenkins\tools\java\latest1.8
ERROR: No tool found matching JDK_1_7_LATEST__HOME
Setting JDK_1_8_LATEST_WINDOWS_HOME=F:\jenkins\tools\java\latest1.8
Build failed in Jenkins: Commons » commons-net-windows #353
Posted by Apache Jenkins Server <je...@builds.apache.org>.
See <https://ci-builds.apache.org/job/Commons/job/commons-net-windows/353/display/redirect?page=changes>
Changes:
[github] Bump Apache Commons Parent from 105 to 106 (#411)
[garydgregory] Bump org.apache.commons:commons-parent from 105 to 106
------------------------------------------
Started by an SCM change
Running as SYSTEM
[EnvInject] - Loading node environment variables.
Building remotely on jenkins-win-azr-8 (Windows-Docker Windows) in workspace <https://ci-builds.apache.org/job/Commons/job/commons-net-windows/ws/>
The recommended git tool is: NONE
No credentials specified
> git rev-parse --resolve-git-dir <https://ci-builds.apache.org/job/Commons/job/commons-net-windows/ws/.git> # timeout=10
Fetching changes from the remote Git repository
> git config remote.origin.url https://gitbox.apache.org/repos/asf/commons-net.git # timeout=10
Fetching upstream changes from https://gitbox.apache.org/repos/asf/commons-net.git
> git --version # timeout=10
> git --version # 'git version 2.14.3.windows.1'
> git fetch --tags --progress -- https://gitbox.apache.org/repos/asf/commons-net.git +refs/heads/*:refs/remotes/origin/* # timeout=10
> git rev-parse "refs/remotes/origin/master^{commit}" # timeout=10
Checking out Revision fced3979f79530f5ee01806164062f05fbbd470a (refs/remotes/origin/master)
> git config core.sparsecheckout # timeout=10
> git checkout -f fced3979f79530f5ee01806164062f05fbbd470a # timeout=10
Commit message: "Bump org.apache.commons:commons-parent from 105 to 106"
> git rev-list --no-walk ee6755cd1da9341fc33b3f828f59ef7cb9f2c505 # timeout=10
[EnvInject] - Injecting environment variables from a build step.
ERROR: No tool found matching JDK_1_7_LATEST__HOME
Setting JDK_1_8_LATEST_WINDOWS_HOME=F:\jenkins\tools\java\latest1.8
[EnvInject] - Injecting as environment variables the properties content
JAVA_1_8_HOME=F:\jenkins\tools\java\latest1.8
[EnvInject] - Variables injected successfully.
ERROR: No tool found matching JDK_1_7_LATEST__HOME
Setting JDK_1_8_LATEST_WINDOWS_HOME=F:\jenkins\tools\java\latest1.8
Parsing POMs
ERROR: No tool found matching JDK_1_7_LATEST__HOME
Setting JDK_1_8_LATEST_WINDOWS_HOME=F:\jenkins\tools\java\latest1.8
Downloaded artifact https://repo.maven.apache.org/maven2/org/apache/commons/commons-parent/106/commons-parent-106.pom
Downloaded artifact https://repo.maven.apache.org/maven2/org/apache/apache/40/apache-40.pom
Modules changed, recalculating dependency graph
Established TCP socket on 65451
maven35-agent.jar already up to date
maven35-interceptor.jar already up to date
maven3-interceptor-commons.jar already up to date
[commons-net-windows] $ java -cp f:\jenkins\jenkins-home\712657a4\maven35-agent.jar;f:\jenkins\tools\maven\latest\boot\plexus-classworlds-2.11.0.jar;f:\\jenkins\\tools\\maven\\latest/conf/logging jenkins.maven3.agent.Maven35Main f:\\jenkins\\tools\\maven\\latest F:\jenkins\jenkins-home\agent.jar f:\jenkins\jenkins-home\712657a4\maven35-interceptor.jar f:\jenkins\jenkins-home\712657a4\maven3-interceptor-commons.jar 65451
<===[JENKINS REMOTING CAPACITY]===> channel started
ERROR: No tool found matching JDK_1_7_LATEST__HOME
Setting JDK_1_8_LATEST_WINDOWS_HOME=F:\jenkins\tools\java\latest1.8
Executing Maven: -B -f <https://ci-builds.apache.org/job/Commons/job/commons-net-windows/ws/pom.xml> -V clean install --no-transfer-progress --batch-mode -Pjava-1.8
[1mApache Maven 3.9.16 (2bdd9fddda4b155ebf8000e807eb73fd829a51d5)[m
Maven home: F:\jenkins\tools\maven\latest
Java version: 17.0.7, vendor: Eclipse Adoptium, runtime: F:\jenkins\tools\java\latest17
Default locale: en_US, platform encoding: Cp1252
OS name: "windows server 2019", version: "10.0", arch: "amd64", family: "windows"
[INFO] Scanning for projects...
[HUDSON] Collecting dependencies info
[INFO]
[INFO] ----------------------< commons-net:commons-net >-----------------------
[INFO] Building Apache Commons Net 3.13.1-SNAPSHOT
[INFO] from pom.xml
[INFO] --------------------------------[ jar ]---------------------------------
[INFO] Downloading from central: https://repo.maven.apache.org/maven2/org/codehaus/mojo/build-helper-maven-plugin/3.6.2/build-helper-maven-plugin-3.6.2.pom
[INFO] Downloaded from central: https://repo.maven.apache.org/maven2/org/codehaus/mojo/build-helper-maven-plugin/3.6.2/build-helper-maven-plugin-3.6.2.pom (7.9 kB at 18 kB/s)
[INFO] Downloading from central: https://repo.maven.apache.org/maven2/org/codehaus/mojo/mojo-parent/97/mojo-parent-97.pom
[INFO] Downloaded from central: https://repo.maven.apache.org/maven2/org/codehaus/mojo/mojo-parent/97/mojo-parent-97.pom (39 kB at 344 kB/s)
[INFO] Downloading from central: https://repo.maven.apache.org/maven2/org/codehaus/mojo/build-helper-maven-plugin/3.6.2/build-helper-maven-plugin-3.6.2.jar
[INFO] Downloaded from central: https://repo.maven.apache.org/maven2/org/codehaus/mojo/build-helper-maven-plugin/3.6.2/build-helper-maven-plugin-3.6.2.jar (72 kB at 780 kB/s)
[INFO] Downloading from central: https://repo.maven.apache.org/maven2/org/codehaus/mojo/exec-maven-plugin/3.6.4/exec-maven-plugin-3.6.4.pom
[INFO] Downloaded from central: https://repo.maven.apache.org/maven2/org/codehaus/mojo/exec-maven-plugin/3.6.4/exec-maven-plugin-3.6.4.pom (16 kB at 159 kB/s)
[INFO] Downloading from central: https://repo.maven.apache.org/maven2/org/codehaus/mojo/exec-maven-plugin/3.6.4/exec-maven-plugin-3.6.4.jar
[INFO] Downloaded from central: https://repo.maven.apache.org/maven2/org/codehaus/mojo/exec-maven-plugin/3.6.4/exec-maven-plugin-3.6.4.jar (94 kB at 1.1 MB/s)
[INFO] Downloading from central: https://repo.maven.apache.org/maven2/org/apache/maven/plugins/maven-artifact-plugin/3.7.0/maven-artifact-plugin-3.7.0.pom
[INFO] Downloaded from central: https://repo.maven.apache.org/maven2/org/apache/maven/plugins/maven-artifact-plugin/3.7.0/maven-artifact-plugin-3.7.0.pom (9.8 kB at 97 kB/s)
[INFO] Downloading from central: https://repo.maven.apache.org/maven2/org/apache/maven/plugins/maven-artifact-plugin/3.7.0/maven-artifact-plugin-3.7.0.jar
[INFO] Downloaded from central: https://repo.maven.apache.org/maven2/org/apache/maven/plugins/maven-artifact-plugin/3.7.0/maven-artifact-plugin-3.7.0.jar (85 kB at 881 kB/s)
[INFO] Downloading from central: https://repo.maven.apache.org/maven2/org/apache/felix/maven-bundle-plugin/6.2.0/maven-bundle-plugin-6.2.0.pom
[INFO] Downloaded from central: https://repo.maven.apache.org/maven2/org/apache/felix/maven-bundle-plugin/6.2.0/maven-bundle-plugin-6.2.0.pom (12 kB at 162 kB/s)
[INFO] Downloading from central: https://repo.maven.apache.org/maven2/org/apache/felix/maven-bundle-plugin/6.2.0/maven-bundle-plugin-6.2.0.jar
[INFO] Downloaded from central: https://repo.maven.apache.org/maven2/org/apache/felix/maven-bundle-plugin/6.2.0/maven-bundle-plugin-6.2.0.jar (215 kB at 2.7 MB/s)
[INFO] Downloading from central: https://repo.maven.apache.org/maven2/org/cyclonedx/cyclonedx-maven-plugin/2.9.3/cyclonedx-maven-plugin-2.9.3.pom
[INFO] Downloaded from central: https://repo.maven.apache.org/maven2/org/cyclonedx/cyclonedx-maven-plugin/2.9.3/cyclonedx-maven-plugin-2.9.3.pom (19 kB at 268 kB/s)
[INFO] Downloading from central: https://repo.maven.apache.org/maven2/org/cyclonedx/cyclonedx-maven-plugin/2.9.3/cyclonedx-maven-plugin-2.9.3.jar
[INFO] Downloaded from central: https://repo.maven.apache.org/maven2/org/cyclonedx/cyclonedx-maven-plugin/2.9.3/cyclonedx-maven-plugin-2.9.3.jar (52 kB at 704 kB/s)
[INFO] Downloading from central: https://repo.maven.apache.org/maven2/org/apache/maven/plugins/maven-install-plugin/3.2.0/maven-install-plugin-3.2.0.pom
[INFO] Downloaded from central: https://repo.maven.apache.org/maven2/org/apache/maven/plugins/maven-install-plugin/3.2.0/maven-install-plugin-3.2.0.pom (7.9 kB at 142 kB/s)
[INFO] Downloading from central: https://repo.maven.apache.org/maven2/org/apache/maven/plugins/maven-install-plugin/3.2.0/maven-install-plugin-3.2.0.jar
[INFO] Downloaded from central: https://repo.maven.apache.org/maven2/org/apache/maven/plugins/maven-install-plugin/3.2.0/maven-install-plugin-3.2.0.jar (37 kB at 125 kB/s)
[INFO] Downloading from central: https://repo.maven.apache.org/maven2/org/apache/commons/commons-lang3/3.21.0/commons-lang3-3.21.0.pom
[INFO] Downloaded from central: https://repo.maven.apache.org/maven2/org/apache/commons/commons-lang3/3.21.0/commons-lang3-3.21.0.pom (36 kB at 462 kB/s)
[INFO] Downloading from central: https://repo.maven.apache.org/maven2/org/apache/commons/commons-collections4/4.6.0/commons-collections4-4.6.0.pom
[INFO] Downloaded from central: https://repo.maven.apache.org/maven2/org/apache/commons/commons-collections4/4.6.0/commons-collections4-4.6.0.pom (28 kB at 427 kB/s)
[INFO] Downloading from central: https://repo.maven.apache.org/maven2/org/apache/commons/commons-lang3/3.21.0/commons-lang3-3.21.0.jar
[INFO] Downloaded from central: https://repo.maven.apache.org/maven2/org/apache/commons/commons-lang3/3.21.0/commons-lang3-3.21.0.jar (749 kB at 6.6 MB/s)
[INFO] Downloading from central: https://repo.maven.apache.org/maven2/org/apache/commons/commons-collections4/4.6.0/commons-collections4-4.6.0.jar
[INFO] Downloaded from central: https://repo.maven.apache.org/maven2/org/apache/commons/commons-collections4/4.6.0/commons-collections4-4.6.0.jar (934 kB at 8.5 MB/s)
[INFO]
[INFO] --- clean:3.5.0:clean (default-clean) @ commons-net ---
[INFO]
[INFO] --- enforcer:3.6.3:enforce (enforce-maven-version) @ commons-net ---
[INFO] Rule 0: org.apache.maven.enforcer.rules.version.RequireMavenVersion passed
[INFO]
[INFO] --- enforcer:3.6.3:enforce (enforce-java-version) @ commons-net ---
[INFO] Rule 0: org.apache.maven.enforcer.rules.version.RequireJavaVersion passed
[INFO]
[INFO] --- apache-rat:0.18:check (rat-check) @ commons-net ---
[ERROR] Could not create report parent directory <https://ci-builds.apache.org/job/Commons/job/commons-net-windows/ws/f>:\jenkins\jenkins-home\712657a4\workspace\Commons\commons-net-windows\target\rat.txt
[WARNING] Unable to create directory: <https://ci-builds.apache.org/job/Commons/job/commons-net-windows/ws/f>:\jenkins\jenkins-home\712657a4\workspace\Commons\commons-net-windows\target
[WARNING] Attempt to (de-)serialize anonymous class org.jfrog.hudson.maven2.MavenDependenciesRecorder$1; see: https://jenkins.io/redirect/serialization-of-anonymous-classes/
[INFO] ------------------------------------------------------------------------
[INFO] BUILD FAILURE
[INFO] ------------------------------------------------------------------------
[INFO] Total time: 35.882 s
[INFO] Finished at: 2026-10-17T17:48:56Z
[INFO] ------------------------------------------------------------------------
Waiting for Jenkins to finish collecting data
[ERROR] Failed to execute goal org.apache.rat:apache-rat-plugin:0.18:check (rat-check) on project commons-net: java.io.FileNotFoundException: <https://ci-builds.apache.org/job/Commons/job/commons-net-windows/ws/f>:\jenkins\jenkins-home\712657a4\workspace\Commons\commons-net-windows\target\rat.txt (The filename, directory name, or volume label syntax is incorrect) -> [Help 1]
[ERROR]
[ERROR] To see the full stack trace of the errors, re-run Maven with the -e switch.
[ERROR] Re-run Maven using the -X switch to enable full debug logging.
[ERROR]
[ERROR] For more information about the errors and possible solutions, please read the following articles:
[ERROR] [Help 1] http://cwiki.apache.org/confluence/display/MAVEN/MojoExecutionException
[JENKINS] Archiving <https://ci-builds.apache.org/job/Commons/job/commons-net-windows/ws/pom.xml> to commons-net/commons-net/3.13.1-SNAPSHOT/commons-net-3.13.1-SNAPSHOT.pom
Sending e-mails to: notifications@commons.apache.org
channel stopped
ERROR: No tool found matching JDK_1_7_LATEST__HOME
Setting JDK_1_8_LATEST_WINDOWS_HOME=F:\jenkins\tools\java\latest1.8
ERROR: No tool found matching JDK_1_7_LATEST__HOME
Setting JDK_1_8_LATEST_WINDOWS_HOME=F:\jenkins\tools\java\latest1.8
Build failed in Jenkins: Commons » commons-net-windows #352
Posted by Apache Jenkins Server <je...@builds.apache.org>.
See <https://ci-builds.apache.org/job/Commons/job/commons-net-windows/352/display/redirect>
Changes:
------------------------------------------
Started by an SCM change
Running as SYSTEM
[EnvInject] - Loading node environment variables.
Building remotely on jenkins-win-azr-10 (Windows-Docker Windows) in workspace <https://ci-builds.apache.org/job/Commons/job/commons-net-windows/ws/>
The recommended git tool is: NONE
No credentials specified
> git rev-parse --resolve-git-dir <https://ci-builds.apache.org/job/Commons/job/commons-net-windows/ws/.git> # timeout=10
Fetching changes from the remote Git repository
> git config remote.origin.url https://gitbox.apache.org/repos/asf/commons-net.git # timeout=10
Fetching upstream changes from https://gitbox.apache.org/repos/asf/commons-net.git
> git --version # timeout=10
> git --version # 'git version 2.14.3.windows.1'
> git fetch --tags --progress -- https://gitbox.apache.org/repos/asf/commons-net.git +refs/heads/*:refs/remotes/origin/* # timeout=10
> git rev-parse "refs/remotes/origin/master^{commit}" # timeout=10
Checking out Revision ee6755cd1da9341fc33b3f828f59ef7cb9f2c505 (refs/remotes/origin/master)
> git config core.sparsecheckout # timeout=10
> git checkout -f ee6755cd1da9341fc33b3f828f59ef7cb9f2c505 # timeout=10
Commit message: "Bump github/codeql-action/analyze from 4.37.5 to 4.38.3"
> git rev-list --no-walk ee6755cd1da9341fc33b3f828f59ef7cb9f2c505 # timeout=10
[EnvInject] - Injecting environment variables from a build step.
ERROR: No tool found matching JDK_1_7_LATEST__HOME
Setting JDK_1_8_LATEST_WINDOWS_HOME=F:\jenkins\tools\java\latest1.8
[EnvInject] - Injecting as environment variables the properties content
JAVA_1_8_HOME=F:\jenkins\tools\java\latest1.8
[EnvInject] - Variables injected successfully.
ERROR: No tool found matching JDK_1_7_LATEST__HOME
Setting JDK_1_8_LATEST_WINDOWS_HOME=F:\jenkins\tools\java\latest1.8
Parsing POMs
ERROR: No tool found matching JDK_1_7_LATEST__HOME
Setting JDK_1_8_LATEST_WINDOWS_HOME=F:\jenkins\tools\java\latest1.8
Established TCP socket on 63529
maven35-agent.jar already up to date
maven35-interceptor.jar already up to date
maven3-interceptor-commons.jar already up to date
[commons-net-windows] $ java -cp f:\jenkins\jenkins-home\712657a4\maven35-agent.jar;f:\jenkins\tools\maven\latest\boot\plexus-classworlds-2.11.0.jar;f:\\jenkins\\tools\\maven\\latest/conf/logging jenkins.maven3.agent.Maven35Main f:\\jenkins\\tools\\maven\\latest F:\jenkins\jenkins-home\agent.jar f:\jenkins\jenkins-home\712657a4\maven35-interceptor.jar f:\jenkins\jenkins-home\712657a4\maven3-interceptor-commons.jar 63529
<===[JENKINS REMOTING CAPACITY]===> channel started
ERROR: No tool found matching JDK_1_7_LATEST__HOME
Setting JDK_1_8_LATEST_WINDOWS_HOME=F:\jenkins\tools\java\latest1.8
Executing Maven: -B -f <https://ci-builds.apache.org/job/Commons/job/commons-net-windows/ws/pom.xml> -V clean install --no-transfer-progress --batch-mode -Pjava-1.8
[1mApache Maven 3.9.16 (2bdd9fddda4b155ebf8000e807eb73fd829a51d5)[m
Maven home: F:\jenkins\tools\maven\latest
Java version: 17.0.7, vendor: Eclipse Adoptium, runtime: F:\jenkins\tools\java\latest17
Default locale: en_US, platform encoding: Cp1252
OS name: "windows server 2019", version: "10.0", arch: "amd64", family: "windows"
[INFO] Scanning for projects...
[HUDSON] Collecting dependencies info
[INFO]
[INFO] ----------------------< commons-net:commons-net >-----------------------
[INFO] Building Apache Commons Net 3.13.1-SNAPSHOT
[INFO] from pom.xml
[INFO] --------------------------------[ jar ]---------------------------------
[INFO]
[INFO] --- clean:3.5.0:clean (default-clean) @ commons-net ---
[INFO]
[INFO] --- enforcer:3.6.3:enforce (enforce-maven-version) @ commons-net ---
[INFO] Rule 0: org.apache.maven.enforcer.rules.version.RequireMavenVersion passed
[INFO]
[INFO] --- enforcer:3.6.3:enforce (enforce-java-version) @ commons-net ---
[INFO] Rule 0: org.apache.maven.enforcer.rules.version.RequireJavaVersion passed
[INFO]
[INFO] --- apache-rat:0.18:check (rat-check) @ commons-net ---
[ERROR] Could not create report parent directory <https://ci-builds.apache.org/job/Commons/job/commons-net-windows/ws/f>:\jenkins\jenkins-home\712657a4\workspace\Commons\commons-net-windows\target\rat.txt
[WARNING] Unable to create directory: <https://ci-builds.apache.org/job/Commons/job/commons-net-windows/ws/f>:\jenkins\jenkins-home\712657a4\workspace\Commons\commons-net-windows\target
[WARNING] Attempt to (de-)serialize anonymous class org.jfrog.hudson.maven2.MavenDependenciesRecorder$1; see: https://jenkins.io/redirect/serialization-of-anonymous-classes/
[INFO] ------------------------------------------------------------------------
[INFO] BUILD FAILURE
[INFO] ------------------------------------------------------------------------
[INFO] Total time: 15.228 s
[INFO] Finished at: 2026-10-17T06:41:39Z
[INFO] ------------------------------------------------------------------------
Waiting for Jenkins to finish collecting data
[ERROR] Failed to execute goal org.apache.rat:apache-rat-plugin:0.18:check (rat-check) on project commons-net: java.io.FileNotFoundException: <https://ci-builds.apache.org/job/Commons/job/commons-net-windows/ws/f>:\jenkins\jenkins-home\712657a4\workspace\Commons\commons-net-windows\target\rat.txt (The filename, directory name, or volume label syntax is incorrect) -> [Help 1]
[ERROR]
[ERROR] To see the full stack trace of the errors, re-run Maven with the -e switch.
[ERROR] Re-run Maven using the -X switch to enable full debug logging.
[ERROR]
[ERROR] For more information about the errors and possible solutions, please read the following articles:
[ERROR] [Help 1] http://cwiki.apache.org/confluence/display/MAVEN/MojoExecutionException
[JENKINS] Archiving <https://ci-builds.apache.org/job/Commons/job/commons-net-windows/ws/pom.xml> to commons-net/commons-net/3.13.1-SNAPSHOT/commons-net-3.13.1-SNAPSHOT.pom
Sending e-mails to: notifications@commons.apache.org
channel stopped
ERROR: No tool found matching JDK_1_7_LATEST__HOME
Setting JDK_1_8_LATEST_WINDOWS_HOME=F:\jenkins\tools\java\latest1.8
ERROR: No tool found matching JDK_1_7_LATEST__HOME
Setting JDK_1_8_LATEST_WINDOWS_HOME=F:\jenkins\tools\java\latest1.8
Build failed in Jenkins: Commons » commons-net-windows #351
Posted by Apache Jenkins Server <je...@builds.apache.org>.
See <https://ci-builds.apache.org/job/Commons/job/commons-net-windows/351/display/redirect?page=changes>
Changes:
[garydgregory] Bump actions/upload-artifact from 7.0.1 to 7.0.2
[garydgregory] Bump github/codeql-action/analyze from 4.37.5 to 4.38.3
[garydgregory] Revert "Bump github/codeql-action/analyze from 4.37.5 to 4.38.3"
[garydgregory] Bump github/codeql-action/analyze from 4.37.5 to 4.38.3
------------------------------------------
Started by an SCM change
Started by an SCM change
Started by an SCM change
Started by an SCM change
Started by an SCM change
Started by an SCM change
Started by an SCM change
Started by an SCM change
Started by an SCM change
Started by an SCM change
Started by an SCM change
Started by an SCM change
Started by an SCM change
Started by an SCM change
Started by an SCM change
Started by an SCM change
Started by an SCM change
Started by an SCM change
Started by an SCM change
Started by an SCM change
Started by an SCM change
Started by an SCM change
Started by an SCM change
Started by an SCM change
Started by an SCM change
Started by an SCM change
Started by an SCM change
Started by an SCM change
Started by an SCM change
Started by an SCM change
Started by an SCM change
Started by an SCM change
Started by an SCM change
Started by an SCM change
Started by an SCM change
Started by an SCM change
Started by an SCM change
Started by an SCM change
Started by an SCM change
Started by an SCM change
Running as SYSTEM
[EnvInject] - Loading node environment variables.
Building remotely on jenkins-win-azr-10 (Windows-Docker Windows) in workspace <https://ci-builds.apache.org/job/Commons/job/commons-net-windows/ws/>
The recommended git tool is: NONE
No credentials specified
> git rev-parse --resolve-git-dir <https://ci-builds.apache.org/job/Commons/job/commons-net-windows/ws/.git> # timeout=10
Fetching changes from the remote Git repository
> git config remote.origin.url https://gitbox.apache.org/repos/asf/commons-net.git # timeout=10
Fetching upstream changes from https://gitbox.apache.org/repos/asf/commons-net.git
> git --version # timeout=10
> git --version # 'git version 2.14.3.windows.1'
> git fetch --tags --progress -- https://gitbox.apache.org/repos/asf/commons-net.git +refs/heads/*:refs/remotes/origin/* # timeout=10
> git rev-parse "refs/remotes/origin/master^{commit}" # timeout=10
Checking out Revision ee6755cd1da9341fc33b3f828f59ef7cb9f2c505 (refs/remotes/origin/master)
> git config core.sparsecheckout # timeout=10
> git checkout -f ee6755cd1da9341fc33b3f828f59ef7cb9f2c505 # timeout=10
Commit message: "Bump github/codeql-action/analyze from 4.37.5 to 4.38.3"
> git rev-list --no-walk 7f9bd04c0d4c34741c9a625469137010d984d9f2 # timeout=10
[EnvInject] - Injecting environment variables from a build step.
ERROR: No tool found matching JDK_1_7_LATEST__HOME
Setting JDK_1_8_LATEST_WINDOWS_HOME=F:\jenkins\tools\java\latest1.8
[EnvInject] - Injecting as environment variables the properties content
JAVA_1_8_HOME=F:\jenkins\tools\java\latest1.8
[EnvInject] - Variables injected successfully.
ERROR: No tool found matching JDK_1_7_LATEST__HOME
Setting JDK_1_8_LATEST_WINDOWS_HOME=F:\jenkins\tools\java\latest1.8
Parsing POMs
ERROR: No tool found matching JDK_1_7_LATEST__HOME
Setting JDK_1_8_LATEST_WINDOWS_HOME=F:\jenkins\tools\java\latest1.8
Established TCP socket on 63483
maven35-agent.jar already up to date
maven35-interceptor.jar already up to date
maven3-interceptor-commons.jar already up to date
[commons-net-windows] $ java -cp f:\jenkins\jenkins-home\712657a4\maven35-agent.jar;f:\jenkins\tools\maven\latest\boot\plexus-classworlds-2.11.0.jar;f:\\jenkins\\tools\\maven\\latest/conf/logging jenkins.maven3.agent.Maven35Main f:\\jenkins\\tools\\maven\\latest F:\jenkins\jenkins-home\agent.jar f:\jenkins\jenkins-home\712657a4\maven35-interceptor.jar f:\jenkins\jenkins-home\712657a4\maven3-interceptor-commons.jar 63483
<===[JENKINS REMOTING CAPACITY]===> channel started
ERROR: No tool found matching JDK_1_7_LATEST__HOME
Setting JDK_1_8_LATEST_WINDOWS_HOME=F:\jenkins\tools\java\latest1.8
Executing Maven: -B -f <https://ci-builds.apache.org/job/Commons/job/commons-net-windows/ws/pom.xml> -V clean install --no-transfer-progress --batch-mode -Pjava-1.8
[1mApache Maven 3.9.16 (2bdd9fddda4b155ebf8000e807eb73fd829a51d5)[m
Maven home: F:\jenkins\tools\maven\latest
Java version: 17.0.7, vendor: Eclipse Adoptium, runtime: F:\jenkins\tools\java\latest17
Default locale: en_US, platform encoding: Cp1252
OS name: "windows server 2019", version: "10.0", arch: "amd64", family: "windows"
[INFO] Scanning for projects...
[HUDSON] Collecting dependencies info
[INFO]
[INFO] ----------------------< commons-net:commons-net >-----------------------
[INFO] Building Apache Commons Net 3.13.1-SNAPSHOT
[INFO] from pom.xml
[INFO] --------------------------------[ jar ]---------------------------------
[INFO]
[INFO] --- clean:3.5.0:clean (default-clean) @ commons-net ---
[INFO]
[INFO] --- enforcer:3.6.3:enforce (enforce-maven-version) @ commons-net ---
[INFO] Rule 0: org.apache.maven.enforcer.rules.version.RequireMavenVersion passed
[INFO]
[INFO] --- enforcer:3.6.3:enforce (enforce-java-version) @ commons-net ---
[INFO] Rule 0: org.apache.maven.enforcer.rules.version.RequireJavaVersion passed
[INFO]
[INFO] --- apache-rat:0.18:check (rat-check) @ commons-net ---
[ERROR] Could not create report parent directory <https://ci-builds.apache.org/job/Commons/job/commons-net-windows/ws/f>:\jenkins\jenkins-home\712657a4\workspace\Commons\commons-net-windows\target\rat.txt
[WARNING] Unable to create directory: <https://ci-builds.apache.org/job/Commons/job/commons-net-windows/ws/f>:\jenkins\jenkins-home\712657a4\workspace\Commons\commons-net-windows\target
[WARNING] Attempt to (de-)serialize anonymous class org.jfrog.hudson.maven2.MavenDependenciesRecorder$1; see: https://jenkins.io/redirect/serialization-of-anonymous-classes/
[INFO] ------------------------------------------------------------------------
[INFO] BUILD FAILURE
[INFO] ------------------------------------------------------------------------
[INFO] Total time: 30.991 s
[INFO] Finished at: 2026-10-17T06:40:26Z
[INFO] ------------------------------------------------------------------------
Waiting for Jenkins to finish collecting data
[ERROR] Failed to execute goal org.apache.rat:apache-rat-plugin:0.18:check (rat-check) on project commons-net: java.io.FileNotFoundException: <https://ci-builds.apache.org/job/Commons/job/commons-net-windows/ws/f>:\jenkins\jenkins-home\712657a4\workspace\Commons\commons-net-windows\target\rat.txt (The filename, directory name, or volume label syntax is incorrect) -> [Help 1]
[ERROR]
[ERROR] To see the full stack trace of the errors, re-run Maven with the -e switch.
[ERROR] Re-run Maven using the -X switch to enable full debug logging.
[ERROR]
[ERROR] For more information about the errors and possible solutions, please read the following articles:
[ERROR] [Help 1] http://cwiki.apache.org/confluence/display/MAVEN/MojoExecutionException
[JENKINS] Archiving <https://ci-builds.apache.org/job/Commons/job/commons-net-windows/ws/pom.xml> to commons-net/commons-net/3.13.1-SNAPSHOT/commons-net-3.13.1-SNAPSHOT.pom
Sending e-mails to: notifications@commons.apache.org
channel stopped
ERROR: No tool found matching JDK_1_7_LATEST__HOME
Setting JDK_1_8_LATEST_WINDOWS_HOME=F:\jenkins\tools\java\latest1.8
ERROR: No tool found matching JDK_1_7_LATEST__HOME
Setting JDK_1_8_LATEST_WINDOWS_HOME=F:\jenkins\tools\java\latest1.8
Build failed in Jenkins: Commons » commons-net-windows #350
Posted by Apache Jenkins Server <je...@builds.apache.org>.
See <https://ci-builds.apache.org/job/Commons/job/commons-net-windows/350/display/redirect?page=changes>
Changes:
[garydgregory] Add github.autolink_jira
------------------------------------------
Started by an SCM change
Running as SYSTEM
[EnvInject] - Loading node environment variables.
Building remotely on jenkins-win-azr-10 (Windows-Docker Windows) in workspace <https://ci-builds.apache.org/job/Commons/job/commons-net-windows/ws/>
The recommended git tool is: NONE
No credentials specified
> git rev-parse --resolve-git-dir <https://ci-builds.apache.org/job/Commons/job/commons-net-windows/ws/.git> # timeout=10
Fetching changes from the remote Git repository
> git config remote.origin.url https://gitbox.apache.org/repos/asf/commons-net.git # timeout=10
Fetching upstream changes from https://gitbox.apache.org/repos/asf/commons-net.git
> git --version # timeout=10
> git --version # 'git version 2.14.3.windows.1'
> git fetch --tags --progress -- https://gitbox.apache.org/repos/asf/commons-net.git +refs/heads/*:refs/remotes/origin/* # timeout=10
> git rev-parse "refs/remotes/origin/master^{commit}" # timeout=10
Checking out Revision 7f9bd04c0d4c34741c9a625469137010d984d9f2 (refs/remotes/origin/master)
> git config core.sparsecheckout # timeout=10
> git checkout -f 7f9bd04c0d4c34741c9a625469137010d984d9f2 # timeout=10
Commit message: "Add github.autolink_jira"
> git rev-list --no-walk 3356e9978f10cd0dfbbe095ab3a8d1d07919da04 # timeout=10
[EnvInject] - Injecting environment variables from a build step.
ERROR: No tool found matching JDK_1_7_LATEST__HOME
Setting JDK_1_8_LATEST_WINDOWS_HOME=F:\jenkins\tools\java\latest1.8
[EnvInject] - Injecting as environment variables the properties content
JAVA_1_8_HOME=F:\jenkins\tools\java\latest1.8
[EnvInject] - Variables injected successfully.
ERROR: No tool found matching JDK_1_7_LATEST__HOME
Setting JDK_1_8_LATEST_WINDOWS_HOME=F:\jenkins\tools\java\latest1.8
Parsing POMs
ERROR: No tool found matching JDK_1_7_LATEST__HOME
Setting JDK_1_8_LATEST_WINDOWS_HOME=F:\jenkins\tools\java\latest1.8
Established TCP socket on 56915
maven35-agent.jar already up to date
maven35-interceptor.jar already up to date
maven3-interceptor-commons.jar already up to date
[commons-net-windows] $ java -cp f:\jenkins\jenkins-home\712657a4\maven35-agent.jar;f:\jenkins\tools\maven\latest\boot\plexus-classworlds-2.11.0.jar;f:\\jenkins\\tools\\maven\\latest/conf/logging jenkins.maven3.agent.Maven35Main f:\\jenkins\\tools\\maven\\latest F:\jenkins\jenkins-home\agent.jar f:\jenkins\jenkins-home\712657a4\maven35-interceptor.jar f:\jenkins\jenkins-home\712657a4\maven3-interceptor-commons.jar 56915
<===[JENKINS REMOTING CAPACITY]===> channel started
ERROR: No tool found matching JDK_1_7_LATEST__HOME
Setting JDK_1_8_LATEST_WINDOWS_HOME=F:\jenkins\tools\java\latest1.8
Executing Maven: -B -f <https://ci-builds.apache.org/job/Commons/job/commons-net-windows/ws/pom.xml> -V clean install --no-transfer-progress --batch-mode -Pjava-1.8
[1mApache Maven 3.9.16 (2bdd9fddda4b155ebf8000e807eb73fd829a51d5)[m
Maven home: F:\jenkins\tools\maven\latest
Java version: 17.0.7, vendor: Eclipse Adoptium, runtime: F:\jenkins\tools\java\latest17
Default locale: en_US, platform encoding: Cp1252
OS name: "windows server 2019", version: "10.0", arch: "amd64", family: "windows"
[INFO] Scanning for projects...
[HUDSON] Collecting dependencies info
[INFO]
[INFO] ----------------------< commons-net:commons-net >-----------------------
[INFO] Building Apache Commons Net 3.13.1-SNAPSHOT
[INFO] from pom.xml
[INFO] --------------------------------[ jar ]---------------------------------
[INFO]
[INFO] --- clean:3.5.0:clean (default-clean) @ commons-net ---
[INFO]
[INFO] --- enforcer:3.6.3:enforce (enforce-maven-version) @ commons-net ---
[INFO] Rule 0: org.apache.maven.enforcer.rules.version.RequireMavenVersion passed
[INFO]
[INFO] --- enforcer:3.6.3:enforce (enforce-java-version) @ commons-net ---
[INFO] Rule 0: org.apache.maven.enforcer.rules.version.RequireJavaVersion passed
[INFO]
[INFO] --- apache-rat:0.18:check (rat-check) @ commons-net ---
[ERROR] Could not create report parent directory <https://ci-builds.apache.org/job/Commons/job/commons-net-windows/ws/f>:\jenkins\jenkins-home\712657a4\workspace\Commons\commons-net-windows\target\rat.txt
[WARNING] Unable to create directory: <https://ci-builds.apache.org/job/Commons/job/commons-net-windows/ws/f>:\jenkins\jenkins-home\712657a4\workspace\Commons\commons-net-windows\target
[WARNING] Attempt to (de-)serialize anonymous class org.jfrog.hudson.maven2.MavenDependenciesRecorder$1; see: https://jenkins.io/redirect/serialization-of-anonymous-classes/
[INFO] ------------------------------------------------------------------------
[INFO] BUILD FAILURE
[INFO] ------------------------------------------------------------------------
[INFO] Total time: 31.329 s
[INFO] Finished at: 2026-10-10T12:41:50Z
[INFO] ------------------------------------------------------------------------
Waiting for Jenkins to finish collecting data
[ERROR] Failed to execute goal org.apache.rat:apache-rat-plugin:0.18:check (rat-check) on project commons-net: java.io.FileNotFoundException: <https://ci-builds.apache.org/job/Commons/job/commons-net-windows/ws/f>:\jenkins\jenkins-home\712657a4\workspace\Commons\commons-net-windows\target\rat.txt (The filename, directory name, or volume label syntax is incorrect) -> [Help 1]
[ERROR]
[ERROR] To see the full stack trace of the errors, re-run Maven with the -e switch.
[ERROR] Re-run Maven using the -X switch to enable full debug logging.
[ERROR]
[ERROR] For more information about the errors and possible solutions, please read the following articles:
[ERROR] [Help 1] http://cwiki.apache.org/confluence/display/MAVEN/MojoExecutionException
[JENKINS] Archiving <https://ci-builds.apache.org/job/Commons/job/commons-net-windows/ws/pom.xml> to commons-net/commons-net/3.13.1-SNAPSHOT/commons-net-3.13.1-SNAPSHOT.pom
Sending e-mails to: notifications@commons.apache.org
channel stopped
ERROR: No tool found matching JDK_1_7_LATEST__HOME
Setting JDK_1_8_LATEST_WINDOWS_HOME=F:\jenkins\tools\java\latest1.8
ERROR: No tool found matching JDK_1_7_LATEST__HOME
Setting JDK_1_8_LATEST_WINDOWS_HOME=F:\jenkins\tools\java\latest1.8