You are viewing a plain text version of this content. The canonical link for it is here.
Posted to builds@solr.apache.org by Apache Jenkins Server <je...@builds.apache.org> on 2024/10/25 04:58:35 UTC

[JENKINS] Solr » Solr-Check-main-s390x - Build # 765 - Still Failing!

Build: https://ci-builds.apache.org/job/Solr/job/Solr-Check-main-s390x/765/

No tests ran.

Build Log:
[...truncated 4427 lines...]
BUILD FAILED in 8m 48s
217 actionable tasks: 217 executed

Publishing build scan...
https://ge.apache.org/s/slxayfpgkzw7s

Build step 'Invoke Gradle script' changed build result to FAILURE
Build step 'Invoke Gradle script' marked build as failure
Archiving artifacts
Recording test results
ERROR: Step ‘Publish JUnit test result report’ failed: No test report files were found. Configuration error?
Email was triggered for: Failure - Any
Sending email for trigger: Failure - Any

[JENKINS] Solr » Solr-Check-main-s390x - Build # 769 - Still Failing!

Posted by Apache Jenkins Server <je...@builds.apache.org>.
Build: https://ci-builds.apache.org/job/Solr/job/Solr-Check-main-s390x/769/

No tests ran.

Build Log:
[...truncated 4331 lines...]
BUILD FAILED in 1m 10s
217 actionable tasks: 217 executed

Publishing build scan...
https://ge.apache.org/s/4ze4afugylqko

Build step 'Invoke Gradle script' changed build result to FAILURE
Build step 'Invoke Gradle script' marked build as failure
Archiving artifacts
Recording test results
ERROR: Step ‘Publish JUnit test result report’ failed: No test report files were found. Configuration error?
Email was triggered for: Failure - Any
Sending email for trigger: Failure - Any

[JENKINS] Solr » Solr-Check-main-s390x - Build # 768 - Still Failing!

Posted by Apache Jenkins Server <je...@builds.apache.org>.
Build: https://ci-builds.apache.org/job/Solr/job/Solr-Check-main-s390x/768/

No tests ran.

Build Log:
[...truncated 4651 lines...]
BUILD FAILED in 1m 5s
217 actionable tasks: 217 executed

Publishing build scan...
https://ge.apache.org/s/5rreg4pmvl3hy

Build step 'Invoke Gradle script' changed build result to FAILURE
Build step 'Invoke Gradle script' marked build as failure
Archiving artifacts
Recording test results
ERROR: Step ‘Publish JUnit test result report’ failed: No test report files were found. Configuration error?
Email was triggered for: Failure - Any
Sending email for trigger: Failure - Any

[JENKINS] Solr » Solr-Check-main-s390x - Build # 767 - Still Failing!

Posted by Apache Jenkins Server <je...@builds.apache.org>.
Build: https://ci-builds.apache.org/job/Solr/job/Solr-Check-main-s390x/767/

No tests ran.

Build Log:
[...truncated 4555 lines...]
BUILD FAILED in 1m 20s
217 actionable tasks: 217 executed

Publishing build scan...
https://ge.apache.org/s/4dvocdsb2vzqg

Build step 'Invoke Gradle script' changed build result to FAILURE
Build step 'Invoke Gradle script' marked build as failure
Archiving artifacts
Recording test results
ERROR: Step ‘Publish JUnit test result report’ failed: No test report files were found. Configuration error?
Email was triggered for: Failure - Any
Sending email for trigger: Failure - Any

[JENKINS] Solr » Solr-Check-main-s390x - Build # 766 - Still Failing!

Posted by Apache Jenkins Server <je...@builds.apache.org>.
Build: https://ci-builds.apache.org/job/Solr/job/Solr-Check-main-s390x/766/

No tests ran.

Build Log:
[...truncated 4235 lines...]
BUILD FAILED in 1m 21s
217 actionable tasks: 217 executed

Publishing build scan...
https://ge.apache.org/s/s4indjsdst34i

Build step 'Invoke Gradle script' changed build result to FAILURE
Build step 'Invoke Gradle script' marked build as failure
Archiving artifacts
Recording test results
ERROR: Step ‘Publish JUnit test result report’ failed: No test report files were found. Configuration error?
Email was triggered for: Failure - Any
Sending email for trigger: Failure - Any