You are viewing a plain text version of this content. The canonical link for it is here.
Posted to builds@hbase.apache.org by Apache Jenkins Server <je...@builds.apache.org> on 2015/12/29 18:28:19 UTC

Build failed in Jenkins: HBase-1.2 » latest1.8,Hadoop #480

See <https://builds.apache.org/job/HBase-1.2/jdk=latest1.8,label=Hadoop/480/changes>

Changes:

[tedyu] HBASE-14867 SimpleRegionNormalizer needs to have better heuristics to

------------------------------------------
[...truncated 45955 lines...]
Java HotSpot(TM) 64-Bit Server VM warning: ignoring option MaxPermSize=256m; support was removed in 8.0
Running org.apache.hadoop.hbase.TestInfoServers
Java HotSpot(TM) 64-Bit Server VM warning: ignoring option MaxPermSize=256m; support was removed in 8.0
Tests run: 3, Failures: 0, Errors: 0, Skipped: 0, Time elapsed: 3.6 sec - in org.apache.hadoop.hbase.TestInfoServers
Java HotSpot(TM) 64-Bit Server VM warning: ignoring option MaxPermSize=256m; support was removed in 8.0
Running org.apache.hadoop.hbase.filter.TestMultiRowRangeFilter
Running org.apache.hadoop.hbase.filter.TestScanRowPrefix
Tests run: 1, Failures: 0, Errors: 0, Skipped: 0, Time elapsed: 5.556 sec - in org.apache.hadoop.hbase.filter.TestScanRowPrefix
Java HotSpot(TM) 64-Bit Server VM warning: ignoring option MaxPermSize=256m; support was removed in 8.0
Java HotSpot(TM) 64-Bit Server VM warning: ignoring option MaxPermSize=256m; support was removed in 8.0
Java HotSpot(TM) 64-Bit Server VM warning: ignoring option MaxPermSize=256m; support was removed in 8.0
Java HotSpot(TM) 64-Bit Server VM warning: ignoring option MaxPermSize=256m; support was removed in 8.0
Tests run: 20, Failures: 0, Errors: 0, Skipped: 0, Time elapsed: 22.965 sec - in org.apache.hadoop.hbase.filter.TestMultiRowRangeFilter
Running org.apache.hadoop.hbase.filter.TestFilterWrapper
Java HotSpot(TM) 64-Bit Server VM warning: ignoring option MaxPermSize=256m; support was removed in 8.0
Java HotSpot(TM) 64-Bit Server VM warning: ignoring option MaxPermSize=256m; support was removed in 8.0
Java HotSpot(TM) 64-Bit Server VM warning: ignoring option MaxPermSize=256m; support was removed in 8.0
Java HotSpot(TM) 64-Bit Server VM warning: ignoring option MaxPermSize=256m; support was removed in 8.0
Tests run: 1, Failures: 0, Errors: 0, Skipped: 0, Time elapsed: 4.628 sec - in org.apache.hadoop.hbase.filter.TestFilterWrapper
Java HotSpot(TM) 64-Bit Server VM warning: ignoring option MaxPermSize=256m; support was removed in 8.0
Java HotSpot(TM) 64-Bit Server VM warning: ignoring option MaxPermSize=256m; support was removed in 8.0
Java HotSpot(TM) 64-Bit Server VM warning: ignoring option MaxPermSize=256m; support was removed in 8.0
Running org.apache.hadoop.hbase.filter.TestFuzzyRowFilterEndToEnd
Tests run: 12, Failures: 0, Errors: 0, Skipped: 1, Time elapsed: 96.137 sec - in org.apache.hadoop.hbase.namespace.TestNamespaceAuditor
Java HotSpot(TM) 64-Bit Server VM warning: ignoring option MaxPermSize=256m; support was removed in 8.0
Java HotSpot(TM) 64-Bit Server VM warning: ignoring option MaxPermSize=256m; support was removed in 8.0
Java HotSpot(TM) 64-Bit Server VM warning: ignoring option MaxPermSize=256m; support was removed in 8.0
Running org.apache.hadoop.hbase.filter.TestFuzzyRowAndColumnRangeFilter
Tests run: 2, Failures: 0, Errors: 0, Skipped: 0, Time elapsed: 62.66 sec - in org.apache.hadoop.hbase.TestRegionRebalancing
Java HotSpot(TM) 64-Bit Server VM warning: ignoring option MaxPermSize=256m; support was removed in 8.0
Tests run: 1, Failures: 0, Errors: 0, Skipped: 0, Time elapsed: 4.758 sec - in org.apache.hadoop.hbase.filter.TestFuzzyRowAndColumnRangeFilter
Java HotSpot(TM) 64-Bit Server VM warning: ignoring option MaxPermSize=256m; support was removed in 8.0
Java HotSpot(TM) 64-Bit Server VM warning: ignoring option MaxPermSize=256m; support was removed in 8.0
Java HotSpot(TM) 64-Bit Server VM warning: ignoring option MaxPermSize=256m; support was removed in 8.0
Java HotSpot(TM) 64-Bit Server VM warning: ignoring option MaxPermSize=256m; support was removed in 8.0
Java HotSpot(TM) 64-Bit Server VM warning: ignoring option MaxPermSize=256m; support was removed in 8.0
Java HotSpot(TM) 64-Bit Server VM warning: ignoring option MaxPermSize=256m; support was removed in 8.0
Java HotSpot(TM) 64-Bit Server VM warning: ignoring option MaxPermSize=256m; support was removed in 8.0
Java HotSpot(TM) 64-Bit Server VM warning: ignoring option MaxPermSize=256m; support was removed in 8.0
Java HotSpot(TM) 64-Bit Server VM warning: ignoring option MaxPermSize=256m; support was removed in 8.0
Java HotSpot(TM) 64-Bit Server VM warning: ignoring option MaxPermSize=256m; support was removed in 8.0
Running org.apache.hadoop.hbase.filter.TestColumnRangeFilter
Running org.apache.hadoop.hbase.io.TestFileLink
Running org.apache.hadoop.hbase.filter.TestFilterWithScanLimits
Tests run: 1, Failures: 0, Errors: 0, Skipped: 0, Time elapsed: 8.094 sec - in org.apache.hadoop.hbase.filter.TestColumnRangeFilter
Java HotSpot(TM) 64-Bit Server VM warning: ignoring option MaxPermSize=256m; support was removed in 8.0
Tests run: 1, Failures: 0, Errors: 0, Skipped: 0, Time elapsed: 3.961 sec - in org.apache.hadoop.hbase.filter.TestFilterWithScanLimits
Java HotSpot(TM) 64-Bit Server VM warning: ignoring option MaxPermSize=256m; support was removed in 8.0
Java HotSpot(TM) 64-Bit Server VM warning: ignoring option MaxPermSize=256m; support was removed in 8.0
Running org.apache.hadoop.hbase.io.hfile.TestScannerSelectionUsingTTL
Running org.apache.hadoop.hbase.io.hfile.TestCacheConfig
Tests run: 6, Failures: 0, Errors: 0, Skipped: 0, Time elapsed: 2.396 sec - in org.apache.hadoop.hbase.io.hfile.TestCacheConfig
Java HotSpot(TM) 64-Bit Server VM warning: ignoring option MaxPermSize=256m; support was removed in 8.0
Running org.apache.hadoop.hbase.io.hfile.TestHFileSeek
Tests run: 1, Failures: 0, Errors: 0, Skipped: 0, Time elapsed: 1.982 sec - in org.apache.hadoop.hbase.io.hfile.TestHFileSeek
Java HotSpot(TM) 64-Bit Server VM warning: ignoring option MaxPermSize=256m; support was removed in 8.0
Tests run: 5, Failures: 0, Errors: 0, Skipped: 0, Time elapsed: 16.424 sec - in org.apache.hadoop.hbase.io.TestFileLink
Java HotSpot(TM) 64-Bit Server VM warning: ignoring option MaxPermSize=256m; support was removed in 8.0
Running org.apache.hadoop.hbase.io.hfile.TestSeekBeforeWithInlineBlocks
Java HotSpot(TM) 64-Bit Server VM warning: ignoring option MaxPermSize=256m; support was removed in 8.0
Running org.apache.hadoop.hbase.io.hfile.TestForceCacheImportantBlocks
Tests run: 1, Failures: 0, Errors: 0, Skipped: 0, Time elapsed: 14.122 sec - in org.apache.hadoop.hbase.io.hfile.TestSeekBeforeWithInlineBlocks
Java HotSpot(TM) 64-Bit Server VM warning: ignoring option MaxPermSize=256m; support was removed in 8.0
Java HotSpot(TM) 64-Bit Server VM warning: ignoring option MaxPermSize=256m; support was removed in 8.0
Running org.apache.hadoop.hbase.io.hfile.TestCacheOnWrite
Tests run: 4, Failures: 0, Errors: 0, Skipped: 0, Time elapsed: 40.521 sec - in org.apache.hadoop.hbase.io.hfile.TestForceCacheImportantBlocks
Java HotSpot(TM) 64-Bit Server VM warning: ignoring option MaxPermSize=256m; support was removed in 8.0
Java HotSpot(TM) 64-Bit Server VM warning: ignoring option MaxPermSize=256m; support was removed in 8.0
Java HotSpot(TM) 64-Bit Server VM warning: ignoring option MaxPermSize=256m; support was removed in 8.0
Java HotSpot(TM) 64-Bit Server VM warning: ignoring option MaxPermSize=256m; support was removed in 8.0
Java HotSpot(TM) 64-Bit Server VM warning: ignoring option MaxPermSize=256m; support was removed in 8.0
Running org.apache.hadoop.hbase.io.hfile.TestHFileBlock
Tests run: 6, Failures: 0, Errors: 0, Skipped: 0, Time elapsed: 64.213 sec - in org.apache.hadoop.hbase.io.hfile.TestScannerSelectionUsingTTL
Java HotSpot(TM) 64-Bit Server VM warning: ignoring option MaxPermSize=256m; support was removed in 8.0
Java HotSpot(TM) 64-Bit Server VM warning: ignoring option MaxPermSize=256m; support was removed in 8.0
Java HotSpot(TM) 64-Bit Server VM warning: ignoring option MaxPermSize=256m; support was removed in 8.0
Java HotSpot(TM) 64-Bit Server VM warning: ignoring option MaxPermSize=256m; support was removed in 8.0
Java HotSpot(TM) 64-Bit Server VM warning: ignoring option MaxPermSize=256m; support was removed in 8.0
Java HotSpot(TM) 64-Bit Server VM warning: ignoring option MaxPermSize=256m; support was removed in 8.0
Java HotSpot(TM) 64-Bit Server VM warning: ignoring option MaxPermSize=256m; support was removed in 8.0
Java HotSpot(TM) 64-Bit Server VM warning: ignoring option MaxPermSize=256m; support was removed in 8.0
Java HotSpot(TM) 64-Bit Server VM warning: ignoring option MaxPermSize=256m; support was removed in 8.0
Java HotSpot(TM) 64-Bit Server VM warning: ignoring option MaxPermSize=256m; support was removed in 8.0
Java HotSpot(TM) 64-Bit Server VM warning: ignoring option MaxPermSize=256m; support was removed in 8.0
Running org.apache.hadoop.hbase.io.hfile.TestHFileBlockIndex
Tests run: 10, Failures: 0, Errors: 0, Skipped: 0, Time elapsed: 12.946 sec - in org.apache.hadoop.hbase.io.hfile.TestHFileBlockIndex
Java HotSpot(TM) 64-Bit Server VM warning: ignoring option MaxPermSize=256m; support was removed in 8.0
Java HotSpot(TM) 64-Bit Server VM warning: ignoring option MaxPermSize=256m; support was removed in 8.0
Java HotSpot(TM) 64-Bit Server VM warning: ignoring option MaxPermSize=256m; support was removed in 8.0
Java HotSpot(TM) 64-Bit Server VM warning: ignoring option MaxPermSize=256m; support was removed in 8.0
Java HotSpot(TM) 64-Bit Server VM warning: ignoring option MaxPermSize=256m; support was removed in 8.0
Java HotSpot(TM) 64-Bit Server VM warning: ignoring option MaxPermSize=256m; support was removed in 8.0
Java HotSpot(TM) 64-Bit Server VM warning: ignoring option MaxPermSize=256m; support was removed in 8.0
Java HotSpot(TM) 64-Bit Server VM warning: ignoring option MaxPermSize=256m; support was removed in 8.0
Java HotSpot(TM) 64-Bit Server VM warning: ignoring option MaxPermSize=256m; support was removed in 8.0
Java HotSpot(TM) 64-Bit Server VM warning: ignoring option MaxPermSize=256m; support was removed in 8.0
Running org.apache.hadoop.hbase.io.encoding.TestLoadAndSwitchEncodeOnDisk
Tests run: 1, Failures: 0, Errors: 0, Skipped: 0, Time elapsed: 32.578 sec - in org.apache.hadoop.hbase.io.encoding.TestLoadAndSwitchEncodeOnDisk
Java HotSpot(TM) 64-Bit Server VM warning: ignoring option MaxPermSize=256m; support was removed in 8.0
Tests run: 51, Failures: 0, Errors: 0, Skipped: 1, Time elapsed: 345.974 sec - in org.apache.hadoop.hbase.util.TestHBaseFsck
Java HotSpot(TM) 64-Bit Server VM warning: ignoring option MaxPermSize=256m; support was removed in 8.0
Java HotSpot(TM) 64-Bit Server VM warning: ignoring option MaxPermSize=256m; support was removed in 8.0
Java HotSpot(TM) 64-Bit Server VM warning: ignoring option MaxPermSize=256m; support was removed in 8.0
Running org.apache.hadoop.hbase.io.encoding.TestBufferedDataBlockEncoder
Running org.apache.hadoop.hbase.io.encoding.TestEncodedSeekers
Tests run: 28, Failures: 0, Errors: 0, Skipped: 0, Time elapsed: 93.973 sec - in org.apache.hadoop.hbase.io.hfile.TestHFileBlock
Java HotSpot(TM) 64-Bit Server VM warning: ignoring option MaxPermSize=256m; support was removed in 8.0
Running org.apache.hadoop.hbase.io.encoding.TestDataBlockEncoders
Tests run: 1, Failures: 0, Errors: 0, Skipped: 0, Time elapsed: 19.489 sec - in org.apache.hadoop.hbase.io.encoding.TestBufferedDataBlockEncoder
Java HotSpot(TM) 64-Bit Server VM warning: ignoring option MaxPermSize=256m; support was removed in 8.0
Java HotSpot(TM) 64-Bit Server VM warning: ignoring option MaxPermSize=256m; support was removed in 8.0
Running org.apache.hadoop.hbase.io.encoding.TestChangingEncoding
Tests run: 72, Failures: 0, Errors: 0, Skipped: 0, Time elapsed: 161.222 sec - in org.apache.hadoop.hbase.io.hfile.TestCacheOnWrite
Java HotSpot(TM) 64-Bit Server VM warning: ignoring option MaxPermSize=256m; support was removed in 8.0
Java HotSpot(TM) 64-Bit Server VM warning: ignoring option MaxPermSize=256m; support was removed in 8.0
Java HotSpot(TM) 64-Bit Server VM warning: ignoring option MaxPermSize=256m; support was removed in 8.0
Java HotSpot(TM) 64-Bit Server VM warning: ignoring option MaxPermSize=256m; support was removed in 8.0
Running org.apache.hadoop.hbase.TestClusterBootOrder
Tests run: 3, Failures: 0, Errors: 0, Skipped: 0, Time elapsed: 222.204 sec - in org.apache.hadoop.hbase.filter.TestFuzzyRowFilterEndToEnd
Tests run: 28, Failures: 0, Errors: 0, Skipped: 0, Time elapsed: 51.794 sec - in org.apache.hadoop.hbase.io.encoding.TestDataBlockEncoders
Tests run: 2, Failures: 0, Errors: 0, Skipped: 0, Time elapsed: 29.604 sec - in org.apache.hadoop.hbase.TestClusterBootOrder
Tests run: 20, Failures: 0, Errors: 0, Skipped: 0, Time elapsed: 136.539 sec - in org.apache.hadoop.hbase.io.encoding.TestEncodedSeekers
Tests run: 3, Failures: 0, Errors: 0, Skipped: 0, Time elapsed: 143.502 sec - in org.apache.hadoop.hbase.io.encoding.TestChangingEncoding

Results :

Flaked tests: 
org.apache.hadoop.hbase.regionserver.TestSplitWalDataLoss.test(org.apache.hadoop.hbase.regionserver.TestSplitWalDataLoss)
  Run 1: TestSplitWalDataLoss.test:124 » RetriesExhaustedWithDetails Failed 1 action: T...
  Run 2: PASS


Tests run: 2275, Failures: 0, Errors: 0, Skipped: 40, Flakes: 1

[INFO] ------------------------------------------------------------------------
[INFO] Reactor Summary:
[INFO] 
[INFO] Apache HBase ...................................... SUCCESS [1:03.053s]
[INFO] Apache HBase - Checkstyle ......................... SUCCESS [5.679s]
[INFO] Apache HBase - Resource Bundle .................... SUCCESS [0.253s]
[INFO] Apache HBase - Annotations ........................ SUCCESS [1.389s]
[INFO] Apache HBase - Protocol ........................... SUCCESS [19.326s]
[INFO] Apache HBase - Common ............................. SUCCESS [2:49.829s]
[INFO] Apache HBase - Procedure .......................... SUCCESS [3:27.752s]
[INFO] Apache HBase - Client ............................. SUCCESS [1:27.884s]
[INFO] Apache HBase - Hadoop Compatibility ............... SUCCESS [8.333s]
[INFO] Apache HBase - Hadoop Two Compatibility ........... SUCCESS [8.804s]
[INFO] Apache HBase - Prefix Tree ........................ SUCCESS [9.225s]
[INFO] Apache HBase - Server ............................. FAILURE [1:21:18.695s]
[INFO] Apache HBase - Testing Util ....................... SKIPPED
[INFO] Apache HBase - Thrift ............................. SKIPPED
[INFO] Apache HBase - Rest ............................... SKIPPED
[INFO] Apache HBase - Shell .............................. SKIPPED
[INFO] Apache HBase - Integration Tests .................. SKIPPED
[INFO] Apache HBase - Examples ........................... SKIPPED
[INFO] Apache HBase - External Block Cache ............... SKIPPED
[INFO] Apache HBase - Assembly ........................... SKIPPED
[INFO] Apache HBase - Shaded ............................. SKIPPED
[INFO] Apache HBase - Shaded - Client .................... SKIPPED
[INFO] Apache HBase - Shaded - Server .................... SKIPPED
[INFO] ------------------------------------------------------------------------
[INFO] BUILD FAILURE
[INFO] ------------------------------------------------------------------------
[INFO] Total time: 1:31:19.256s
[INFO] Finished at: Tue Dec 29 17:22:10 UTC 2015
[INFO] Final Memory: 434M/666M
[INFO] ------------------------------------------------------------------------
[ERROR] Failed to execute goal org.apache.maven.plugins:maven-surefire-plugin:2.18.1:test (secondPartTestsExecution) on project hbase-server: There was a timeout or other error in the fork -> [Help 1]
[ERROR] 
[ERROR] To see the full stack trace of the errors, re-run Maven with the -e switch.
[ERROR] Re-run Maven using the -X switch to enable full debug logging.
[ERROR] 
[ERROR] For more information about the errors and possible solutions, please read the following articles:
[ERROR] [Help 1] http://cwiki.apache.org/confluence/display/MAVEN/MojoFailureException
[ERROR] 
[ERROR] After correcting the problems, you can resume the build with the command
[ERROR]   mvn <goals> -rf :hbase-server
Build step 'Invoke top-level Maven targets' marked build as failure
Performing Post build task...
Match found for :.* : True
Logical operation result is TRUE
Running script  : # Post-build task script. TODO: Check this in and have all builds reference check-in.
pwd && ls
# NOTE!!!! The below code has been copied and pasted from ./dev-tools/run-test.sh
# Do not change here without syncing there and vice-versa.
ZOMBIE_TESTS_COUNT=`jps -v | grep surefirebooter | grep -e '-Dhbase.test' | wc -l`
if [[ $ZOMBIE_TESTS_COUNT != 0 ]] ; then
 echo "Suspicious java process found - waiting 30s to see if there are just slow to stop"
 sleep 30
 ZOMBIE_TESTS_COUNT=`jps -v | grep surefirebooter | grep -e '-Dhbase.test' | wc -l`
 if [[ $ZOMBIE_TESTS_COUNT != 0 ]] ; then
   echo " {color:red}There appear to be $ZOMBIE_TESTS_COUNT zombie tests{color}, they should have been killed by surefire but survived"
   jps -v | grep surefirebooter | grep -e '-Dhbase.test'
   jps -v | grep surefirebooter | grep -e '-Dhbase.test' | cut -d ' ' -f 1 | xargs -n 1 jstack
   # Exit with error
   exit 1
 else
   echo "We're ok: there is no zombie test, but some tests took some time to stop"
 fi
else
  echo "We're ok: there is no zombie test"
fi
[Hadoop] $ /bin/bash -xe /tmp/hudson6281252859512781066.sh
+ pwd
<https://builds.apache.org/job/HBase-1.2/jdk=latest1.8,label=Hadoop/ws/>
+ ls
bin
CHANGES.txt
conf
dev-support
hbase-annotations
hbase-assembly
hbase-checkstyle
hbase-client
hbase-common
hbase-examples
hbase-external-blockcache
hbase-hadoop2-compat
hbase-hadoop-compat
hbase-it
hbase-native-client
hbase-prefix-tree
hbase-procedure
hbase-protocol
hbase-resource-bundle
hbase-rest
hbase-server
hbase-shaded
hbase-shell
hbase-testing-util
hbase-thrift
LICENSE.txt
NOTICE.txt
pom.xml
README.txt
src
target
++ jps -v
++ grep surefirebooter
++ grep -e -Dhbase.test
++ wc -l
+ ZOMBIE_TESTS_COUNT=0
+ [[ 0 != 0 ]]
+ echo 'We'\''re ok: there is no zombie test'
We're ok: there is no zombie test
POST BUILD TASK : SUCCESS
END OF POST BUILD TASK : 0
Archiving artifacts
Recording test results

Jenkins build is back to normal : HBase-1.2 » latest1.8,Hadoop #483

Posted by Apache Jenkins Server <je...@builds.apache.org>.
See <https://builds.apache.org/job/HBase-1.2/jdk=latest1.8,label=Hadoop/483/>


Build failed in Jenkins: HBase-1.2 » latest1.8,Hadoop #482

Posted by Apache Jenkins Server <je...@builds.apache.org>.
See <https://builds.apache.org/job/HBase-1.2/jdk=latest1.8,label=Hadoop/482/>

------------------------------------------
[...truncated 45950 lines...]
Java HotSpot(TM) 64-Bit Server VM warning: ignoring option MaxPermSize=256m; support was removed in 8.0
Running org.apache.hadoop.hbase.filter.TestFuzzyRowFilterEndToEnd
Running org.apache.hadoop.hbase.filter.TestMultiRowRangeFilter
Running org.apache.hadoop.hbase.filter.TestFilterWithScanLimits
Tests run: 1, Failures: 0, Errors: 0, Skipped: 0, Time elapsed: 3.572 sec - in org.apache.hadoop.hbase.filter.TestFilterWithScanLimits
Java HotSpot(TM) 64-Bit Server VM warning: ignoring option MaxPermSize=256m; support was removed in 8.0
Running org.apache.hadoop.hbase.filter.TestScanRowPrefix
Java HotSpot(TM) 64-Bit Server VM warning: ignoring option MaxPermSize=256m; support was removed in 8.0
Java HotSpot(TM) 64-Bit Server VM warning: ignoring option MaxPermSize=256m; support was removed in 8.0
Java HotSpot(TM) 64-Bit Server VM warning: ignoring option MaxPermSize=256m; support was removed in 8.0
Java HotSpot(TM) 64-Bit Server VM warning: ignoring option MaxPermSize=256m; support was removed in 8.0
Java HotSpot(TM) 64-Bit Server VM warning: ignoring option MaxPermSize=256m; support was removed in 8.0
Java HotSpot(TM) 64-Bit Server VM warning: ignoring option MaxPermSize=256m; support was removed in 8.0
Java HotSpot(TM) 64-Bit Server VM warning: ignoring option MaxPermSize=256m; support was removed in 8.0
Tests run: 1, Failures: 0, Errors: 0, Skipped: 0, Time elapsed: 5.445 sec - in org.apache.hadoop.hbase.filter.TestScanRowPrefix
Java HotSpot(TM) 64-Bit Server VM warning: ignoring option MaxPermSize=256m; support was removed in 8.0
Java HotSpot(TM) 64-Bit Server VM warning: ignoring option MaxPermSize=256m; support was removed in 8.0
Java HotSpot(TM) 64-Bit Server VM warning: ignoring option MaxPermSize=256m; support was removed in 8.0
Java HotSpot(TM) 64-Bit Server VM warning: ignoring option MaxPermSize=256m; support was removed in 8.0
Java HotSpot(TM) 64-Bit Server VM warning: ignoring option MaxPermSize=256m; support was removed in 8.0
Running org.apache.hadoop.hbase.TestGlobalMemStoreSize
Tests run: 20, Failures: 0, Errors: 0, Skipped: 0, Time elapsed: 22.212 sec - in org.apache.hadoop.hbase.filter.TestMultiRowRangeFilter
Java HotSpot(TM) 64-Bit Server VM warning: ignoring option MaxPermSize=256m; support was removed in 8.0
Running org.apache.hadoop.hbase.TestHBaseOnOtherDfsCluster
Running org.apache.hadoop.hbase.filter.TestFilterWrapper
Tests run: 1, Failures: 0, Errors: 0, Skipped: 0, Time elapsed: 3.621 sec - in org.apache.hadoop.hbase.filter.TestFilterWrapper
Java HotSpot(TM) 64-Bit Server VM warning: ignoring option MaxPermSize=256m; support was removed in 8.0
Tests run: 1, Failures: 0, Errors: 0, Skipped: 0, Time elapsed: 18.565 sec - in org.apache.hadoop.hbase.TestGlobalMemStoreSize
Java HotSpot(TM) 64-Bit Server VM warning: ignoring option MaxPermSize=256m; support was removed in 8.0
Java HotSpot(TM) 64-Bit Server VM warning: ignoring option MaxPermSize=256m; support was removed in 8.0
Tests run: 1, Failures: 0, Errors: 0, Skipped: 0, Time elapsed: 13.954 sec - in org.apache.hadoop.hbase.TestHBaseOnOtherDfsCluster
Java HotSpot(TM) 64-Bit Server VM warning: ignoring option MaxPermSize=256m; support was removed in 8.0
Running org.apache.hadoop.hbase.TestNamespace
Running org.apache.hadoop.hbase.migration.TestUpgradeTo96
Tests run: 5, Failures: 0, Errors: 0, Skipped: 0, Time elapsed: 2.421 sec - in org.apache.hadoop.hbase.migration.TestUpgradeTo96
Java HotSpot(TM) 64-Bit Server VM warning: ignoring option MaxPermSize=256m; support was removed in 8.0
Java HotSpot(TM) 64-Bit Server VM warning: ignoring option MaxPermSize=256m; support was removed in 8.0
Java HotSpot(TM) 64-Bit Server VM warning: ignoring option MaxPermSize=256m; support was removed in 8.0
Java HotSpot(TM) 64-Bit Server VM warning: ignoring option MaxPermSize=256m; support was removed in 8.0
Java HotSpot(TM) 64-Bit Server VM warning: ignoring option MaxPermSize=256m; support was removed in 8.0
Java HotSpot(TM) 64-Bit Server VM warning: ignoring option MaxPermSize=256m; support was removed in 8.0
Running org.apache.hadoop.hbase.replication.TestReplicationSource
Running org.apache.hadoop.hbase.migration.TestNamespaceUpgrade
Tests run: 1, Failures: 0, Errors: 0, Skipped: 0, Time elapsed: 0.701 sec - in org.apache.hadoop.hbase.replication.TestReplicationSource
Java HotSpot(TM) 64-Bit Server VM warning: ignoring option MaxPermSize=256m; support was removed in 8.0
Tests run: 9, Failures: 0, Errors: 0, Skipped: 1, Time elapsed: 25.652 sec - in org.apache.hadoop.hbase.TestNamespace
Java HotSpot(TM) 64-Bit Server VM warning: ignoring option MaxPermSize=256m; support was removed in 8.0
Running org.apache.hadoop.hbase.replication.TestReplicationWithTags
Tests run: 5, Failures: 0, Errors: 0, Skipped: 0, Time elapsed: 25.475 sec - in org.apache.hadoop.hbase.migration.TestNamespaceUpgrade
Java HotSpot(TM) 64-Bit Server VM warning: ignoring option MaxPermSize=256m; support was removed in 8.0
Tests run: 1, Failures: 0, Errors: 0, Skipped: 0, Time elapsed: 4.378 sec - in org.apache.hadoop.hbase.replication.TestReplicationWithTags
Java HotSpot(TM) 64-Bit Server VM warning: ignoring option MaxPermSize=256m; support was removed in 8.0
Running org.apache.hadoop.hbase.replication.TestPerTableCFReplication
Running org.apache.hadoop.hbase.replication.TestReplicationChangingPeerRegionservers
Running org.apache.hadoop.hbase.replication.TestReplicationSmallTests
Tests run: 1, Failures: 0, Errors: 0, Skipped: 0, Time elapsed: 5.514 sec - in org.apache.hadoop.hbase.replication.TestReplicationChangingPeerRegionservers
Java HotSpot(TM) 64-Bit Server VM warning: ignoring option MaxPermSize=256m; support was removed in 8.0
Running org.apache.hadoop.hbase.replication.TestMultiSlaveReplication
Tests run: 2, Failures: 0, Errors: 0, Skipped: 0, Time elapsed: 38.726 sec - in org.apache.hadoop.hbase.replication.TestPerTableCFReplication
Java HotSpot(TM) 64-Bit Server VM warning: ignoring option MaxPermSize=256m; support was removed in 8.0
Running org.apache.hadoop.hbase.replication.TestReplicationKillSlaveRS
Tests run: 1, Failures: 0, Errors: 0, Skipped: 0, Time elapsed: 34.291 sec - in org.apache.hadoop.hbase.replication.TestMultiSlaveReplication
Java HotSpot(TM) 64-Bit Server VM warning: ignoring option MaxPermSize=256m; support was removed in 8.0
Running org.apache.hadoop.hbase.replication.TestMasterReplication
Tests run: 1, Failures: 0, Errors: 0, Skipped: 0, Time elapsed: 16.352 sec - in org.apache.hadoop.hbase.replication.TestReplicationKillSlaveRS
Java HotSpot(TM) 64-Bit Server VM warning: ignoring option MaxPermSize=256m; support was removed in 8.0
Running org.apache.hadoop.hbase.replication.regionserver.TestReplicationWALReaderManager
Tests run: 12, Failures: 0, Errors: 0, Skipped: 0, Time elapsed: 73.944 sec - in org.apache.hadoop.hbase.replication.TestReplicationSmallTests
Java HotSpot(TM) 64-Bit Server VM warning: ignoring option MaxPermSize=256m; support was removed in 8.0
Java HotSpot(TM) 64-Bit Server VM warning: ignoring option MaxPermSize=256m; support was removed in 8.0
Running org.apache.hadoop.hbase.replication.regionserver.TestRegionReplicaReplicationEndpointNoMaster
Tests run: 3, Failures: 0, Errors: 0, Skipped: 0, Time elapsed: 231.911 sec - in org.apache.hadoop.hbase.filter.TestFuzzyRowFilterEndToEnd
Java HotSpot(TM) 64-Bit Server VM warning: ignoring option MaxPermSize=256m; support was removed in 8.0
Running org.apache.hadoop.hbase.replication.regionserver.TestReplicationSourceManager
Tests run: 5, Failures: 0, Errors: 0, Skipped: 0, Time elapsed: 3.781 sec - in org.apache.hadoop.hbase.replication.regionserver.TestReplicationSourceManager
Java HotSpot(TM) 64-Bit Server VM warning: ignoring option MaxPermSize=256m; support was removed in 8.0
Tests run: 4, Failures: 0, Errors: 0, Skipped: 0, Time elapsed: 37.173 sec - in org.apache.hadoop.hbase.replication.regionserver.TestRegionReplicaReplicationEndpointNoMaster
Java HotSpot(TM) 64-Bit Server VM warning: ignoring option MaxPermSize=256m; support was removed in 8.0
Tests run: 4, Failures: 0, Errors: 0, Skipped: 0, Time elapsed: 89.581 sec - in org.apache.hadoop.hbase.replication.TestMasterReplication
Java HotSpot(TM) 64-Bit Server VM warning: ignoring option MaxPermSize=256m; support was removed in 8.0
Java HotSpot(TM) 64-Bit Server VM warning: ignoring option MaxPermSize=256m; support was removed in 8.0
Running org.apache.hadoop.hbase.replication.regionserver.TestReplicationSink
Tests run: 5, Failures: 0, Errors: 0, Skipped: 0, Time elapsed: 2.67 sec - in org.apache.hadoop.hbase.replication.regionserver.TestReplicationSink
Java HotSpot(TM) 64-Bit Server VM warning: ignoring option MaxPermSize=256m; support was removed in 8.0
Running org.apache.hadoop.hbase.replication.regionserver.TestRegionReplicaReplicationEndpoint
Running org.apache.hadoop.hbase.replication.multiwal.TestReplicationKillMasterRSCompressedWithMultipleWAL
Running org.apache.hadoop.hbase.replication.multiwal.TestReplicationEndpointWithMultipleWAL
Tests run: 4, Failures: 0, Errors: 0, Skipped: 0, Time elapsed: 12.314 sec - in org.apache.hadoop.hbase.replication.multiwal.TestReplicationEndpointWithMultipleWAL
Java HotSpot(TM) 64-Bit Server VM warning: ignoring option MaxPermSize=256m; support was removed in 8.0
Tests run: 1, Failures: 0, Errors: 0, Skipped: 0, Time elapsed: 25.307 sec - in org.apache.hadoop.hbase.replication.multiwal.TestReplicationKillMasterRSCompressedWithMultipleWAL
Java HotSpot(TM) 64-Bit Server VM warning: ignoring option MaxPermSize=256m; support was removed in 8.0
Running org.apache.hadoop.hbase.replication.TestReplicationStateZKImpl
Tests run: 6, Failures: 0, Errors: 0, Skipped: 0, Time elapsed: 2.187 sec - in org.apache.hadoop.hbase.replication.TestReplicationStateZKImpl
Java HotSpot(TM) 64-Bit Server VM warning: ignoring option MaxPermSize=256m; support was removed in 8.0
Running org.apache.hadoop.hbase.replication.multiwal.TestReplicationSyncUpToolWithMultipleWAL
Running org.apache.hadoop.hbase.replication.TestReplicationEndpoint
Tests run: 4, Failures: 0, Errors: 0, Skipped: 0, Time elapsed: 8.839 sec - in org.apache.hadoop.hbase.replication.TestReplicationEndpoint
Java HotSpot(TM) 64-Bit Server VM warning: ignoring option MaxPermSize=256m; support was removed in 8.0
Java HotSpot(TM) 64-Bit Server VM warning: ignoring option MaxPermSize=256m; support was removed in 8.0
Tests run: 9, Failures: 0, Errors: 0, Skipped: 0, Time elapsed: 95.956 sec - in org.apache.hadoop.hbase.replication.regionserver.TestRegionReplicaReplicationEndpoint
Java HotSpot(TM) 64-Bit Server VM warning: ignoring option MaxPermSize=256m; support was removed in 8.0
Running org.apache.hadoop.hbase.replication.TestReplicationTrackerZKImpl
Tests run: 5, Failures: 0, Errors: 0, Skipped: 0, Time elapsed: 0.903 sec - in org.apache.hadoop.hbase.replication.TestReplicationTrackerZKImpl
Java HotSpot(TM) 64-Bit Server VM warning: ignoring option MaxPermSize=256m; support was removed in 8.0
Running org.apache.hadoop.hbase.replication.TestReplicationSyncUpTool
Tests run: 1, Failures: 0, Errors: 0, Skipped: 0, Time elapsed: 53.099 sec - in org.apache.hadoop.hbase.replication.multiwal.TestReplicationSyncUpToolWithMultipleWAL
Java HotSpot(TM) 64-Bit Server VM warning: ignoring option MaxPermSize=256m; support was removed in 8.0
Running org.apache.hadoop.hbase.replication.TestReplicationKillMasterRS
Tests run: 8, Failures: 0, Errors: 0, Skipped: 0, Time elapsed: 214.413 sec - in org.apache.hadoop.hbase.replication.regionserver.TestReplicationWALReaderManager
Java HotSpot(TM) 64-Bit Server VM warning: ignoring option MaxPermSize=256m; support was removed in 8.0
Tests run: 1, Failures: 0, Errors: 0, Skipped: 0, Time elapsed: 16.695 sec - in org.apache.hadoop.hbase.replication.TestReplicationKillMasterRS
Running org.apache.hadoop.hbase.replication.TestReplicationKillMasterRSCompressed
Running org.apache.hadoop.hbase.replication.TestReplicationDisableInactivePeer
Tests run: 1, Failures: 0, Errors: 0, Skipped: 0, Time elapsed: 51.909 sec - in org.apache.hadoop.hbase.replication.TestReplicationSyncUpTool
Tests run: 1, Failures: 0, Errors: 0, Skipped: 0, Time elapsed: 15.603 sec - in org.apache.hadoop.hbase.replication.TestReplicationKillMasterRSCompressed
Tests run: 1, Failures: 0, Errors: 0, Skipped: 0, Time elapsed: 20.247 sec - in org.apache.hadoop.hbase.replication.TestReplicationDisableInactivePeer
Tests run: 1, Failures: 0, Errors: 1, Skipped: 0, Time elapsed: 600.974 sec <<< FAILURE! - in org.apache.hadoop.hbase.regionserver.TestFailedAppendAndSync
testLockupAroundBadAssignSync(org.apache.hadoop.hbase.regionserver.TestFailedAppendAndSync)  Time elapsed: 300.033 sec  <<< ERROR!
org.junit.runners.model.TestTimedOutException: test timed out after 300000 milliseconds
	at java.lang.Thread.sleep(Native Method)
	at org.apache.hadoop.hbase.util.Threads.sleep(Threads.java:146)
	at org.apache.hadoop.hbase.regionserver.TestFailedAppendAndSync.testLockupAroundBadAssignSync(TestFailedAppendAndSync.java:242)


Results :

Tests in error: 
org.apache.hadoop.hbase.regionserver.TestFailedAppendAndSync.testLockupAroundBadAssignSync(org.apache.hadoop.hbase.regionserver.TestFailedAppendAndSync)
  Run 1: TestFailedAppendAndSync.testLockupAroundBadAssignSync:216 » TestTimedOut test ...
  Run 2: TestFailedAppendAndSync.testLockupAroundBadAssignSync:242 » TestTimedOut test ...


Tests run: 2376, Failures: 0, Errors: 1, Skipped: 41

[INFO] ------------------------------------------------------------------------
[INFO] Reactor Summary:
[INFO] 
[INFO] Apache HBase ...................................... SUCCESS [1:16.575s]
[INFO] Apache HBase - Checkstyle ......................... SUCCESS [5.927s]
[INFO] Apache HBase - Resource Bundle .................... SUCCESS [0.130s]
[INFO] Apache HBase - Annotations ........................ SUCCESS [1.046s]
[INFO] Apache HBase - Protocol ........................... SUCCESS [22.058s]
[INFO] Apache HBase - Common ............................. SUCCESS [3:28.547s]
[INFO] Apache HBase - Procedure .......................... SUCCESS [3:25.339s]
[INFO] Apache HBase - Client ............................. SUCCESS [1:23.183s]
[INFO] Apache HBase - Hadoop Compatibility ............... SUCCESS [8.128s]
[INFO] Apache HBase - Hadoop Two Compatibility ........... SUCCESS [7.678s]
[INFO] Apache HBase - Prefix Tree ........................ SUCCESS [7.764s]
[INFO] Apache HBase - Server ............................. FAILURE [1:25:40.150s]
[INFO] Apache HBase - Testing Util ....................... SKIPPED
[INFO] Apache HBase - Thrift ............................. SKIPPED
[INFO] Apache HBase - Rest ............................... SKIPPED
[INFO] Apache HBase - Shell .............................. SKIPPED
[INFO] Apache HBase - Integration Tests .................. SKIPPED
[INFO] Apache HBase - Examples ........................... SKIPPED
[INFO] Apache HBase - External Block Cache ............... SKIPPED
[INFO] Apache HBase - Assembly ........................... SKIPPED
[INFO] Apache HBase - Shaded ............................. SKIPPED
[INFO] Apache HBase - Shaded - Client .................... SKIPPED
[INFO] Apache HBase - Shaded - Server .................... SKIPPED
[INFO] ------------------------------------------------------------------------
[INFO] BUILD FAILURE
[INFO] ------------------------------------------------------------------------
[INFO] Total time: 1:36:27.438s
[INFO] Finished at: Wed Dec 30 05:49:45 UTC 2015
[INFO] Final Memory: 94M/635M
[INFO] ------------------------------------------------------------------------
[ERROR] Failed to execute goal org.apache.maven.plugins:maven-surefire-plugin:2.18.1:test (secondPartTestsExecution) on project hbase-server: ExecutionException: java.lang.RuntimeException: java.lang.RuntimeException: org.apache.maven.surefire.report.ReporterException: When writing xml report stdout/stderr: /tmp/stderr285948893418320706deferred (No such file or directory) -> [Help 1]
[ERROR] 
[ERROR] To see the full stack trace of the errors, re-run Maven with the -e switch.
[ERROR] Re-run Maven using the -X switch to enable full debug logging.
[ERROR] 
[ERROR] For more information about the errors and possible solutions, please read the following articles:
[ERROR] [Help 1] http://cwiki.apache.org/confluence/display/MAVEN/MojoFailureException
[ERROR] 
[ERROR] After correcting the problems, you can resume the build with the command
[ERROR]   mvn <goals> -rf :hbase-server
Build step 'Invoke top-level Maven targets' marked build as failure
Performing Post build task...
Match found for :.* : True
Logical operation result is TRUE
Running script  : # Post-build task script. TODO: Check this in and have all builds reference check-in.
pwd && ls
# NOTE!!!! The below code has been copied and pasted from ./dev-tools/run-test.sh
# Do not change here without syncing there and vice-versa.
ZOMBIE_TESTS_COUNT=`jps -v | grep surefirebooter | grep -e '-Dhbase.test' | wc -l`
if [[ $ZOMBIE_TESTS_COUNT != 0 ]] ; then
 echo "Suspicious java process found - waiting 30s to see if there are just slow to stop"
 sleep 30
 ZOMBIE_TESTS_COUNT=`jps -v | grep surefirebooter | grep -e '-Dhbase.test' | wc -l`
 if [[ $ZOMBIE_TESTS_COUNT != 0 ]] ; then
   echo " {color:red}There appear to be $ZOMBIE_TESTS_COUNT zombie tests{color}, they should have been killed by surefire but survived"
   jps -v | grep surefirebooter | grep -e '-Dhbase.test'
   jps -v | grep surefirebooter | grep -e '-Dhbase.test' | cut -d ' ' -f 1 | xargs -n 1 jstack
   # Exit with error
   exit 1
 else
   echo "We're ok: there is no zombie test, but some tests took some time to stop"
 fi
else
  echo "We're ok: there is no zombie test"
fi
[Hadoop] $ /bin/bash -xe /tmp/hudson2804203879067248827.sh
+ pwd
<https://builds.apache.org/job/HBase-1.2/jdk=latest1.8,label=Hadoop/ws/>
+ ls
bin
CHANGES.txt
conf
dev-support
hbase-annotations
hbase-assembly
hbase-checkstyle
hbase-client
hbase-common
hbase-examples
hbase-external-blockcache
hbase-hadoop2-compat
hbase-hadoop-compat
hbase-it
hbase-native-client
hbase-prefix-tree
hbase-procedure
hbase-protocol
hbase-resource-bundle
hbase-rest
hbase-server
hbase-shaded
hbase-shell
hbase-testing-util
hbase-thrift
LICENSE.txt
NOTICE.txt
pom.xml
README.txt
src
target
++ jps -v
++ grep surefirebooter
++ grep -e -Dhbase.test
++ wc -l
+ ZOMBIE_TESTS_COUNT=0
+ [[ 0 != 0 ]]
+ echo 'We'\''re ok: there is no zombie test'
We're ok: there is no zombie test
POST BUILD TASK : SUCCESS
END OF POST BUILD TASK : 0
Archiving artifacts
Recording test results

Build failed in Jenkins: HBase-1.2 » latest1.8,Hadoop #481

Posted by Apache Jenkins Server <je...@builds.apache.org>.
See <https://builds.apache.org/job/HBase-1.2/jdk=latest1.8,label=Hadoop/481/changes>

Changes:

[busbey] HBASE-15011 turn off the jdk8 javadoc linter.

[stack]  HBASE-15023 Reenable TestShell and TestStochasticLoadBalancer;

------------------------------------------
[...truncated 45617 lines...]
Java HotSpot(TM) 64-Bit Server VM warning: ignoring option MaxPermSize=256m; support was removed in 8.0
Running org.apache.hadoop.hbase.coprocessor.TestRegionObserverScannerOpenHook
Tests run: 3, Failures: 0, Errors: 0, Skipped: 0, Time elapsed: 10.631 sec - in org.apache.hadoop.hbase.coprocessor.TestRegionObserverScannerOpenHook
Java HotSpot(TM) 64-Bit Server VM warning: ignoring option MaxPermSize=256m; support was removed in 8.0
Tests run: 10, Failures: 0, Errors: 0, Skipped: 0, Time elapsed: 168.427 sec - in org.apache.hadoop.hbase.TestZooKeeper
Java HotSpot(TM) 64-Bit Server VM warning: ignoring option MaxPermSize=256m; support was removed in 8.0
Running org.apache.hadoop.hbase.coprocessor.TestOpenTableInCoprocessor
Running org.apache.hadoop.hbase.coprocessor.TestMasterCoprocessorExceptionWithAbort
Tests run: 2, Failures: 0, Errors: 0, Skipped: 0, Time elapsed: 17.094 sec - in org.apache.hadoop.hbase.coprocessor.TestOpenTableInCoprocessor
Java HotSpot(TM) 64-Bit Server VM warning: ignoring option MaxPermSize=256m; support was removed in 8.0
Tests run: 1, Failures: 0, Errors: 0, Skipped: 0, Time elapsed: 17.311 sec - in org.apache.hadoop.hbase.coprocessor.TestMasterCoprocessorExceptionWithAbort
Java HotSpot(TM) 64-Bit Server VM warning: ignoring option MaxPermSize=256m; support was removed in 8.0
Java HotSpot(TM) 64-Bit Server VM warning: ignoring option MaxPermSize=256m; support was removed in 8.0
Java HotSpot(TM) 64-Bit Server VM warning: ignoring option MaxPermSize=256m; support was removed in 8.0
Running org.apache.hadoop.hbase.coprocessor.TestCoprocessorTableEndpoint
Running org.apache.hadoop.hbase.coprocessor.TestRegionServerCoprocessorEndpoint
Tests run: 2, Failures: 0, Errors: 0, Skipped: 0, Time elapsed: 1.535 sec - in org.apache.hadoop.hbase.coprocessor.TestRegionServerCoprocessorEndpoint
Java HotSpot(TM) 64-Bit Server VM warning: ignoring option MaxPermSize=256m; support was removed in 8.0
Tests run: 2, Failures: 0, Errors: 0, Skipped: 0, Time elapsed: 10.75 sec - in org.apache.hadoop.hbase.coprocessor.TestCoprocessorTableEndpoint
Java HotSpot(TM) 64-Bit Server VM warning: ignoring option MaxPermSize=256m; support was removed in 8.0
Running org.apache.hadoop.hbase.coprocessor.TestRegionObserverInterface
Tests run: 2, Failures: 0, Errors: 0, Skipped: 0, Time elapsed: 108.84 sec - in org.apache.hadoop.hbase.TestIOFencing
Java HotSpot(TM) 64-Bit Server VM warning: ignoring option MaxPermSize=256m; support was removed in 8.0
Running org.apache.hadoop.hbase.coprocessor.TestMasterCoprocessorExceptionWithRemove
Tests run: 1, Failures: 0, Errors: 0, Skipped: 0, Time elapsed: 5.899 sec - in org.apache.hadoop.hbase.coprocessor.TestMasterCoprocessorExceptionWithRemove
Java HotSpot(TM) 64-Bit Server VM warning: ignoring option MaxPermSize=256m; support was removed in 8.0
Running org.apache.hadoop.hbase.coprocessor.TestAggregateProtocol
Tests run: 44, Failures: 0, Errors: 0, Skipped: 0, Time elapsed: 6.026 sec - in org.apache.hadoop.hbase.coprocessor.TestAggregateProtocol
Java HotSpot(TM) 64-Bit Server VM warning: ignoring option MaxPermSize=256m; support was removed in 8.0
Running org.apache.hadoop.hbase.coprocessor.TestBatchCoprocessorEndpoint
Tests run: 4, Failures: 0, Errors: 0, Skipped: 0, Time elapsed: 1.913 sec - in org.apache.hadoop.hbase.coprocessor.TestBatchCoprocessorEndpoint
Java HotSpot(TM) 64-Bit Server VM warning: ignoring option MaxPermSize=256m; support was removed in 8.0
Running org.apache.hadoop.hbase.coprocessor.TestRegionServerObserver
Running org.apache.hadoop.hbase.coprocessor.TestHTableWrapper
Tests run: 1, Failures: 0, Errors: 0, Skipped: 0, Time elapsed: 6.001 sec - in org.apache.hadoop.hbase.coprocessor.TestHTableWrapper
Java HotSpot(TM) 64-Bit Server VM warning: ignoring option MaxPermSize=256m; support was removed in 8.0
Java HotSpot(TM) 64-Bit Server VM warning: ignoring option MaxPermSize=256m; support was removed in 8.0
Java HotSpot(TM) 64-Bit Server VM warning: ignoring option MaxPermSize=256m; support was removed in 8.0
Tests run: 1, Failures: 0, Errors: 0, Skipped: 0, Time elapsed: 16.84 sec - in org.apache.hadoop.hbase.coprocessor.TestRegionServerObserver
Java HotSpot(TM) 64-Bit Server VM warning: ignoring option MaxPermSize=256m; support was removed in 8.0
Running org.apache.hadoop.hbase.coprocessor.TestRegionServerCoprocessorExceptionWithAbort
Running org.apache.hadoop.hbase.coprocessor.TestClassLoading
Tests run: 2, Failures: 0, Errors: 0, Skipped: 0, Time elapsed: 17.387 sec - in org.apache.hadoop.hbase.coprocessor.TestRegionServerCoprocessorExceptionWithAbort
Java HotSpot(TM) 64-Bit Server VM warning: ignoring option MaxPermSize=256m; support was removed in 8.0
Running org.apache.hadoop.hbase.coprocessor.TestDoubleColumnInterpreter
Tests run: 38, Failures: 0, Errors: 0, Skipped: 0, Time elapsed: 4.73 sec - in org.apache.hadoop.hbase.coprocessor.TestDoubleColumnInterpreter
Tests run: 14, Failures: 0, Errors: 0, Skipped: 2, Time elapsed: 75.509 sec - in org.apache.hadoop.hbase.coprocessor.TestRegionObserverInterface
Java HotSpot(TM) 64-Bit Server VM warning: ignoring option MaxPermSize=256m; support was removed in 8.0
Java HotSpot(TM) 64-Bit Server VM warning: ignoring option MaxPermSize=256m; support was removed in 8.0
Tests run: 9, Failures: 0, Errors: 0, Skipped: 0, Time elapsed: 29.038 sec - in org.apache.hadoop.hbase.coprocessor.TestClassLoading
Java HotSpot(TM) 64-Bit Server VM warning: ignoring option MaxPermSize=256m; support was removed in 8.0
Running org.apache.hadoop.hbase.coprocessor.TestRegionObserverBypass
Running org.apache.hadoop.hbase.coprocessor.TestRowProcessorEndpoint
Running org.apache.hadoop.hbase.coprocessor.TestCoprocessorStop
Tests run: 2, Failures: 0, Errors: 0, Skipped: 0, Time elapsed: 7.737 sec - in org.apache.hadoop.hbase.coprocessor.TestRegionObserverBypass
Java HotSpot(TM) 64-Bit Server VM warning: ignoring option MaxPermSize=256m; support was removed in 8.0
Running org.apache.hadoop.hbase.coprocessor.TestRegionServerCoprocessorExceptionWithRemove
Tests run: 9, Failures: 0, Errors: 0, Skipped: 0, Time elapsed: 288.738 sec - in org.apache.hadoop.hbase.snapshot.TestExportSnapshot
Java HotSpot(TM) 64-Bit Server VM warning: ignoring option MaxPermSize=256m; support was removed in 8.0
Tests run: 1, Failures: 0, Errors: 0, Skipped: 0, Time elapsed: 16.908 sec - in org.apache.hadoop.hbase.coprocessor.TestCoprocessorStop
Java HotSpot(TM) 64-Bit Server VM warning: ignoring option MaxPermSize=256m; support was removed in 8.0
Tests run: 4, Failures: 0, Errors: 0, Skipped: 0, Time elapsed: 20.319 sec - in org.apache.hadoop.hbase.coprocessor.TestRowProcessorEndpoint
Java HotSpot(TM) 64-Bit Server VM warning: ignoring option MaxPermSize=256m; support was removed in 8.0
Running org.apache.hadoop.hbase.coprocessor.TestBigDecimalColumnInterpreter
Running org.apache.hadoop.hbase.coprocessor.TestMasterObserver
Tests run: 1, Failures: 0, Errors: 0, Skipped: 0, Time elapsed: 13.84 sec - in org.apache.hadoop.hbase.coprocessor.TestRegionServerCoprocessorExceptionWithRemove
Java HotSpot(TM) 64-Bit Server VM warning: ignoring option MaxPermSize=256m; support was removed in 8.0
Running org.apache.hadoop.hbase.coprocessor.TestCoprocessorEndpoint
Tests run: 38, Failures: 0, Errors: 0, Skipped: 0, Time elapsed: 5.237 sec - in org.apache.hadoop.hbase.coprocessor.TestBigDecimalColumnInterpreter
Java HotSpot(TM) 64-Bit Server VM warning: ignoring option MaxPermSize=256m; support was removed in 8.0
Tests run: 6, Failures: 0, Errors: 0, Skipped: 0, Time elapsed: 1.852 sec - in org.apache.hadoop.hbase.coprocessor.TestCoprocessorEndpoint
Java HotSpot(TM) 64-Bit Server VM warning: ignoring option MaxPermSize=256m; support was removed in 8.0
Running org.apache.hadoop.hbase.TestGlobalMemStoreSize
Running org.apache.hadoop.hbase.coprocessor.TestWALObserver
Tests run: 9, Failures: 0, Errors: 0, Skipped: 0, Time elapsed: 285.533 sec - in org.apache.hadoop.hbase.snapshot.TestSecureExportSnapshot
Java HotSpot(TM) 64-Bit Server VM warning: ignoring option MaxPermSize=256m; support was removed in 8.0
Java HotSpot(TM) 64-Bit Server VM warning: ignoring option MaxPermSize=256m; support was removed in 8.0
Running org.apache.hadoop.hbase.TestJMXListener
Java HotSpot(TM) 64-Bit Server VM warning: ignoring option MaxPermSize=256m; support was removed in 8.0
Java HotSpot(TM) 64-Bit Server VM warning: ignoring option MaxPermSize=256m; support was removed in 8.0
Running org.apache.hadoop.hbase.TestMetaTableLocator
Tests run: 1, Failures: 0, Errors: 0, Skipped: 0, Time elapsed: 13.836 sec - in org.apache.hadoop.hbase.TestGlobalMemStoreSize
Java HotSpot(TM) 64-Bit Server VM warning: ignoring option MaxPermSize=256m; support was removed in 8.0
Tests run: 7, Failures: 0, Errors: 0, Skipped: 0, Time elapsed: 3.231 sec - in org.apache.hadoop.hbase.TestMetaTableLocator
Java HotSpot(TM) 64-Bit Server VM warning: ignoring option MaxPermSize=256m; support was removed in 8.0
Tests run: 6, Failures: 0, Errors: 0, Skipped: 0, Time elapsed: 8.694 sec - in org.apache.hadoop.hbase.coprocessor.TestWALObserver
Java HotSpot(TM) 64-Bit Server VM warning: ignoring option MaxPermSize=256m; support was removed in 8.0
Running org.apache.hadoop.hbase.zookeeper.TestZKTableStateManager
Tests run: 1, Failures: 0, Errors: 0, Skipped: 0, Time elapsed: 0.518 sec - in org.apache.hadoop.hbase.zookeeper.TestZKTableStateManager
Java HotSpot(TM) 64-Bit Server VM warning: ignoring option MaxPermSize=256m; support was removed in 8.0
Running org.apache.hadoop.hbase.zookeeper.TestZKMulti
Tests run: 12, Failures: 0, Errors: 0, Skipped: 0, Time elapsed: 1.167 sec - in org.apache.hadoop.hbase.zookeeper.TestZKMulti
Running org.apache.hadoop.hbase.zookeeper.lock.TestZKInterProcessReadWriteLock
Java HotSpot(TM) 64-Bit Server VM warning: ignoring option MaxPermSize=256m; support was removed in 8.0
Running org.apache.hadoop.hbase.zookeeper.TestZKLeaderManager
Tests run: 1, Failures: 0, Errors: 0, Skipped: 0, Time elapsed: 0.125 sec - in org.apache.hadoop.hbase.zookeeper.TestZKLeaderManager
Java HotSpot(TM) 64-Bit Server VM warning: ignoring option MaxPermSize=256m; support was removed in 8.0
Java HotSpot(TM) 64-Bit Server VM warning: ignoring option MaxPermSize=256m; support was removed in 8.0
Running org.apache.hadoop.hbase.zookeeper.TestRecoverableZooKeeper
Tests run: 1, Failures: 0, Errors: 0, Skipped: 0, Time elapsed: 1.227 sec - in org.apache.hadoop.hbase.zookeeper.TestRecoverableZooKeeper
Java HotSpot(TM) 64-Bit Server VM warning: ignoring option MaxPermSize=256m; support was removed in 8.0
Running org.apache.hadoop.hbase.zookeeper.TestZooKeeperACL
Tests run: 7, Failures: 0, Errors: 0, Skipped: 0, Time elapsed: 0.356 sec - in org.apache.hadoop.hbase.zookeeper.TestZooKeeperACL
Running org.apache.hadoop.hbase.zookeeper.TestZooKeeperNodeTracker
Java HotSpot(TM) 64-Bit Server VM warning: ignoring option MaxPermSize=256m; support was removed in 8.0
Tests run: 3, Failures: 0, Errors: 0, Skipped: 0, Time elapsed: 0.628 sec - in org.apache.hadoop.hbase.zookeeper.TestZooKeeperNodeTracker
Java HotSpot(TM) 64-Bit Server VM warning: ignoring option MaxPermSize=256m; support was removed in 8.0
Running org.apache.hadoop.hbase.TestClusterBootOrder
Running org.apache.hadoop.hbase.zookeeper.TestHQuorumPeer
Tests run: 4, Failures: 0, Errors: 0, Skipped: 0, Time elapsed: 0.94 sec - in org.apache.hadoop.hbase.zookeeper.TestHQuorumPeer
Tests run: 2, Failures: 0, Errors: 0, Skipped: 0, Time elapsed: 16.269 sec - in org.apache.hadoop.hbase.TestJMXListener
Java HotSpot(TM) 64-Bit Server VM warning: ignoring option MaxPermSize=256m; support was removed in 8.0
Java HotSpot(TM) 64-Bit Server VM warning: ignoring option MaxPermSize=256m; support was removed in 8.0
Java HotSpot(TM) 64-Bit Server VM warning: ignoring option MaxPermSize=256m; support was removed in 8.0
Tests run: 7, Failures: 0, Errors: 0, Skipped: 0, Time elapsed: 39.014 sec - in org.apache.hadoop.hbase.coprocessor.TestMasterObserver
Running org.apache.hadoop.hbase.TestServerSideScanMetricsFromClientSide
Tests run: 2, Failures: 0, Errors: 0, Skipped: 0, Time elapsed: 2.263 sec - in org.apache.hadoop.hbase.TestServerSideScanMetricsFromClientSide
Tests run: 6, Failures: 0, Errors: 0, Skipped: 0, Time elapsed: 24.481 sec - in org.apache.hadoop.hbase.zookeeper.lock.TestZKInterProcessReadWriteLock
Tests run: 2, Failures: 0, Errors: 0, Skipped: 0, Time elapsed: 27.985 sec - in org.apache.hadoop.hbase.TestClusterBootOrder

Results :

Tests in error: 
org.apache.hadoop.hbase.master.TestTableLockManager.testReapAllTableLocks(org.apache.hadoop.hbase.master.TestTableLockManager)
  Run 1: TestTableLockManager.testReapAllTableLocks:283 » LockTimeout Timed out acquiri...
  Run 2: TestTableLockManager.testReapAllTableLocks:283 » LockTimeout Timed out acquiri...
  Run 3: TestTableLockManager.testReapAllTableLocks:283 » LockTimeout Timed out acquiri...


Tests run: 2376, Failures: 0, Errors: 1, Skipped: 41

[INFO] ------------------------------------------------------------------------
[INFO] Reactor Summary:
[INFO] 
[INFO] Apache HBase ...................................... SUCCESS [1:03.477s]
[INFO] Apache HBase - Checkstyle ......................... SUCCESS [5.165s]
[INFO] Apache HBase - Resource Bundle .................... SUCCESS [0.157s]
[INFO] Apache HBase - Annotations ........................ SUCCESS [0.910s]
[INFO] Apache HBase - Protocol ........................... SUCCESS [17.327s]
[INFO] Apache HBase - Common ............................. SUCCESS [2:35.503s]
[INFO] Apache HBase - Procedure .......................... SUCCESS [3:24.954s]
[INFO] Apache HBase - Client ............................. SUCCESS [1:24.378s]
[INFO] Apache HBase - Hadoop Compatibility ............... SUCCESS [7.922s]
[INFO] Apache HBase - Hadoop Two Compatibility ........... SUCCESS [7.356s]
[INFO] Apache HBase - Prefix Tree ........................ SUCCESS [7.647s]
[INFO] Apache HBase - Server ............................. FAILURE [1:07:14.895s]
[INFO] Apache HBase - Testing Util ....................... SKIPPED
[INFO] Apache HBase - Thrift ............................. SKIPPED
[INFO] Apache HBase - Rest ............................... SKIPPED
[INFO] Apache HBase - Shell .............................. SKIPPED
[INFO] Apache HBase - Integration Tests .................. SKIPPED
[INFO] Apache HBase - Examples ........................... SKIPPED
[INFO] Apache HBase - External Block Cache ............... SKIPPED
[INFO] Apache HBase - Assembly ........................... SKIPPED
[INFO] Apache HBase - Shaded ............................. SKIPPED
[INFO] Apache HBase - Shaded - Client .................... SKIPPED
[INFO] Apache HBase - Shaded - Server .................... SKIPPED
[INFO] ------------------------------------------------------------------------
[INFO] BUILD FAILURE
[INFO] ------------------------------------------------------------------------
[INFO] Total time: 1:16:50.566s
[INFO] Finished at: Tue Dec 29 21:47:21 UTC 2015
[INFO] Final Memory: 94M/675M
[INFO] ------------------------------------------------------------------------
[ERROR] Failed to execute goal org.apache.maven.plugins:maven-surefire-plugin:2.18.1:test (secondPartTestsExecution) on project hbase-server: There are test failures.
[ERROR] 
[ERROR] Please refer to <https://builds.apache.org/job/HBase-1.2/jdk=latest1.8,label=Hadoop/ws/hbase-server/target/surefire-reports> for the individual test results.
[ERROR] -> [Help 1]
[ERROR] 
[ERROR] To see the full stack trace of the errors, re-run Maven with the -e switch.
[ERROR] Re-run Maven using the -X switch to enable full debug logging.
[ERROR] 
[ERROR] For more information about the errors and possible solutions, please read the following articles:
[ERROR] [Help 1] http://cwiki.apache.org/confluence/display/MAVEN/MojoFailureException
[ERROR] 
[ERROR] After correcting the problems, you can resume the build with the command
[ERROR]   mvn <goals> -rf :hbase-server
Build step 'Invoke top-level Maven targets' marked build as failure
Performing Post build task...
Match found for :.* : True
Logical operation result is TRUE
Running script  : # Post-build task script. TODO: Check this in and have all builds reference check-in.
pwd && ls
# NOTE!!!! The below code has been copied and pasted from ./dev-tools/run-test.sh
# Do not change here without syncing there and vice-versa.
ZOMBIE_TESTS_COUNT=`jps -v | grep surefirebooter | grep -e '-Dhbase.test' | wc -l`
if [[ $ZOMBIE_TESTS_COUNT != 0 ]] ; then
 echo "Suspicious java process found - waiting 30s to see if there are just slow to stop"
 sleep 30
 ZOMBIE_TESTS_COUNT=`jps -v | grep surefirebooter | grep -e '-Dhbase.test' | wc -l`
 if [[ $ZOMBIE_TESTS_COUNT != 0 ]] ; then
   echo " {color:red}There appear to be $ZOMBIE_TESTS_COUNT zombie tests{color}, they should have been killed by surefire but survived"
   jps -v | grep surefirebooter | grep -e '-Dhbase.test'
   jps -v | grep surefirebooter | grep -e '-Dhbase.test' | cut -d ' ' -f 1 | xargs -n 1 jstack
   # Exit with error
   exit 1
 else
   echo "We're ok: there is no zombie test, but some tests took some time to stop"
 fi
else
  echo "We're ok: there is no zombie test"
fi
[Hadoop] $ /bin/bash -xe /tmp/hudson41553995730623731.sh
+ pwd
<https://builds.apache.org/job/HBase-1.2/jdk=latest1.8,label=Hadoop/ws/>
+ ls
bin
CHANGES.txt
conf
dev-support
hbase-annotations
hbase-assembly
hbase-checkstyle
hbase-client
hbase-common
hbase-examples
hbase-external-blockcache
hbase-hadoop2-compat
hbase-hadoop-compat
hbase-it
hbase-native-client
hbase-prefix-tree
hbase-procedure
hbase-protocol
hbase-resource-bundle
hbase-rest
hbase-server
hbase-shaded
hbase-shell
hbase-testing-util
hbase-thrift
LICENSE.txt
NOTICE.txt
pom.xml
README.txt
src
target
++ jps -v
++ grep surefirebooter
++ wc -l
++ grep -e -Dhbase.test
+ ZOMBIE_TESTS_COUNT=0
+ [[ 0 != 0 ]]
+ echo 'We'\''re ok: there is no zombie test'
We're ok: there is no zombie test
POST BUILD TASK : SUCCESS
END OF POST BUILD TASK : 0
Archiving artifacts
Recording test results

Re: Build failed in Jenkins: HBase-1.2 » latest1.8,Hadoop #480

Posted by Stack <st...@duboce.net>.
The below hung:

Hanging test : org.apache.hadoop.hbase.regionserver.TestHRegion

St.Ack

On Tue, Dec 29, 2015 at 9:28 AM, Apache Jenkins Server <
jenkins@builds.apache.org> wrote:

> See <
> https://builds.apache.org/job/HBase-1.2/jdk=latest1.8,label=Hadoop/480/changes
> >
>
> Changes:
>
> [tedyu] HBASE-14867 SimpleRegionNormalizer needs to have better heuristics
> to
>
> ------------------------------------------
> [...truncated 45955 lines...]
> Java HotSpot(TM) 64-Bit Server VM warning: ignoring option
> MaxPermSize=256m; support was removed in 8.0
> Running org.apache.hadoop.hbase.TestInfoServers
> Java HotSpot(TM) 64-Bit Server VM warning: ignoring option
> MaxPermSize=256m; support was removed in 8.0
> Tests run: 3, Failures: 0, Errors: 0, Skipped: 0, Time elapsed: 3.6 sec -
> in org.apache.hadoop.hbase.TestInfoServers
> Java HotSpot(TM) 64-Bit Server VM warning: ignoring option
> MaxPermSize=256m; support was removed in 8.0
> Running org.apache.hadoop.hbase.filter.TestMultiRowRangeFilter
> Running org.apache.hadoop.hbase.filter.TestScanRowPrefix
> Tests run: 1, Failures: 0, Errors: 0, Skipped: 0, Time elapsed: 5.556 sec
> - in org.apache.hadoop.hbase.filter.TestScanRowPrefix
> Java HotSpot(TM) 64-Bit Server VM warning: ignoring option
> MaxPermSize=256m; support was removed in 8.0
> Java HotSpot(TM) 64-Bit Server VM warning: ignoring option
> MaxPermSize=256m; support was removed in 8.0
> Java HotSpot(TM) 64-Bit Server VM warning: ignoring option
> MaxPermSize=256m; support was removed in 8.0
> Java HotSpot(TM) 64-Bit Server VM warning: ignoring option
> MaxPermSize=256m; support was removed in 8.0
> Tests run: 20, Failures: 0, Errors: 0, Skipped: 0, Time elapsed: 22.965
> sec - in org.apache.hadoop.hbase.filter.TestMultiRowRangeFilter
> Running org.apache.hadoop.hbase.filter.TestFilterWrapper
> Java HotSpot(TM) 64-Bit Server VM warning: ignoring option
> MaxPermSize=256m; support was removed in 8.0
> Java HotSpot(TM) 64-Bit Server VM warning: ignoring option
> MaxPermSize=256m; support was removed in 8.0
> Java HotSpot(TM) 64-Bit Server VM warning: ignoring option
> MaxPermSize=256m; support was removed in 8.0
> Java HotSpot(TM) 64-Bit Server VM warning: ignoring option
> MaxPermSize=256m; support was removed in 8.0
> Tests run: 1, Failures: 0, Errors: 0, Skipped: 0, Time elapsed: 4.628 sec
> - in org.apache.hadoop.hbase.filter.TestFilterWrapper
> Java HotSpot(TM) 64-Bit Server VM warning: ignoring option
> MaxPermSize=256m; support was removed in 8.0
> Java HotSpot(TM) 64-Bit Server VM warning: ignoring option
> MaxPermSize=256m; support was removed in 8.0
> Java HotSpot(TM) 64-Bit Server VM warning: ignoring option
> MaxPermSize=256m; support was removed in 8.0
> Running org.apache.hadoop.hbase.filter.TestFuzzyRowFilterEndToEnd
> Tests run: 12, Failures: 0, Errors: 0, Skipped: 1, Time elapsed: 96.137
> sec - in org.apache.hadoop.hbase.namespace.TestNamespaceAuditor
> Java HotSpot(TM) 64-Bit Server VM warning: ignoring option
> MaxPermSize=256m; support was removed in 8.0
> Java HotSpot(TM) 64-Bit Server VM warning: ignoring option
> MaxPermSize=256m; support was removed in 8.0
> Java HotSpot(TM) 64-Bit Server VM warning: ignoring option
> MaxPermSize=256m; support was removed in 8.0
> Running org.apache.hadoop.hbase.filter.TestFuzzyRowAndColumnRangeFilter
> Tests run: 2, Failures: 0, Errors: 0, Skipped: 0, Time elapsed: 62.66 sec
> - in org.apache.hadoop.hbase.TestRegionRebalancing
> Java HotSpot(TM) 64-Bit Server VM warning: ignoring option
> MaxPermSize=256m; support was removed in 8.0
> Tests run: 1, Failures: 0, Errors: 0, Skipped: 0, Time elapsed: 4.758 sec
> - in org.apache.hadoop.hbase.filter.TestFuzzyRowAndColumnRangeFilter
> Java HotSpot(TM) 64-Bit Server VM warning: ignoring option
> MaxPermSize=256m; support was removed in 8.0
> Java HotSpot(TM) 64-Bit Server VM warning: ignoring option
> MaxPermSize=256m; support was removed in 8.0
> Java HotSpot(TM) 64-Bit Server VM warning: ignoring option
> MaxPermSize=256m; support was removed in 8.0
> Java HotSpot(TM) 64-Bit Server VM warning: ignoring option
> MaxPermSize=256m; support was removed in 8.0
> Java HotSpot(TM) 64-Bit Server VM warning: ignoring option
> MaxPermSize=256m; support was removed in 8.0
> Java HotSpot(TM) 64-Bit Server VM warning: ignoring option
> MaxPermSize=256m; support was removed in 8.0
> Java HotSpot(TM) 64-Bit Server VM warning: ignoring option
> MaxPermSize=256m; support was removed in 8.0
> Java HotSpot(TM) 64-Bit Server VM warning: ignoring option
> MaxPermSize=256m; support was removed in 8.0
> Java HotSpot(TM) 64-Bit Server VM warning: ignoring option
> MaxPermSize=256m; support was removed in 8.0
> Java HotSpot(TM) 64-Bit Server VM warning: ignoring option
> MaxPermSize=256m; support was removed in 8.0
> Running org.apache.hadoop.hbase.filter.TestColumnRangeFilter
> Running org.apache.hadoop.hbase.io.TestFileLink
> Running org.apache.hadoop.hbase.filter.TestFilterWithScanLimits
> Tests run: 1, Failures: 0, Errors: 0, Skipped: 0, Time elapsed: 8.094 sec
> - in org.apache.hadoop.hbase.filter.TestColumnRangeFilter
> Java HotSpot(TM) 64-Bit Server VM warning: ignoring option
> MaxPermSize=256m; support was removed in 8.0
> Tests run: 1, Failures: 0, Errors: 0, Skipped: 0, Time elapsed: 3.961 sec
> - in org.apache.hadoop.hbase.filter.TestFilterWithScanLimits
> Java HotSpot(TM) 64-Bit Server VM warning: ignoring option
> MaxPermSize=256m; support was removed in 8.0
> Java HotSpot(TM) 64-Bit Server VM warning: ignoring option
> MaxPermSize=256m; support was removed in 8.0
> Running org.apache.hadoop.hbase.io.hfile.TestScannerSelectionUsingTTL
> Running org.apache.hadoop.hbase.io.hfile.TestCacheConfig
> Tests run: 6, Failures: 0, Errors: 0, Skipped: 0, Time elapsed: 2.396 sec
> - in org.apache.hadoop.hbase.io.hfile.TestCacheConfig
> Java HotSpot(TM) 64-Bit Server VM warning: ignoring option
> MaxPermSize=256m; support was removed in 8.0
> Running org.apache.hadoop.hbase.io.hfile.TestHFileSeek
> Tests run: 1, Failures: 0, Errors: 0, Skipped: 0, Time elapsed: 1.982 sec
> - in org.apache.hadoop.hbase.io.hfile.TestHFileSeek
> Java HotSpot(TM) 64-Bit Server VM warning: ignoring option
> MaxPermSize=256m; support was removed in 8.0
> Tests run: 5, Failures: 0, Errors: 0, Skipped: 0, Time elapsed: 16.424 sec
> - in org.apache.hadoop.hbase.io.TestFileLink
> Java HotSpot(TM) 64-Bit Server VM warning: ignoring option
> MaxPermSize=256m; support was removed in 8.0
> Running org.apache.hadoop.hbase.io.hfile.TestSeekBeforeWithInlineBlocks
> Java HotSpot(TM) 64-Bit Server VM warning: ignoring option
> MaxPermSize=256m; support was removed in 8.0
> Running org.apache.hadoop.hbase.io.hfile.TestForceCacheImportantBlocks
> Tests run: 1, Failures: 0, Errors: 0, Skipped: 0, Time elapsed: 14.122 sec
> - in org.apache.hadoop.hbase.io.hfile.TestSeekBeforeWithInlineBlocks
> Java HotSpot(TM) 64-Bit Server VM warning: ignoring option
> MaxPermSize=256m; support was removed in 8.0
> Java HotSpot(TM) 64-Bit Server VM warning: ignoring option
> MaxPermSize=256m; support was removed in 8.0
> Running org.apache.hadoop.hbase.io.hfile.TestCacheOnWrite
> Tests run: 4, Failures: 0, Errors: 0, Skipped: 0, Time elapsed: 40.521 sec
> - in org.apache.hadoop.hbase.io.hfile.TestForceCacheImportantBlocks
> Java HotSpot(TM) 64-Bit Server VM warning: ignoring option
> MaxPermSize=256m; support was removed in 8.0
> Java HotSpot(TM) 64-Bit Server VM warning: ignoring option
> MaxPermSize=256m; support was removed in 8.0
> Java HotSpot(TM) 64-Bit Server VM warning: ignoring option
> MaxPermSize=256m; support was removed in 8.0
> Java HotSpot(TM) 64-Bit Server VM warning: ignoring option
> MaxPermSize=256m; support was removed in 8.0
> Java HotSpot(TM) 64-Bit Server VM warning: ignoring option
> MaxPermSize=256m; support was removed in 8.0
> Running org.apache.hadoop.hbase.io.hfile.TestHFileBlock
> Tests run: 6, Failures: 0, Errors: 0, Skipped: 0, Time elapsed: 64.213 sec
> - in org.apache.hadoop.hbase.io.hfile.TestScannerSelectionUsingTTL
> Java HotSpot(TM) 64-Bit Server VM warning: ignoring option
> MaxPermSize=256m; support was removed in 8.0
> Java HotSpot(TM) 64-Bit Server VM warning: ignoring option
> MaxPermSize=256m; support was removed in 8.0
> Java HotSpot(TM) 64-Bit Server VM warning: ignoring option
> MaxPermSize=256m; support was removed in 8.0
> Java HotSpot(TM) 64-Bit Server VM warning: ignoring option
> MaxPermSize=256m; support was removed in 8.0
> Java HotSpot(TM) 64-Bit Server VM warning: ignoring option
> MaxPermSize=256m; support was removed in 8.0
> Java HotSpot(TM) 64-Bit Server VM warning: ignoring option
> MaxPermSize=256m; support was removed in 8.0
> Java HotSpot(TM) 64-Bit Server VM warning: ignoring option
> MaxPermSize=256m; support was removed in 8.0
> Java HotSpot(TM) 64-Bit Server VM warning: ignoring option
> MaxPermSize=256m; support was removed in 8.0
> Java HotSpot(TM) 64-Bit Server VM warning: ignoring option
> MaxPermSize=256m; support was removed in 8.0
> Java HotSpot(TM) 64-Bit Server VM warning: ignoring option
> MaxPermSize=256m; support was removed in 8.0
> Java HotSpot(TM) 64-Bit Server VM warning: ignoring option
> MaxPermSize=256m; support was removed in 8.0
> Running org.apache.hadoop.hbase.io.hfile.TestHFileBlockIndex
> Tests run: 10, Failures: 0, Errors: 0, Skipped: 0, Time elapsed: 12.946
> sec - in org.apache.hadoop.hbase.io.hfile.TestHFileBlockIndex
> Java HotSpot(TM) 64-Bit Server VM warning: ignoring option
> MaxPermSize=256m; support was removed in 8.0
> Java HotSpot(TM) 64-Bit Server VM warning: ignoring option
> MaxPermSize=256m; support was removed in 8.0
> Java HotSpot(TM) 64-Bit Server VM warning: ignoring option
> MaxPermSize=256m; support was removed in 8.0
> Java HotSpot(TM) 64-Bit Server VM warning: ignoring option
> MaxPermSize=256m; support was removed in 8.0
> Java HotSpot(TM) 64-Bit Server VM warning: ignoring option
> MaxPermSize=256m; support was removed in 8.0
> Java HotSpot(TM) 64-Bit Server VM warning: ignoring option
> MaxPermSize=256m; support was removed in 8.0
> Java HotSpot(TM) 64-Bit Server VM warning: ignoring option
> MaxPermSize=256m; support was removed in 8.0
> Java HotSpot(TM) 64-Bit Server VM warning: ignoring option
> MaxPermSize=256m; support was removed in 8.0
> Java HotSpot(TM) 64-Bit Server VM warning: ignoring option
> MaxPermSize=256m; support was removed in 8.0
> Java HotSpot(TM) 64-Bit Server VM warning: ignoring option
> MaxPermSize=256m; support was removed in 8.0
> Running org.apache.hadoop.hbase.io.encoding.TestLoadAndSwitchEncodeOnDisk
> Tests run: 1, Failures: 0, Errors: 0, Skipped: 0, Time elapsed: 32.578 sec
> - in org.apache.hadoop.hbase.io.encoding.TestLoadAndSwitchEncodeOnDisk
> Java HotSpot(TM) 64-Bit Server VM warning: ignoring option
> MaxPermSize=256m; support was removed in 8.0
> Tests run: 51, Failures: 0, Errors: 0, Skipped: 1, Time elapsed: 345.974
> sec - in org.apache.hadoop.hbase.util.TestHBaseFsck
> Java HotSpot(TM) 64-Bit Server VM warning: ignoring option
> MaxPermSize=256m; support was removed in 8.0
> Java HotSpot(TM) 64-Bit Server VM warning: ignoring option
> MaxPermSize=256m; support was removed in 8.0
> Java HotSpot(TM) 64-Bit Server VM warning: ignoring option
> MaxPermSize=256m; support was removed in 8.0
> Running org.apache.hadoop.hbase.io.encoding.TestBufferedDataBlockEncoder
> Running org.apache.hadoop.hbase.io.encoding.TestEncodedSeekers
> Tests run: 28, Failures: 0, Errors: 0, Skipped: 0, Time elapsed: 93.973
> sec - in org.apache.hadoop.hbase.io.hfile.TestHFileBlock
> Java HotSpot(TM) 64-Bit Server VM warning: ignoring option
> MaxPermSize=256m; support was removed in 8.0
> Running org.apache.hadoop.hbase.io.encoding.TestDataBlockEncoders
> Tests run: 1, Failures: 0, Errors: 0, Skipped: 0, Time elapsed: 19.489 sec
> - in org.apache.hadoop.hbase.io.encoding.TestBufferedDataBlockEncoder
> Java HotSpot(TM) 64-Bit Server VM warning: ignoring option
> MaxPermSize=256m; support was removed in 8.0
> Java HotSpot(TM) 64-Bit Server VM warning: ignoring option
> MaxPermSize=256m; support was removed in 8.0
> Running org.apache.hadoop.hbase.io.encoding.TestChangingEncoding
> Tests run: 72, Failures: 0, Errors: 0, Skipped: 0, Time elapsed: 161.222
> sec - in org.apache.hadoop.hbase.io.hfile.TestCacheOnWrite
> Java HotSpot(TM) 64-Bit Server VM warning: ignoring option
> MaxPermSize=256m; support was removed in 8.0
> Java HotSpot(TM) 64-Bit Server VM warning: ignoring option
> MaxPermSize=256m; support was removed in 8.0
> Java HotSpot(TM) 64-Bit Server VM warning: ignoring option
> MaxPermSize=256m; support was removed in 8.0
> Java HotSpot(TM) 64-Bit Server VM warning: ignoring option
> MaxPermSize=256m; support was removed in 8.0
> Running org.apache.hadoop.hbase.TestClusterBootOrder
> Tests run: 3, Failures: 0, Errors: 0, Skipped: 0, Time elapsed: 222.204
> sec - in org.apache.hadoop.hbase.filter.TestFuzzyRowFilterEndToEnd
> Tests run: 28, Failures: 0, Errors: 0, Skipped: 0, Time elapsed: 51.794
> sec - in org.apache.hadoop.hbase.io.encoding.TestDataBlockEncoders
> Tests run: 2, Failures: 0, Errors: 0, Skipped: 0, Time elapsed: 29.604 sec
> - in org.apache.hadoop.hbase.TestClusterBootOrder
> Tests run: 20, Failures: 0, Errors: 0, Skipped: 0, Time elapsed: 136.539
> sec - in org.apache.hadoop.hbase.io.encoding.TestEncodedSeekers
> Tests run: 3, Failures: 0, Errors: 0, Skipped: 0, Time elapsed: 143.502
> sec - in org.apache.hadoop.hbase.io.encoding.TestChangingEncoding
>
> Results :
>
> Flaked tests:
>
> org.apache.hadoop.hbase.regionserver.TestSplitWalDataLoss.test(org.apache.hadoop.hbase.regionserver.TestSplitWalDataLoss)
>   Run 1: TestSplitWalDataLoss.test:124 » RetriesExhaustedWithDetails
> Failed 1 action: T...
>   Run 2: PASS
>
>
> Tests run: 2275, Failures: 0, Errors: 0, Skipped: 40, Flakes: 1
>
> [INFO]
> ------------------------------------------------------------------------
> [INFO] Reactor Summary:
> [INFO]
> [INFO] Apache HBase ...................................... SUCCESS
> [1:03.053s]
> [INFO] Apache HBase - Checkstyle ......................... SUCCESS [5.679s]
> [INFO] Apache HBase - Resource Bundle .................... SUCCESS [0.253s]
> [INFO] Apache HBase - Annotations ........................ SUCCESS [1.389s]
> [INFO] Apache HBase - Protocol ........................... SUCCESS
> [19.326s]
> [INFO] Apache HBase - Common ............................. SUCCESS
> [2:49.829s]
> [INFO] Apache HBase - Procedure .......................... SUCCESS
> [3:27.752s]
> [INFO] Apache HBase - Client ............................. SUCCESS
> [1:27.884s]
> [INFO] Apache HBase - Hadoop Compatibility ............... SUCCESS [8.333s]
> [INFO] Apache HBase - Hadoop Two Compatibility ........... SUCCESS [8.804s]
> [INFO] Apache HBase - Prefix Tree ........................ SUCCESS [9.225s]
> [INFO] Apache HBase - Server ............................. FAILURE
> [1:21:18.695s]
> [INFO] Apache HBase - Testing Util ....................... SKIPPED
> [INFO] Apache HBase - Thrift ............................. SKIPPED
> [INFO] Apache HBase - Rest ............................... SKIPPED
> [INFO] Apache HBase - Shell .............................. SKIPPED
> [INFO] Apache HBase - Integration Tests .................. SKIPPED
> [INFO] Apache HBase - Examples ........................... SKIPPED
> [INFO] Apache HBase - External Block Cache ............... SKIPPED
> [INFO] Apache HBase - Assembly ........................... SKIPPED
> [INFO] Apache HBase - Shaded ............................. SKIPPED
> [INFO] Apache HBase - Shaded - Client .................... SKIPPED
> [INFO] Apache HBase - Shaded - Server .................... SKIPPED
> [INFO]
> ------------------------------------------------------------------------
> [INFO] BUILD FAILURE
> [INFO]
> ------------------------------------------------------------------------
> [INFO] Total time: 1:31:19.256s
> [INFO] Finished at: Tue Dec 29 17:22:10 UTC 2015
> [INFO] Final Memory: 434M/666M
> [INFO]
> ------------------------------------------------------------------------
> [ERROR] Failed to execute goal
> org.apache.maven.plugins:maven-surefire-plugin:2.18.1:test
> (secondPartTestsExecution) on project hbase-server: There was a timeout or
> other error in the fork -> [Help 1]
> [ERROR]
> [ERROR] To see the full stack trace of the errors, re-run Maven with the
> -e switch.
> [ERROR] Re-run Maven using the -X switch to enable full debug logging.
> [ERROR]
> [ERROR] For more information about the errors and possible solutions,
> please read the following articles:
> [ERROR] [Help 1]
> http://cwiki.apache.org/confluence/display/MAVEN/MojoFailureException
> [ERROR]
> [ERROR] After correcting the problems, you can resume the build with the
> command
> [ERROR]   mvn <goals> -rf :hbase-server
> Build step 'Invoke top-level Maven targets' marked build as failure
> Performing Post build task...
> Match found for :.* : True
> Logical operation result is TRUE
> Running script  : # Post-build task script. TODO: Check this in and have
> all builds reference check-in.
> pwd && ls
> # NOTE!!!! The below code has been copied and pasted from
> ./dev-tools/run-test.sh
> # Do not change here without syncing there and vice-versa.
> ZOMBIE_TESTS_COUNT=`jps -v | grep surefirebooter | grep -e '-Dhbase.test'
> | wc -l`
> if [[ $ZOMBIE_TESTS_COUNT != 0 ]] ; then
>  echo "Suspicious java process found - waiting 30s to see if there are
> just slow to stop"
>  sleep 30
>  ZOMBIE_TESTS_COUNT=`jps -v | grep surefirebooter | grep -e '-Dhbase.test'
> | wc -l`
>  if [[ $ZOMBIE_TESTS_COUNT != 0 ]] ; then
>    echo " {color:red}There appear to be $ZOMBIE_TESTS_COUNT zombie
> tests{color}, they should have been killed by surefire but survived"
>    jps -v | grep surefirebooter | grep -e '-Dhbase.test'
>    jps -v | grep surefirebooter | grep -e '-Dhbase.test' | cut -d ' ' -f 1
> | xargs -n 1 jstack
>    # Exit with error
>    exit 1
>  else
>    echo "We're ok: there is no zombie test, but some tests took some time
> to stop"
>  fi
> else
>   echo "We're ok: there is no zombie test"
> fi
> [Hadoop] $ /bin/bash -xe /tmp/hudson6281252859512781066.sh
> + pwd
> <https://builds.apache.org/job/HBase-1.2/jdk=latest1.8,label=Hadoop/ws/>
> + ls
> bin
> CHANGES.txt
> conf
> dev-support
> hbase-annotations
> hbase-assembly
> hbase-checkstyle
> hbase-client
> hbase-common
> hbase-examples
> hbase-external-blockcache
> hbase-hadoop2-compat
> hbase-hadoop-compat
> hbase-it
> hbase-native-client
> hbase-prefix-tree
> hbase-procedure
> hbase-protocol
> hbase-resource-bundle
> hbase-rest
> hbase-server
> hbase-shaded
> hbase-shell
> hbase-testing-util
> hbase-thrift
> LICENSE.txt
> NOTICE.txt
> pom.xml
> README.txt
> src
> target
> ++ jps -v
> ++ grep surefirebooter
> ++ grep -e -Dhbase.test
> ++ wc -l
> + ZOMBIE_TESTS_COUNT=0
> + [[ 0 != 0 ]]
> + echo 'We'\''re ok: there is no zombie test'
> We're ok: there is no zombie test
> POST BUILD TASK : SUCCESS
> END OF POST BUILD TASK : 0
> Archiving artifacts
> Recording test results
>

Re: Build failed in Jenkins: HBase-1.2 » latest1.8,Hadoop #480

Posted by Stack <st...@duboce.net>.
The below hung:

Hanging test : org.apache.hadoop.hbase.regionserver.TestHRegion

St.Ack

On Tue, Dec 29, 2015 at 9:28 AM, Apache Jenkins Server <
jenkins@builds.apache.org> wrote:

> See <
> https://builds.apache.org/job/HBase-1.2/jdk=latest1.8,label=Hadoop/480/changes
> >
>
> Changes:
>
> [tedyu] HBASE-14867 SimpleRegionNormalizer needs to have better heuristics
> to
>
> ------------------------------------------
> [...truncated 45955 lines...]
> Java HotSpot(TM) 64-Bit Server VM warning: ignoring option
> MaxPermSize=256m; support was removed in 8.0
> Running org.apache.hadoop.hbase.TestInfoServers
> Java HotSpot(TM) 64-Bit Server VM warning: ignoring option
> MaxPermSize=256m; support was removed in 8.0
> Tests run: 3, Failures: 0, Errors: 0, Skipped: 0, Time elapsed: 3.6 sec -
> in org.apache.hadoop.hbase.TestInfoServers
> Java HotSpot(TM) 64-Bit Server VM warning: ignoring option
> MaxPermSize=256m; support was removed in 8.0
> Running org.apache.hadoop.hbase.filter.TestMultiRowRangeFilter
> Running org.apache.hadoop.hbase.filter.TestScanRowPrefix
> Tests run: 1, Failures: 0, Errors: 0, Skipped: 0, Time elapsed: 5.556 sec
> - in org.apache.hadoop.hbase.filter.TestScanRowPrefix
> Java HotSpot(TM) 64-Bit Server VM warning: ignoring option
> MaxPermSize=256m; support was removed in 8.0
> Java HotSpot(TM) 64-Bit Server VM warning: ignoring option
> MaxPermSize=256m; support was removed in 8.0
> Java HotSpot(TM) 64-Bit Server VM warning: ignoring option
> MaxPermSize=256m; support was removed in 8.0
> Java HotSpot(TM) 64-Bit Server VM warning: ignoring option
> MaxPermSize=256m; support was removed in 8.0
> Tests run: 20, Failures: 0, Errors: 0, Skipped: 0, Time elapsed: 22.965
> sec - in org.apache.hadoop.hbase.filter.TestMultiRowRangeFilter
> Running org.apache.hadoop.hbase.filter.TestFilterWrapper
> Java HotSpot(TM) 64-Bit Server VM warning: ignoring option
> MaxPermSize=256m; support was removed in 8.0
> Java HotSpot(TM) 64-Bit Server VM warning: ignoring option
> MaxPermSize=256m; support was removed in 8.0
> Java HotSpot(TM) 64-Bit Server VM warning: ignoring option
> MaxPermSize=256m; support was removed in 8.0
> Java HotSpot(TM) 64-Bit Server VM warning: ignoring option
> MaxPermSize=256m; support was removed in 8.0
> Tests run: 1, Failures: 0, Errors: 0, Skipped: 0, Time elapsed: 4.628 sec
> - in org.apache.hadoop.hbase.filter.TestFilterWrapper
> Java HotSpot(TM) 64-Bit Server VM warning: ignoring option
> MaxPermSize=256m; support was removed in 8.0
> Java HotSpot(TM) 64-Bit Server VM warning: ignoring option
> MaxPermSize=256m; support was removed in 8.0
> Java HotSpot(TM) 64-Bit Server VM warning: ignoring option
> MaxPermSize=256m; support was removed in 8.0
> Running org.apache.hadoop.hbase.filter.TestFuzzyRowFilterEndToEnd
> Tests run: 12, Failures: 0, Errors: 0, Skipped: 1, Time elapsed: 96.137
> sec - in org.apache.hadoop.hbase.namespace.TestNamespaceAuditor
> Java HotSpot(TM) 64-Bit Server VM warning: ignoring option
> MaxPermSize=256m; support was removed in 8.0
> Java HotSpot(TM) 64-Bit Server VM warning: ignoring option
> MaxPermSize=256m; support was removed in 8.0
> Java HotSpot(TM) 64-Bit Server VM warning: ignoring option
> MaxPermSize=256m; support was removed in 8.0
> Running org.apache.hadoop.hbase.filter.TestFuzzyRowAndColumnRangeFilter
> Tests run: 2, Failures: 0, Errors: 0, Skipped: 0, Time elapsed: 62.66 sec
> - in org.apache.hadoop.hbase.TestRegionRebalancing
> Java HotSpot(TM) 64-Bit Server VM warning: ignoring option
> MaxPermSize=256m; support was removed in 8.0
> Tests run: 1, Failures: 0, Errors: 0, Skipped: 0, Time elapsed: 4.758 sec
> - in org.apache.hadoop.hbase.filter.TestFuzzyRowAndColumnRangeFilter
> Java HotSpot(TM) 64-Bit Server VM warning: ignoring option
> MaxPermSize=256m; support was removed in 8.0
> Java HotSpot(TM) 64-Bit Server VM warning: ignoring option
> MaxPermSize=256m; support was removed in 8.0
> Java HotSpot(TM) 64-Bit Server VM warning: ignoring option
> MaxPermSize=256m; support was removed in 8.0
> Java HotSpot(TM) 64-Bit Server VM warning: ignoring option
> MaxPermSize=256m; support was removed in 8.0
> Java HotSpot(TM) 64-Bit Server VM warning: ignoring option
> MaxPermSize=256m; support was removed in 8.0
> Java HotSpot(TM) 64-Bit Server VM warning: ignoring option
> MaxPermSize=256m; support was removed in 8.0
> Java HotSpot(TM) 64-Bit Server VM warning: ignoring option
> MaxPermSize=256m; support was removed in 8.0
> Java HotSpot(TM) 64-Bit Server VM warning: ignoring option
> MaxPermSize=256m; support was removed in 8.0
> Java HotSpot(TM) 64-Bit Server VM warning: ignoring option
> MaxPermSize=256m; support was removed in 8.0
> Java HotSpot(TM) 64-Bit Server VM warning: ignoring option
> MaxPermSize=256m; support was removed in 8.0
> Running org.apache.hadoop.hbase.filter.TestColumnRangeFilter
> Running org.apache.hadoop.hbase.io.TestFileLink
> Running org.apache.hadoop.hbase.filter.TestFilterWithScanLimits
> Tests run: 1, Failures: 0, Errors: 0, Skipped: 0, Time elapsed: 8.094 sec
> - in org.apache.hadoop.hbase.filter.TestColumnRangeFilter
> Java HotSpot(TM) 64-Bit Server VM warning: ignoring option
> MaxPermSize=256m; support was removed in 8.0
> Tests run: 1, Failures: 0, Errors: 0, Skipped: 0, Time elapsed: 3.961 sec
> - in org.apache.hadoop.hbase.filter.TestFilterWithScanLimits
> Java HotSpot(TM) 64-Bit Server VM warning: ignoring option
> MaxPermSize=256m; support was removed in 8.0
> Java HotSpot(TM) 64-Bit Server VM warning: ignoring option
> MaxPermSize=256m; support was removed in 8.0
> Running org.apache.hadoop.hbase.io.hfile.TestScannerSelectionUsingTTL
> Running org.apache.hadoop.hbase.io.hfile.TestCacheConfig
> Tests run: 6, Failures: 0, Errors: 0, Skipped: 0, Time elapsed: 2.396 sec
> - in org.apache.hadoop.hbase.io.hfile.TestCacheConfig
> Java HotSpot(TM) 64-Bit Server VM warning: ignoring option
> MaxPermSize=256m; support was removed in 8.0
> Running org.apache.hadoop.hbase.io.hfile.TestHFileSeek
> Tests run: 1, Failures: 0, Errors: 0, Skipped: 0, Time elapsed: 1.982 sec
> - in org.apache.hadoop.hbase.io.hfile.TestHFileSeek
> Java HotSpot(TM) 64-Bit Server VM warning: ignoring option
> MaxPermSize=256m; support was removed in 8.0
> Tests run: 5, Failures: 0, Errors: 0, Skipped: 0, Time elapsed: 16.424 sec
> - in org.apache.hadoop.hbase.io.TestFileLink
> Java HotSpot(TM) 64-Bit Server VM warning: ignoring option
> MaxPermSize=256m; support was removed in 8.0
> Running org.apache.hadoop.hbase.io.hfile.TestSeekBeforeWithInlineBlocks
> Java HotSpot(TM) 64-Bit Server VM warning: ignoring option
> MaxPermSize=256m; support was removed in 8.0
> Running org.apache.hadoop.hbase.io.hfile.TestForceCacheImportantBlocks
> Tests run: 1, Failures: 0, Errors: 0, Skipped: 0, Time elapsed: 14.122 sec
> - in org.apache.hadoop.hbase.io.hfile.TestSeekBeforeWithInlineBlocks
> Java HotSpot(TM) 64-Bit Server VM warning: ignoring option
> MaxPermSize=256m; support was removed in 8.0
> Java HotSpot(TM) 64-Bit Server VM warning: ignoring option
> MaxPermSize=256m; support was removed in 8.0
> Running org.apache.hadoop.hbase.io.hfile.TestCacheOnWrite
> Tests run: 4, Failures: 0, Errors: 0, Skipped: 0, Time elapsed: 40.521 sec
> - in org.apache.hadoop.hbase.io.hfile.TestForceCacheImportantBlocks
> Java HotSpot(TM) 64-Bit Server VM warning: ignoring option
> MaxPermSize=256m; support was removed in 8.0
> Java HotSpot(TM) 64-Bit Server VM warning: ignoring option
> MaxPermSize=256m; support was removed in 8.0
> Java HotSpot(TM) 64-Bit Server VM warning: ignoring option
> MaxPermSize=256m; support was removed in 8.0
> Java HotSpot(TM) 64-Bit Server VM warning: ignoring option
> MaxPermSize=256m; support was removed in 8.0
> Java HotSpot(TM) 64-Bit Server VM warning: ignoring option
> MaxPermSize=256m; support was removed in 8.0
> Running org.apache.hadoop.hbase.io.hfile.TestHFileBlock
> Tests run: 6, Failures: 0, Errors: 0, Skipped: 0, Time elapsed: 64.213 sec
> - in org.apache.hadoop.hbase.io.hfile.TestScannerSelectionUsingTTL
> Java HotSpot(TM) 64-Bit Server VM warning: ignoring option
> MaxPermSize=256m; support was removed in 8.0
> Java HotSpot(TM) 64-Bit Server VM warning: ignoring option
> MaxPermSize=256m; support was removed in 8.0
> Java HotSpot(TM) 64-Bit Server VM warning: ignoring option
> MaxPermSize=256m; support was removed in 8.0
> Java HotSpot(TM) 64-Bit Server VM warning: ignoring option
> MaxPermSize=256m; support was removed in 8.0
> Java HotSpot(TM) 64-Bit Server VM warning: ignoring option
> MaxPermSize=256m; support was removed in 8.0
> Java HotSpot(TM) 64-Bit Server VM warning: ignoring option
> MaxPermSize=256m; support was removed in 8.0
> Java HotSpot(TM) 64-Bit Server VM warning: ignoring option
> MaxPermSize=256m; support was removed in 8.0
> Java HotSpot(TM) 64-Bit Server VM warning: ignoring option
> MaxPermSize=256m; support was removed in 8.0
> Java HotSpot(TM) 64-Bit Server VM warning: ignoring option
> MaxPermSize=256m; support was removed in 8.0
> Java HotSpot(TM) 64-Bit Server VM warning: ignoring option
> MaxPermSize=256m; support was removed in 8.0
> Java HotSpot(TM) 64-Bit Server VM warning: ignoring option
> MaxPermSize=256m; support was removed in 8.0
> Running org.apache.hadoop.hbase.io.hfile.TestHFileBlockIndex
> Tests run: 10, Failures: 0, Errors: 0, Skipped: 0, Time elapsed: 12.946
> sec - in org.apache.hadoop.hbase.io.hfile.TestHFileBlockIndex
> Java HotSpot(TM) 64-Bit Server VM warning: ignoring option
> MaxPermSize=256m; support was removed in 8.0
> Java HotSpot(TM) 64-Bit Server VM warning: ignoring option
> MaxPermSize=256m; support was removed in 8.0
> Java HotSpot(TM) 64-Bit Server VM warning: ignoring option
> MaxPermSize=256m; support was removed in 8.0
> Java HotSpot(TM) 64-Bit Server VM warning: ignoring option
> MaxPermSize=256m; support was removed in 8.0
> Java HotSpot(TM) 64-Bit Server VM warning: ignoring option
> MaxPermSize=256m; support was removed in 8.0
> Java HotSpot(TM) 64-Bit Server VM warning: ignoring option
> MaxPermSize=256m; support was removed in 8.0
> Java HotSpot(TM) 64-Bit Server VM warning: ignoring option
> MaxPermSize=256m; support was removed in 8.0
> Java HotSpot(TM) 64-Bit Server VM warning: ignoring option
> MaxPermSize=256m; support was removed in 8.0
> Java HotSpot(TM) 64-Bit Server VM warning: ignoring option
> MaxPermSize=256m; support was removed in 8.0
> Java HotSpot(TM) 64-Bit Server VM warning: ignoring option
> MaxPermSize=256m; support was removed in 8.0
> Running org.apache.hadoop.hbase.io.encoding.TestLoadAndSwitchEncodeOnDisk
> Tests run: 1, Failures: 0, Errors: 0, Skipped: 0, Time elapsed: 32.578 sec
> - in org.apache.hadoop.hbase.io.encoding.TestLoadAndSwitchEncodeOnDisk
> Java HotSpot(TM) 64-Bit Server VM warning: ignoring option
> MaxPermSize=256m; support was removed in 8.0
> Tests run: 51, Failures: 0, Errors: 0, Skipped: 1, Time elapsed: 345.974
> sec - in org.apache.hadoop.hbase.util.TestHBaseFsck
> Java HotSpot(TM) 64-Bit Server VM warning: ignoring option
> MaxPermSize=256m; support was removed in 8.0
> Java HotSpot(TM) 64-Bit Server VM warning: ignoring option
> MaxPermSize=256m; support was removed in 8.0
> Java HotSpot(TM) 64-Bit Server VM warning: ignoring option
> MaxPermSize=256m; support was removed in 8.0
> Running org.apache.hadoop.hbase.io.encoding.TestBufferedDataBlockEncoder
> Running org.apache.hadoop.hbase.io.encoding.TestEncodedSeekers
> Tests run: 28, Failures: 0, Errors: 0, Skipped: 0, Time elapsed: 93.973
> sec - in org.apache.hadoop.hbase.io.hfile.TestHFileBlock
> Java HotSpot(TM) 64-Bit Server VM warning: ignoring option
> MaxPermSize=256m; support was removed in 8.0
> Running org.apache.hadoop.hbase.io.encoding.TestDataBlockEncoders
> Tests run: 1, Failures: 0, Errors: 0, Skipped: 0, Time elapsed: 19.489 sec
> - in org.apache.hadoop.hbase.io.encoding.TestBufferedDataBlockEncoder
> Java HotSpot(TM) 64-Bit Server VM warning: ignoring option
> MaxPermSize=256m; support was removed in 8.0
> Java HotSpot(TM) 64-Bit Server VM warning: ignoring option
> MaxPermSize=256m; support was removed in 8.0
> Running org.apache.hadoop.hbase.io.encoding.TestChangingEncoding
> Tests run: 72, Failures: 0, Errors: 0, Skipped: 0, Time elapsed: 161.222
> sec - in org.apache.hadoop.hbase.io.hfile.TestCacheOnWrite
> Java HotSpot(TM) 64-Bit Server VM warning: ignoring option
> MaxPermSize=256m; support was removed in 8.0
> Java HotSpot(TM) 64-Bit Server VM warning: ignoring option
> MaxPermSize=256m; support was removed in 8.0
> Java HotSpot(TM) 64-Bit Server VM warning: ignoring option
> MaxPermSize=256m; support was removed in 8.0
> Java HotSpot(TM) 64-Bit Server VM warning: ignoring option
> MaxPermSize=256m; support was removed in 8.0
> Running org.apache.hadoop.hbase.TestClusterBootOrder
> Tests run: 3, Failures: 0, Errors: 0, Skipped: 0, Time elapsed: 222.204
> sec - in org.apache.hadoop.hbase.filter.TestFuzzyRowFilterEndToEnd
> Tests run: 28, Failures: 0, Errors: 0, Skipped: 0, Time elapsed: 51.794
> sec - in org.apache.hadoop.hbase.io.encoding.TestDataBlockEncoders
> Tests run: 2, Failures: 0, Errors: 0, Skipped: 0, Time elapsed: 29.604 sec
> - in org.apache.hadoop.hbase.TestClusterBootOrder
> Tests run: 20, Failures: 0, Errors: 0, Skipped: 0, Time elapsed: 136.539
> sec - in org.apache.hadoop.hbase.io.encoding.TestEncodedSeekers
> Tests run: 3, Failures: 0, Errors: 0, Skipped: 0, Time elapsed: 143.502
> sec - in org.apache.hadoop.hbase.io.encoding.TestChangingEncoding
>
> Results :
>
> Flaked tests:
>
> org.apache.hadoop.hbase.regionserver.TestSplitWalDataLoss.test(org.apache.hadoop.hbase.regionserver.TestSplitWalDataLoss)
>   Run 1: TestSplitWalDataLoss.test:124 » RetriesExhaustedWithDetails
> Failed 1 action: T...
>   Run 2: PASS
>
>
> Tests run: 2275, Failures: 0, Errors: 0, Skipped: 40, Flakes: 1
>
> [INFO]
> ------------------------------------------------------------------------
> [INFO] Reactor Summary:
> [INFO]
> [INFO] Apache HBase ...................................... SUCCESS
> [1:03.053s]
> [INFO] Apache HBase - Checkstyle ......................... SUCCESS [5.679s]
> [INFO] Apache HBase - Resource Bundle .................... SUCCESS [0.253s]
> [INFO] Apache HBase - Annotations ........................ SUCCESS [1.389s]
> [INFO] Apache HBase - Protocol ........................... SUCCESS
> [19.326s]
> [INFO] Apache HBase - Common ............................. SUCCESS
> [2:49.829s]
> [INFO] Apache HBase - Procedure .......................... SUCCESS
> [3:27.752s]
> [INFO] Apache HBase - Client ............................. SUCCESS
> [1:27.884s]
> [INFO] Apache HBase - Hadoop Compatibility ............... SUCCESS [8.333s]
> [INFO] Apache HBase - Hadoop Two Compatibility ........... SUCCESS [8.804s]
> [INFO] Apache HBase - Prefix Tree ........................ SUCCESS [9.225s]
> [INFO] Apache HBase - Server ............................. FAILURE
> [1:21:18.695s]
> [INFO] Apache HBase - Testing Util ....................... SKIPPED
> [INFO] Apache HBase - Thrift ............................. SKIPPED
> [INFO] Apache HBase - Rest ............................... SKIPPED
> [INFO] Apache HBase - Shell .............................. SKIPPED
> [INFO] Apache HBase - Integration Tests .................. SKIPPED
> [INFO] Apache HBase - Examples ........................... SKIPPED
> [INFO] Apache HBase - External Block Cache ............... SKIPPED
> [INFO] Apache HBase - Assembly ........................... SKIPPED
> [INFO] Apache HBase - Shaded ............................. SKIPPED
> [INFO] Apache HBase - Shaded - Client .................... SKIPPED
> [INFO] Apache HBase - Shaded - Server .................... SKIPPED
> [INFO]
> ------------------------------------------------------------------------
> [INFO] BUILD FAILURE
> [INFO]
> ------------------------------------------------------------------------
> [INFO] Total time: 1:31:19.256s
> [INFO] Finished at: Tue Dec 29 17:22:10 UTC 2015
> [INFO] Final Memory: 434M/666M
> [INFO]
> ------------------------------------------------------------------------
> [ERROR] Failed to execute goal
> org.apache.maven.plugins:maven-surefire-plugin:2.18.1:test
> (secondPartTestsExecution) on project hbase-server: There was a timeout or
> other error in the fork -> [Help 1]
> [ERROR]
> [ERROR] To see the full stack trace of the errors, re-run Maven with the
> -e switch.
> [ERROR] Re-run Maven using the -X switch to enable full debug logging.
> [ERROR]
> [ERROR] For more information about the errors and possible solutions,
> please read the following articles:
> [ERROR] [Help 1]
> http://cwiki.apache.org/confluence/display/MAVEN/MojoFailureException
> [ERROR]
> [ERROR] After correcting the problems, you can resume the build with the
> command
> [ERROR]   mvn <goals> -rf :hbase-server
> Build step 'Invoke top-level Maven targets' marked build as failure
> Performing Post build task...
> Match found for :.* : True
> Logical operation result is TRUE
> Running script  : # Post-build task script. TODO: Check this in and have
> all builds reference check-in.
> pwd && ls
> # NOTE!!!! The below code has been copied and pasted from
> ./dev-tools/run-test.sh
> # Do not change here without syncing there and vice-versa.
> ZOMBIE_TESTS_COUNT=`jps -v | grep surefirebooter | grep -e '-Dhbase.test'
> | wc -l`
> if [[ $ZOMBIE_TESTS_COUNT != 0 ]] ; then
>  echo "Suspicious java process found - waiting 30s to see if there are
> just slow to stop"
>  sleep 30
>  ZOMBIE_TESTS_COUNT=`jps -v | grep surefirebooter | grep -e '-Dhbase.test'
> | wc -l`
>  if [[ $ZOMBIE_TESTS_COUNT != 0 ]] ; then
>    echo " {color:red}There appear to be $ZOMBIE_TESTS_COUNT zombie
> tests{color}, they should have been killed by surefire but survived"
>    jps -v | grep surefirebooter | grep -e '-Dhbase.test'
>    jps -v | grep surefirebooter | grep -e '-Dhbase.test' | cut -d ' ' -f 1
> | xargs -n 1 jstack
>    # Exit with error
>    exit 1
>  else
>    echo "We're ok: there is no zombie test, but some tests took some time
> to stop"
>  fi
> else
>   echo "We're ok: there is no zombie test"
> fi
> [Hadoop] $ /bin/bash -xe /tmp/hudson6281252859512781066.sh
> + pwd
> <https://builds.apache.org/job/HBase-1.2/jdk=latest1.8,label=Hadoop/ws/>
> + ls
> bin
> CHANGES.txt
> conf
> dev-support
> hbase-annotations
> hbase-assembly
> hbase-checkstyle
> hbase-client
> hbase-common
> hbase-examples
> hbase-external-blockcache
> hbase-hadoop2-compat
> hbase-hadoop-compat
> hbase-it
> hbase-native-client
> hbase-prefix-tree
> hbase-procedure
> hbase-protocol
> hbase-resource-bundle
> hbase-rest
> hbase-server
> hbase-shaded
> hbase-shell
> hbase-testing-util
> hbase-thrift
> LICENSE.txt
> NOTICE.txt
> pom.xml
> README.txt
> src
> target
> ++ jps -v
> ++ grep surefirebooter
> ++ grep -e -Dhbase.test
> ++ wc -l
> + ZOMBIE_TESTS_COUNT=0
> + [[ 0 != 0 ]]
> + echo 'We'\''re ok: there is no zombie test'
> We're ok: there is no zombie test
> POST BUILD TASK : SUCCESS
> END OF POST BUILD TASK : 0
> Archiving artifacts
> Recording test results
>