You are viewing a plain text version of this content. The canonical link for it is here.
Posted to builds@cassandra.apache.org by Apache Jenkins Server <je...@builds.apache.org> on 2026/06/03 16:32:03 UTC
Build complete: Cassandra-5.0 #603 [FAILURE] 1656a9cb01d69bdad931b6cd54bb77b63978eb76
-------------------------------------------------------------------------------
Build Cassandra-5.0 #603 Failure
URL: https://ci-cassandra.apache.org/job/Cassandra-5.0/603/
-------------------------------------------------------------------------------
Changes:
No changes
-------------------------------------------------------------------------------
Failed Tests:
39 tests failed.
FAILED: dtest-large-latest.disk_balance_test.TestDiskBalance.Tests / dtest-large-latest jdk17 3/6 / test_disk_balance_bootstrap
FAILED: dtest-latest.disk_balance_test.TestDiskBalance.Tests / dtest-latest jdk11 48/64 / test_disk_balance_after_boundary_change_stcs
FAILED: dtest-latest.disk_balance_test.TestDiskBalance.Tests / dtest-latest jdk11 48/64 / test_disk_balance_after_boundary_change_stcs
FAILED: dtest-latest.disk_balance_test.TestDiskBalance.Tests / dtest-latest jdk17 43/64 / test_disk_balance_replace_same_address
FAILED: dtest-latest.materialized_views_test.TestMaterializedViews.Tests / dtest-latest jdk11 36/64 / test_view_metadata_cleanup
FAILED: dtest-latest.materialized_views_test.TestMaterializedViews.Tests / dtest-latest jdk17 36/64 / test_view_metadata_cleanup
FAILED: dtest-upgrade-large.upgrade_tests.upgrade_through_versions_test.TestUpgrade_current_5_0_x_To_indev_5_0_x.Tests / dtest-upgrade-large jdk11 10/32 / test_bootstrap_multidc
FAILED: dtest-upgrade-novnode.upgrade_tests.cql_tests.TestCQLNodes2RF1_Upgrade_indev_4_0_x_To_indev_5_0_x.Tests / dtest-upgrade-novnode jdk11 80/128 / test_empty_blob
FAILED: dtest-upgrade-novnode.upgrade_tests.cql_tests.TestCQLNodes3RF3_Upgrade_current_5_0_x_To_indev_5_0_x.Tests / dtest-upgrade-novnode jdk11 41/128 / test_edge_2i_on_complex_pk
FAILED: dtest-upgrade-novnode.upgrade_tests.cql_tests.TestCQLNodes3RF3_Upgrade_current_5_0_x_To_indev_5_0_x.Tests / dtest-upgrade-novnode jdk11 17/128 / test_indexes_composite
FAILED: dtest-upgrade-novnode.upgrade_tests.cql_tests.TestCQLNodes3RF3_Upgrade_current_5_0_x_To_indev_5_0_x.Tests / dtest-upgrade-novnode jdk11 19/128 / test_reversed_compact
FAILED: dtest-upgrade-novnode.upgrade_tests.cql_tests.TestCQLNodes3RF3_Upgrade_current_5_0_x_To_indev_5_0_x.Tests / dtest-upgrade-novnode jdk11 77/128 / test_static_columns_with_distinct
FAILED: dtest-upgrade.upgrade_tests.cql_tests.TestCQLNodes3RF3_Upgrade_current_4_0_x_To_indev_5_0_x.Tests / dtest-upgrade jdk11 1/128 / test_column_name_validation
FAILED: dtest-upgrade.upgrade_tests.cql_tests.TestCQLNodes3RF3_Upgrade_current_4_1_x_To_indev_5_0_x.Tests / dtest-upgrade jdk11 44/128 / test_end_of_component_uses_oecBound
FAILED: dtest-upgrade.upgrade_tests.cql_tests.TestCQLNodes3RF3_Upgrade_current_5_0_x_To_indev_5_0_x.Tests / dtest-upgrade jdk11 4/128 / test_NPE_during_select_with_token
FAILED: dtest-upgrade.upgrade_tests.cql_tests.TestCQLNodes3RF3_Upgrade_current_5_0_x_To_indev_5_0_x.Tests / dtest-upgrade jdk11 39/128 / test_cas_and_compact
FAILED: dtest-upgrade.upgrade_tests.cql_tests.TestCQLNodes3RF3_Upgrade_current_5_0_x_To_indev_5_0_x.Tests / dtest-upgrade jdk11 41/128 / test_list_item_conditional
FAILED: dtest-upgrade.upgrade_tests.cql_tests.TestCQLNodes3RF3_Upgrade_current_5_0_x_To_indev_5_0_x.Tests / dtest-upgrade jdk11 44/128 / test_whole_map_conditional
FAILED: dtest-upgrade.upgrade_tests.cql_tests.TestCQLNodes3RF3_Upgrade_indev_4_0_x_To_indev_5_0_x.Tests / dtest-upgrade jdk11 17/128 / test_clustering_order_and_functions
FAILED: dtest-upgrade.upgrade_tests.paging_test.TestPagingDatasetChangesNodes2RF1_Upgrade_indev_4_0_x_To_indev_5_0_x.Tests / dtest-upgrade jdk11 68/128 / test_data_change_impacting_earlier_page
FAILED: dtest.secondary_indexes_test.TestSecondaryIndexes.Tests / dtest jdk17 64/64 / test_6924_dropping_cf
FAILED: org.apache.cassandra.db.commitlog.CommitLogSegmentManagerCDCTest.Tests / test-latest jdk11 3/16 / testCompletedFlag-cassandra.testtag_IS_UNDEFINED
FAILED: org.apache.cassandra.simulator.test.ShortPaxosSimulationTest.Tests / simulator-dtest jdk11 / simulationTest-_jdk11_x86_64
FAILED: dtest-upgrade-large-novnode.upgrade_tests.upgrade_through_versions_test.TestUpgrade_current_5_0_x_To_indev_5_0_x.Tests / dtest-upgrade-large-novnode jdk11 9/32 / test_bootstrap
FAILED: dtest-upgrade-large-novnode.upgrade_tests.upgrade_through_versions_test.TestUpgrade_current_5_0_x_To_indev_5_0_x.Tests / dtest-upgrade-large-novnode jdk11 10/32 / test_bootstrap_multidc
FAILED: dtest-upgrade-large.upgrade_tests.upgrade_through_versions_test.TestUpgrade_current_4_1_x_To_indev_5_0_x.Tests / dtest-upgrade-large jdk11 3/32 / test_bootstrap
FAILED: dtest-upgrade-large.upgrade_tests.upgrade_through_versions_test.TestUpgrade_current_5_0_x_To_indev_5_0_x.Tests / dtest-upgrade-large jdk11 9/32 / test_bootstrap
FAILED: dtest-upgrade-novnode.upgrade_tests.cql_tests.TestCQLNodes3RF3_Upgrade_current_5_0_x_To_indev_5_0_x.Tests / dtest-upgrade-novnode jdk11 32/128 / test_multi_in
FAILED: org.apache.cassandra.db.commitlog.CommitLogSegmentManagerCDCTest.Tests / test jdk11 3/16 / testSegmentFlaggingWithNonblockingOnCreation-_jdk11_x86_64
FAILED: dtest-latest.bootstrap_test.TestBootstrap.Tests / dtest-latest jdk17 7/64 / test_consistent_range_movement_false_with_rf1_should_succeed
FAILED: dtest-latest.bootstrap_test.TestBootstrap.Tests / dtest-latest jdk11 7/64 / test_consistent_range_movement_false_with_rf1_should_succeed
FAILED: dtest-latest.bootstrap_test.TestBootstrap.Tests / dtest-latest jdk11 6/64 / test_consistent_range_movement_true_with_rf1_should_fail
FAILED: dtest-latest.bootstrap_test.TestBootstrap.Tests / dtest-latest jdk17 6/64 / test_consistent_range_movement_true_with_rf1_should_fail
FAILED: dtest-latest.client_request_metrics_test.TestClientRequestMetrics.Tests / dtest-latest jdk11 34/64 / test_client_request_metrics
FAILED: dtest-latest.client_request_metrics_test.TestClientRequestMetrics.Tests / dtest-latest jdk17 34/64 / test_client_request_metrics
FAILED: dtest-latest.replace_address_test.TestReplaceAddress.Tests / dtest-latest jdk11 23/64 / test_replace_with_insufficient_replicas
FAILED: dtest-latest.replace_address_test.TestReplaceAddress.Tests / dtest-latest jdk11 23/64 / test_replace_with_insufficient_replicas
FAILED: dtest-latest.replace_address_test.TestReplaceAddress.Tests / dtest-latest jdk17 23/64 / test_replace_with_insufficient_replicas
FAILED: dtest-latest.replace_address_test.TestReplaceAddress.Tests / dtest-latest jdk17 23/64 / test_replace_with_insufficient_replicas
-------------------------------------------------------------------------------
For complete test report and logs see https://nightlies.apache.org/cassandra/Cassandra-5.0/603/