You are viewing a plain text version of this content. The canonical link for it is here.
Posted to notifications@maven.apache.org by Apache Jenkins Server <je...@builds.apache.org> on 2020/05/14 02:09:21 UTC
Build failed in Jenkins: Maven TLP » maven-surefire » SUREFIRE-1570 #5
See https://builds.apache.org/job/maven-box/job/maven-surefire/job/SUREFIRE-1570/5/
Changes:
* fixed impl
* fixed impl
All tests passed
Build log:
[...truncated 30508 lines...]
[2020-05-14T02:00:07.979Z] Zipped 78 entries.
[2020-05-14T02:00:07.979Z] Archiving C:\Windows\system32\config\systemprofile\AppData\Local\Temp\jenkins-maven-box-maven-surefire-SUREFIRE-1570-5\maven-failsafe-plugin--windows-jdk11-maven3.6.x.zip
[2020-05-14T02:00:08.005Z] [Fast Archiver] No prior successful build to compare, so performing full copy of artifacts
[Pipeline] fileExists
[Pipeline] zip
[2020-05-14T02:00:08.148Z] Writing zip file of C:\Windows\system32\config\systemprofile\AppData\Local\Temp\jenkins-maven-box-maven-surefire-SUREFIRE-1570-5\surefire-its\target to C:\Windows\system32\config\systemprofile\AppData\Local\Temp\jenkins-maven-box-maven-surefire-SUREFIRE-1570-5\surefire-its--windows-jdk11-maven3.6.x.zip
[2020-05-14T02:00:28.579Z] [INFO] Tests run: 4, Failures: 0, Errors: 0, Skipped: 0, Time elapsed: 26.05 s - in org.apache.maven.surefire.its.jiras.Surefire828EmptyGroupExprIT
[2020-05-14T02:00:28.579Z] [INFO] Running org.apache.maven.surefire.its.jiras.Surefire832ProviderSelectionIT
[2020-05-14T02:00:31.765Z] [INFO] Tests run: 1, Failures: 0, Errors: 0, Skipped: 0, Time elapsed: 6.443 s - in org.apache.maven.surefire.its.jiras.Surefire832ProviderSelectionIT
[2020-05-14T02:00:31.765Z] [INFO] Running org.apache.maven.surefire.its.jiras.Surefire839TestWithoutCategoriesIT
[2020-05-14T02:00:44.855Z] [INFO] Tests run: 2, Failures: 0, Errors: 0, Skipped: 0, Time elapsed: 13.217 s - in org.apache.maven.surefire.its.jiras.Surefire839TestWithoutCategoriesIT
[2020-05-14T02:00:44.855Z] [INFO] Running org.apache.maven.surefire.its.jiras.Surefire847AdditionalFailureIT
[2020-05-14T02:00:52.662Z] [INFO] Tests run: 1, Failures: 0, Errors: 0, Skipped: 0, Time elapsed: 7.497 s - in org.apache.maven.surefire.its.jiras.Surefire847AdditionalFailureIT
[2020-05-14T02:00:52.662Z] [INFO] Running org.apache.maven.surefire.its.jiras.Surefire855AllowFailsafeUseArtifactFileIT
[2020-05-14T02:01:18.130Z] Zipped 18860 entries.
[2020-05-14T02:01:18.130Z] Archiving C:\Windows\system32\config\systemprofile\AppData\Local\Temp\jenkins-maven-box-maven-surefire-SUREFIRE-1570-5\surefire-its--windows-jdk11-maven3.6.x.zip
[2020-05-14T02:01:18.130Z] [Fast Archiver] No prior successful build to compare, so performing full copy of artifacts
[Pipeline] archiveArtifacts
[2020-05-14T02:01:19.881Z] Archiving artifacts
[2020-05-14T02:01:19.954Z] [Fast Archiver] No prior successful build to compare, so performing full copy of artifacts
[Pipeline] cleanWs
[2020-05-14T02:01:21.867Z] [WS-CLEANUP] Deleting project workspace...
[2020-05-14T02:01:21.867Z] [WS-CLEANUP] Deferred wipeout is used...
[2020-05-14T02:01:22.033Z] [WS-CLEANUP] done
[Pipeline] }
[Pipeline] // ws
[Pipeline] }
[Pipeline] // timestamps
[Pipeline] }
[Pipeline] // node
[Pipeline] }
[2020-05-14T02:01:48.570Z] [INFO] Tests run: 4, Failures: 0, Errors: 0, Skipped: 0, Time elapsed: 49.889 s - in org.apache.maven.surefire.its.jiras.Surefire855AllowFailsafeUseArtifactFileIT
[2020-05-14T02:01:48.570Z] [INFO] Running org.apache.maven.surefire.its.jiras.Surefire901MIssingResultfileWhenNoTestsIT
[2020-05-14T02:01:48.570Z] [INFO] Tests run: 1, Failures: 0, Errors: 0, Skipped: 0, Time elapsed: 5.533 s - in org.apache.maven.surefire.its.jiras.Surefire901MIssingResultfileWhenNoTestsIT
[2020-05-14T02:01:48.570Z] [INFO] Running org.apache.maven.surefire.its.jiras.Surefire907PerThreadWithoutThreadCountIT
[2020-05-14T02:01:52.778Z] [INFO] Tests run: 1, Failures: 0, Errors: 0, Skipped: 0, Time elapsed: 5.245 s - in org.apache.maven.surefire.its.jiras.Surefire907PerThreadWithoutThreadCountIT
[2020-05-14T02:01:52.778Z] [INFO] Running org.apache.maven.surefire.its.jiras.Surefire920TestFailureIgnoreWithTimeoutIT
[2020-05-14T02:02:08.180Z] [INFO] Tests run: 2, Failures: 0, Errors: 0, Skipped: 0, Time elapsed: 15.664 s - in org.apache.maven.surefire.its.jiras.Surefire920TestFailureIgnoreWithTimeoutIT
[2020-05-14T02:02:08.180Z] [INFO] Running org.apache.maven.surefire.its.jiras.Surefire926FailureWith2ProvidersIT
[2020-05-14T02:02:14.635Z] [INFO] Tests run: 1, Failures: 0, Errors: 0, Skipped: 0, Time elapsed: 5.467 s - in org.apache.maven.surefire.its.jiras.Surefire926FailureWith2ProvidersIT
[2020-05-14T02:02:14.635Z] [INFO] Running org.apache.maven.surefire.its.jiras.Surefire930TestNgSuiteXmlIT
[2020-05-14T02:02:22.777Z] [INFO] Tests run: 1, Failures: 0, Errors: 0, Skipped: 0, Time elapsed: 7.897 s - in org.apache.maven.surefire.its.jiras.Surefire930TestNgSuiteXmlIT
[2020-05-14T02:02:22.777Z] [INFO] Running org.apache.maven.surefire.its.jiras.Surefire943ReportContentIT
[2020-05-14T02:02:51.951Z] [INFO] Tests run: 2, Failures: 0, Errors: 0, Skipped: 0, Time elapsed: 28.45 s - in org.apache.maven.surefire.its.jiras.Surefire943ReportContentIT
[2020-05-14T02:02:51.951Z] [INFO] Running org.apache.maven.surefire.its.jiras.Surefire946KillMainProcessInReusableForkIT
[2020-05-14T02:04:54.728Z] [INFO] Tests run: 6, Failures: 0, Errors: 0, Skipped: 0, Time elapsed: 120.125 s - in org.apache.maven.surefire.its.jiras.Surefire946KillMainProcessInReusableForkIT
[2020-05-14T02:04:54.728Z] [INFO] Running org.apache.maven.surefire.its.jiras.Surefire972BizarreNoClassDefIT
[2020-05-14T02:04:58.897Z] [INFO] Tests run: 1, Failures: 0, Errors: 0, Skipped: 0, Time elapsed: 8.721 s - in org.apache.maven.surefire.its.jiras.Surefire972BizarreNoClassDefIT
[2020-05-14T02:04:58.897Z] [INFO] Running org.apache.maven.surefire.its.jiras.Surefire975DefaultVMEncodingIT
[2020-05-14T02:05:05.349Z] [INFO] Tests run: 1, Failures: 0, Errors: 0, Skipped: 0, Time elapsed: 6.169 s - in org.apache.maven.surefire.its.jiras.Surefire975DefaultVMEncodingIT
[2020-05-14T02:05:05.349Z] [INFO] Running org.apache.maven.surefire.its.jiras.Surefire979WrongClassLoaderIT
[2020-05-14T02:05:11.797Z] [INFO] Tests run: 1, Failures: 0, Errors: 0, Skipped: 0, Time elapsed: 6.248 s - in org.apache.maven.surefire.its.jiras.Surefire979WrongClassLoaderIT
[2020-05-14T02:05:11.797Z] [INFO] Running org.apache.maven.surefire.its.jiras.Surefire985ParameterizedRunnerAndCategoriesIT
[2020-05-14T02:05:18.361Z] [INFO] Tests run: 1, Failures: 0, Errors: 0, Skipped: 0, Time elapsed: 6.203 s - in org.apache.maven.surefire.its.jiras.Surefire985ParameterizedRunnerAndCategoriesIT
[2020-05-14T02:05:18.361Z] [INFO] Running org.apache.maven.surefire.its.jiras.Surefire995CategoryInheritanceIT
[2020-05-14T02:06:05.699Z] [INFO] Tests run: 7, Failures: 0, Errors: 0, Skipped: 0, Time elapsed: 42.134 s - in org.apache.maven.surefire.its.jiras.Surefire995CategoryInheritanceIT
[2020-05-14T02:06:05.699Z] [INFO]
[2020-05-14T02:06:05.699Z] [INFO] Results:
[2020-05-14T02:06:05.699Z] [INFO]
[2020-05-14T02:06:05.699Z] [WARNING] Tests run: 955, Failures: 0, Errors: 0, Skipped: 138
[2020-05-14T02:06:05.699Z] [INFO]
[2020-05-14T02:06:05.699Z] [INFO]
[2020-05-14T02:06:05.699Z] [INFO] --- maven-checkstyle-plugin:3.0.0:check (checkstyle-check) @ surefire-its ---
[2020-05-14T02:06:05.699Z] [INFO]
[2020-05-14T02:06:05.699Z] [INFO] --- maven-failsafe-plugin:3.0.0-M4:verify (default) @ surefire-its ---
[2020-05-14T02:06:05.699Z] [INFO] Failsafe report directory: /home/jenkins/jenkins-slave/workspace/box_maven-surefire_SUREFIRE-1570@2/surefire-its/target/failsafe-reports
[2020-05-14T02:06:05.699Z] [INFO]
[2020-05-14T02:06:05.699Z] [INFO] --- maven-install-plugin:2.5.2:install (default-install) @ surefire-its ---
[2020-05-14T02:06:05.699Z] [INFO] Skipping artifact installation
[2020-05-14T02:06:05.699Z] [INFO]
[2020-05-14T02:06:05.699Z] [INFO] --- maven-deploy-plugin:2.8.2:deploy (default-deploy) @ surefire-its ---
[2020-05-14T02:06:05.699Z] [INFO] Skipping artifact deployment
[2020-05-14T02:06:05.699Z] [INFO]
[2020-05-14T02:06:05.699Z] [INFO] --- jacoco-maven-plugin:0.8.5:report (default-cli) @ surefire-its ---
[2020-05-14T02:06:05.699Z] [INFO] Skipping JaCoCo execution due to missing execution data file.
[2020-05-14T02:06:05.699Z] [INFO]
[2020-05-14T02:06:05.699Z] [INFO] ----------< org.apache.maven.surefire:surefire-shared-utils >-----------
[2020-05-14T02:06:05.699Z] [INFO] Building Surefire Shared Utils 3.0.0-SNAPSHOT [26/26]
[2020-05-14T02:06:05.699Z] [INFO] --------------------------------[ jar ]---------------------------------
[2020-05-14T02:06:05.699Z] [INFO]
[2020-05-14T02:06:05.699Z] [INFO] --- maven-clean-plugin:3.1.0:clean (default-clean) @ surefire-shared-utils ---
[2020-05-14T02:06:05.699Z] [INFO]
[2020-05-14T02:06:05.699Z] [INFO] --- maven-enforcer-plugin:3.0.0-M3:enforce (enforce-maven-version) @ surefire-shared-utils ---
[2020-05-14T02:06:05.699Z] [INFO]
[2020-05-14T02:06:05.699Z] [INFO] --- maven-enforcer-plugin:3.0.0-M3:enforce (enforce-bytecode-version) @ surefire-shared-utils ---
[2020-05-14T02:06:05.699Z] [INFO] Adding ignore: module-info
[2020-05-14T02:06:05.699Z] [INFO]
[2020-05-14T02:06:05.699Z] [INFO] --- maven-enforcer-plugin:3.0.0-M3:enforce (enforce-java) @ surefire-shared-utils ---
[2020-05-14T02:06:05.699Z] [INFO]
[2020-05-14T02:06:05.699Z] [INFO] --- maven-enforcer-plugin:3.0.0-M3:enforce (enforce-maven) @ surefire-shared-utils ---
[2020-05-14T02:06:05.699Z] [INFO]
[2020-05-14T02:06:05.699Z] [INFO] --- apache-rat-plugin:0.13:check (rat-check) @ surefire-shared-utils ---
[2020-05-14T02:06:05.699Z] [INFO] Enabled default license matchers.
[2020-05-14T02:06:05.699Z] [INFO] Will parse SCM ignores for exclusions...
[2020-05-14T02:06:05.699Z] [INFO] Finished adding exclusions from SCM ignore files.
[2020-05-14T02:06:05.699Z] [INFO] 62 implicit excludes (use -debug for more details).
[2020-05-14T02:06:05.699Z] [INFO] 27 explicit excludes (use -debug for more details).
[2020-05-14T02:06:05.699Z] [INFO] 1 resources included (use -debug for more details)
[2020-05-14T02:06:05.699Z] [INFO] Rat check: Summary over all files. Unapproved: 0, unknown: 0, generated: 0, approved: 1 licenses.
[2020-05-14T02:06:05.699Z] [INFO]
[2020-05-14T02:06:05.699Z] [INFO] --- maven-compiler-plugin:3.8.1:compile (compile-generated) @ surefire-shared-utils ---
[2020-05-14T02:06:05.699Z] [INFO] No sources to compile
[2020-05-14T02:06:05.699Z] [INFO]
[2020-05-14T02:06:05.699Z] [INFO] --- maven-remote-resources-plugin:1.7.0:process (process-resource-bundles) @ surefire-shared-utils ---
[2020-05-14T02:06:05.699Z] [INFO] Preparing remote bundle org.apache:apache-jar-resource-bundle:1.4
[2020-05-14T02:06:05.699Z] [INFO] Copying 3 resources from 1 bundle.
[2020-05-14T02:06:05.699Z] [INFO]
[2020-05-14T02:06:05.699Z] [INFO] --- maven-resources-plugin:3.1.0:resources (default-resources) @ surefire-shared-utils ---
[2020-05-14T02:06:05.699Z] [INFO] Using 'UTF-8' encoding to copy filtered resources.
[2020-05-14T02:06:05.699Z] [INFO] skip non existing resourceDirectory /home/jenkins/jenkins-slave/workspace/box_maven-surefire_SUREFIRE-1570@2/surefire-shared-utils/src/main/resources
[2020-05-14T02:06:05.699Z] [INFO] Copying 3 resources
[2020-05-14T02:06:05.699Z] [INFO]
[2020-05-14T02:06:05.699Z] [INFO] --- maven-compiler-plugin:3.8.1:compile (default-compile) @ surefire-shared-utils ---
[2020-05-14T02:06:05.699Z] [INFO] No sources to compile
[2020-05-14T02:06:05.699Z] [INFO]
[2020-05-14T02:06:05.699Z] [INFO] --- animal-sniffer-maven-plugin:1.17:check (signature-check) @ surefire-shared-utils ---
[2020-05-14T02:06:05.700Z] [INFO] Checking unresolved references to org.codehaus.mojo.signature:java17:1.0
[2020-05-14T02:06:05.700Z] [INFO]
[2020-05-14T02:06:05.700Z] [INFO] --- maven-resources-plugin:3.1.0:testResources (default-testResources) @ surefire-shared-utils ---
[2020-05-14T02:06:05.700Z] [INFO] Using 'UTF-8' encoding to copy filtered resources.
[2020-05-14T02:06:05.700Z] [INFO] skip non existing resourceDirectory /home/jenkins/jenkins-slave/workspace/box_maven-surefire_SUREFIRE-1570@2/surefire-shared-utils/src/test/resources
[2020-05-14T02:06:05.700Z] [INFO] Copying 3 resources
[2020-05-14T02:06:05.700Z] [INFO]
[2020-05-14T02:06:05.700Z] [INFO] --- maven-compiler-plugin:3.8.1:testCompile (default-testCompile) @ surefire-shared-utils ---
[2020-05-14T02:06:05.700Z] [INFO] No sources to compile
[2020-05-14T02:06:05.700Z] [INFO]
[2020-05-14T02:06:05.700Z] [INFO] --- maven-surefire-plugin:3.0.0-M4:test (default-test) @ surefire-shared-utils ---
[2020-05-14T02:06:05.700Z] [INFO]
[2020-05-14T02:06:05.700Z] [INFO] --- maven-jar-plugin:3.2.0:jar (default-jar) @ surefire-shared-utils ---
[2020-05-14T02:06:05.700Z] [INFO] Building jar: /home/jenkins/jenkins-slave/workspace/box_maven-surefire_SUREFIRE-1570@2/surefire-shared-utils/target/surefire-shared-utils-3.0.0-SNAPSHOT.jar
[2020-05-14T02:06:05.700Z] [INFO]
[2020-05-14T02:06:05.700Z] [INFO] --- maven-site-plugin:3.8.2:attach-descriptor (attach-descriptor) @ surefire-shared-utils ---
[2020-05-14T02:06:05.700Z] [INFO] Skipping because packaging 'jar' is not pom.
[2020-05-14T02:06:05.700Z] [INFO]
[2020-05-14T02:06:05.700Z] [INFO] --- maven-shade-plugin:3.2.3:shade (default) @ surefire-shared-utils ---
[2020-05-14T02:06:05.700Z] [INFO] Including org.apache.maven.shared:maven-shared-utils:jar:3.1.0 in the shaded jar.
[2020-05-14T02:06:05.700Z] [INFO] Including commons-io:commons-io:jar:2.6 in the shaded jar.
[2020-05-14T02:06:05.700Z] [INFO] Including org.apache.commons:commons-lang3:jar:3.8.1 in the shaded jar.
[2020-05-14T02:06:05.700Z] [INFO] Including org.apache.commons:commons-compress:jar:1.20 in the shaded jar.
[2020-05-14T02:06:05.700Z] [INFO] Including commons-codec:commons-codec:jar:1.11 in the shaded jar.
[2020-05-14T02:06:05.700Z] [WARNING] maven-shared-utils-3.1.0.jar, surefire-shared-utils-3.0.0-SNAPSHOT.jar define 3 overlapping resources:
[2020-05-14T02:06:05.700Z] [WARNING] - META-INF/DEPENDENCIES
[2020-05-14T02:06:05.700Z] [WARNING] - META-INF/LICENSE
[2020-05-14T02:06:05.700Z] [WARNING] - META-INF/NOTICE
[2020-05-14T02:06:05.700Z] [WARNING] commons-codec-1.11.jar, commons-compress-1.20.jar, commons-io-2.6.jar, commons-lang3-3.8.1.jar, maven-shared-utils-3.1.0.jar, surefire-shared-utils-3.0.0-SNAPSHOT.jar define 1 overlapping resources:
[2020-05-14T02:06:05.700Z] [WARNING] - META-INF/MANIFEST.MF
[2020-05-14T02:06:05.700Z] [WARNING] commons-codec-1.11.jar, commons-compress-1.20.jar, commons-io-2.6.jar, commons-lang3-3.8.1.jar define 2 overlapping resources:
[2020-05-14T02:06:05.700Z] [WARNING] - META-INF/LICENSE.txt
[2020-05-14T02:06:05.700Z] [WARNING] - META-INF/NOTICE.txt
[2020-05-14T02:06:05.700Z] [WARNING] maven-shade-plugin has detected that some class files are
[2020-05-14T02:06:05.700Z] [WARNING] present in two or more JARs. When this happens, only one
[2020-05-14T02:06:05.700Z] [WARNING] single version of the class is copied to the uber jar.
[2020-05-14T02:06:05.700Z] [WARNING] Usually this is not harmful and you can skip these warnings,
[2020-05-14T02:06:05.700Z] [WARNING] otherwise try to manually exclude artifacts based on
[2020-05-14T02:06:05.700Z] [WARNING] mvn dependency:tree -Ddetail=true and the above output.
[2020-05-14T02:06:05.700Z] [WARNING] See http://maven.apache.org/plugins/maven-shade-plugin/
[2020-05-14T02:06:05.700Z] [INFO] Replacing original artifact with shaded artifact.
[2020-05-14T02:06:05.700Z] [INFO] Replacing /home/jenkins/jenkins-slave/workspace/box_maven-surefire_SUREFIRE-1570@2/surefire-shared-utils/target/surefire-shared-utils-3.0.0-SNAPSHOT.jar with /home/jenkins/jenkins-slave/workspace/box_maven-surefire_SUREFIRE-1570@2/surefire-shared-utils/target/surefire-shared-utils-3.0.0-SNAPSHOT-shaded.jar
[2020-05-14T02:06:05.700Z] [INFO] Dependency-reduced POM written at: /home/jenkins/jenkins-slave/workspace/box_maven-surefire_SUREFIRE-1570@2/surefire-shared-utils/dependency-reduced-pom.xml
[2020-05-14T02:06:05.700Z] [INFO]
[2020-05-14T02:06:05.700Z] [INFO] --- maven-checkstyle-plugin:3.0.0:check (checkstyle-check) @ surefire-shared-utils ---
[2020-05-14T02:06:05.700Z] [INFO]
[2020-05-14T02:06:05.700Z] [INFO] --- maven-install-plugin:2.5.2:install (default-install) @ surefire-shared-utils ---
[2020-05-14T02:06:05.700Z] [INFO] Installing /home/jenkins/jenkins-slave/workspace/box_maven-surefire_SUREFIRE-1570@2/surefire-shared-utils/target/surefire-shared-utils-3.0.0-SNAPSHOT.jar to /home/jenkins/jenkins-slave/workspace/box_maven-surefire_SUREFIRE-1570@2/.m2/org/apache/maven/surefire/surefire-shared-utils/3.0.0-SNAPSHOT/surefire-shared-utils-3.0.0-SNAPSHOT.jar
[2020-05-14T02:06:05.700Z] [INFO] Installing /home/jenkins/jenkins-slave/workspace/box_maven-surefire_SUREFIRE-1570@2/surefire-shared-utils/dependency-reduced-pom.xml to /home/jenkins/jenkins-slave/workspace/box_maven-surefire_SUREFIRE-1570@2/.m2/org/apache/maven/surefire/surefire-shared-utils/3.0.0-SNAPSHOT/surefire-shared-utils-3.0.0-SNAPSHOT.pom
[2020-05-14T02:06:05.700Z] [INFO]
[2020-05-14T02:06:05.700Z] [INFO] --- maven-deploy-plugin:2.8.2:deploy (default-deploy) @ surefire-shared-utils ---
[2020-05-14T02:08:39.527Z] [INFO]
[2020-05-14T02:08:39.527Z] [INFO] --- jacoco-maven-plugin:0.8.5:report (default-cli) @ surefire-shared-utils ---
[2020-05-14T02:08:39.527Z] [INFO] Skipping JaCoCo execution due to missing execution data file.
[2020-05-14T02:08:39.527Z] [INFO] ------------------------------------------------------------------------
[2020-05-14T02:08:39.527Z] [INFO] Reactor Summary for Apache Maven Surefire 3.0.0-SNAPSHOT:
[2020-05-14T02:08:39.527Z] [INFO]
[2020-05-14T02:08:39.527Z] [INFO] Apache Maven Surefire .............................. SUCCESS [ 18.893 s]
[2020-05-14T02:08:39.527Z] [INFO] SureFire Logger API ................................ SUCCESS [ 12.096 s]
[2020-05-14T02:08:39.527Z] [INFO] SureFire API ....................................... SUCCESS [ 18.180 s]
[2020-05-14T02:08:39.527Z] [INFO] Surefire Extensions API ............................ SUCCESS [ 7.546 s]
[2020-05-14T02:08:39.527Z] [INFO] Surefire Extensions SPI ............................ SUCCESS [ 2.765 s]
[2020-05-14T02:08:39.527Z] [INFO] SureFire Booter .................................... SUCCESS [ 23.643 s]
[2020-05-14T02:08:39.527Z] [INFO] Maven Surefire Test-Grouping Support ............... SUCCESS [ 7.331 s]
[2020-05-14T02:08:39.527Z] [INFO] SureFire Providers ................................. SUCCESS [ 1.264 s]
[2020-05-14T02:08:39.527Z] [INFO] Shared JUnit3 Provider Code ........................ SUCCESS [ 6.235 s]
[2020-05-14T02:08:39.527Z] [INFO] Shared Java 5 Provider Base ........................ SUCCESS [ 5.913 s]
[2020-05-14T02:08:39.527Z] [INFO] Shared JUnit4 Provider Code ........................ SUCCESS [ 6.124 s]
[2020-05-14T02:08:39.527Z] [INFO] Shared JUnit48 Provider Code ....................... SUCCESS [ 10.913 s]
[2020-05-14T02:08:39.527Z] [INFO] SureFire JUnit Runner .............................. SUCCESS [ 5.573 s]
[2020-05-14T02:08:39.527Z] [INFO] SureFire JUnit4 Runner ............................. SUCCESS [ 5.685 s]
[2020-05-14T02:08:39.527Z] [INFO] Maven Surefire Common .............................. SUCCESS [01:05 min]
[2020-05-14T02:08:39.527Z] [INFO] SureFire JUnitCore Runner .......................... SUCCESS [02:23 min]
[2020-05-14T02:08:39.527Z] [INFO] SureFire JUnit Platform Runner ..................... SUCCESS [ 13.289 s]
[2020-05-14T02:08:39.528Z] [INFO] SureFire TestNG Utils .............................. SUCCESS [ 5.084 s]
[2020-05-14T02:08:39.528Z] [INFO] SureFire TestNG Runner ............................. SUCCESS [ 7.750 s]
[2020-05-14T02:08:39.528Z] [INFO] ShadeFire JUnit3 Provider .......................... SUCCESS [ 2.987 s]
[2020-05-14T02:08:39.528Z] [INFO] Surefire Report Parser ............................. SUCCESS [ 6.616 s]
[2020-05-14T02:08:39.528Z] [INFO] Maven Surefire Plugin .............................. SUCCESS [ 11.135 s]
[2020-05-14T02:08:39.528Z] [INFO] Maven Failsafe Plugin .............................. SUCCESS [01:07 min]
[2020-05-14T02:08:39.528Z] [INFO] Maven Surefire Report Plugin ....................... SUCCESS [ 17.636 s]
[2020-05-14T02:08:39.528Z] [INFO] Maven Surefire Integration Tests ................... SUCCESS [ 01:38 h]
[2020-05-14T02:08:39.528Z] [INFO] Surefire Shared Utils .............................. SUCCESS [02:35 min]
[2020-05-14T02:08:39.528Z] [INFO] ------------------------------------------------------------------------
[2020-05-14T02:08:39.528Z] [INFO] BUILD SUCCESS
[2020-05-14T02:08:39.528Z] [INFO] ------------------------------------------------------------------------
[2020-05-14T02:08:39.528Z] [INFO] Total time: 01:48 h
[2020-05-14T02:08:39.528Z] [INFO] Finished at: 2020-05-14T02:08:37Z
[2020-05-14T02:08:39.528Z] [INFO] ------------------------------------------------------------------------
[Pipeline] }
[Pipeline] // withEnv
[Pipeline] }
[Pipeline] // stage
[Pipeline] openTasks
[2020-05-14T02:08:40.153Z] [TASKS] Skipping publisher since build result is FAILURE
[Pipeline] jacoco
[Pipeline] junit
[2020-05-14T02:08:40.522Z] Recording test results
[Pipeline] fileExists
[Pipeline] zip
[2020-05-14T02:08:44.149Z] Writing zip file of /home/jenkins/jenkins-slave/workspace/box_maven-surefire_SUREFIRE-1570@2/maven-failsafe-plugin/target/it to /home/jenkins/jenkins-slave/workspace/box_maven-surefire_SUREFIRE-1570@2/maven-failsafe-plugin--linux-jdk15-maven3.6.x.zip
[2020-05-14T02:08:44.328Z] Zipped 78 entries.
[2020-05-14T02:08:44.328Z] Archiving /home/jenkins/jenkins-slave/workspace/box_maven-surefire_SUREFIRE-1570@2/maven-failsafe-plugin--linux-jdk15-maven3.6.x.zip
[2020-05-14T02:08:44.329Z] [Fast Archiver] No prior successful build to compare, so performing full copy of artifacts
[Pipeline] fileExists
[Pipeline] zip
[2020-05-14T02:08:45.260Z] Writing zip file of /home/jenkins/jenkins-slave/workspace/box_maven-surefire_SUREFIRE-1570@2/surefire-its/target to /home/jenkins/jenkins-slave/workspace/box_maven-surefire_SUREFIRE-1570@2/surefire-its--linux-jdk15-maven3.6.x.zip
[2020-05-14T02:09:08.594Z] Zipped 20120 entries.
[2020-05-14T02:09:08.594Z] Archiving /home/jenkins/jenkins-slave/workspace/box_maven-surefire_SUREFIRE-1570@2/surefire-its--linux-jdk15-maven3.6.x.zip
[2020-05-14T02:09:08.595Z] [Fast Archiver] No prior successful build to compare, so performing full copy of artifacts
[Pipeline] archiveArtifacts
[2020-05-14T02:09:14.681Z] Archiving artifacts
[2020-05-14T02:09:14.850Z] [Fast Archiver] No prior successful build to compare, so performing full copy of artifacts
[Pipeline] cleanWs
[2020-05-14T02:09:20.558Z] [WS-CLEANUP] Deleting project workspace...
[2020-05-14T02:09:20.558Z] [WS-CLEANUP] Deferred wipeout is used...
[2020-05-14T02:09:20.901Z] [WS-CLEANUP] done
[Pipeline] }
[Pipeline] // ws
[Pipeline] }
[Pipeline] // timestamps
[Pipeline] }
[Pipeline] // node
[Pipeline] }
[Pipeline] // parallel
[Pipeline] echo
Build result: FAILURE
[Pipeline] jiraIssueSelector
[Pipeline] echo
The authors of changes [tibordigana].
[Pipeline] echo
Sending email ...
[Pipeline] emailext
Build failed in Jenkins: Maven TLP » maven-surefire » SUREFIRE-1570 #6
Posted by Apache Jenkins Server <je...@builds.apache.org>.
See https://builds.apache.org/job/maven-box/job/maven-surefire/job/SUREFIRE-1570/6/
Changes:
* unit tests
No tests ran.
Build log:
[...truncated 7913 lines...]
[2020-05-16T00:59:10.848Z] [INFO] Minimized 211 -> 180 (85%)
[2020-05-16T00:59:10.848Z] [INFO] Replacing original artifact with shaded artifact.
[2020-05-16T00:59:10.848Z] [INFO] Replacing C:\Windows\System32\config\systemprofile\AppData\Local\Temp\jenkins-maven-box-maven-surefire-SUREFIRE-1570-6@2\maven-surefire-common\target\maven-surefire-common-3.0.0-SNAPSHOT.jar with C:\Windows\System32\config\systemprofile\AppData\Local\Temp\jenkins-maven-box-maven-surefire-SUREFIRE-1570-6@2\maven-surefire-common\target\maven-surefire-common-3.0.0-SNAPSHOT-shaded.jar
[2020-05-16T00:59:10.848Z] [INFO] Dependency-reduced POM written at: C:\Windows\System32\config\systemprofile\AppData\Local\Temp\jenkins-maven-box-maven-surefire-SUREFIRE-1570-6@2\maven-surefire-common\dependency-reduced-pom.xml
[2020-05-16T00:59:11.087Z] [INFO]
[2020-05-16T00:59:11.087Z] [INFO] --- maven-checkstyle-plugin:3.0.0:check (checkstyle-check) @ maven-surefire-common ---
[2020-05-16T00:59:11.141Z] [INFO]
[2020-05-16T00:59:11.141Z] [INFO] --- maven-checkstyle-plugin:3.0.0:check (checkstyle-check) @ maven-surefire-common ---
[2020-05-16T00:59:13.439Z] [INFO] There are 16 errors reported by Checkstyle 6.18 with config/maven_checks.xml ruleset.
[2020-05-16T00:59:13.439Z] [ERROR] src\test\java\org\apache\maven\plugin\surefire\AbstractSurefireMojoTest.java:[256,59] (coding) MagicNumber: '0xCA' is a magic number.
[2020-05-16T00:59:13.439Z] [ERROR] src\test\java\org\apache\maven\plugin\surefire\AbstractSurefireMojoTest.java:[256,72] (coding) MagicNumber: '0xFE' is a magic number.
[2020-05-16T00:59:13.439Z] [ERROR] src\test\java\org\apache\maven\plugin\surefire\AbstractSurefireMojoTest.java:[256,85] (coding) MagicNumber: '0xBA' is a magic number.
[2020-05-16T00:59:13.439Z] [ERROR] src\test\java\org\apache\maven\plugin\surefire\AbstractSurefireMojoTest.java:[256,98] (coding) MagicNumber: '0xBE' is a magic number.
[2020-05-16T00:59:13.439Z] [INFO] Ignored 12 errors, 4 violations remaining.
[2020-05-16T00:59:13.439Z] [INFO] ------------------------------------------------------------------------
[2020-05-16T00:59:13.439Z] [INFO] Reactor Summary for Apache Maven Surefire 3.0.0-SNAPSHOT:
[2020-05-16T00:59:13.439Z] [INFO]
[2020-05-16T00:59:13.439Z] [INFO] Apache Maven Surefire .............................. SUCCESS [ 59.680 s]
[2020-05-16T00:59:13.439Z] [INFO] SureFire Logger API ................................ SUCCESS [ 20.190 s]
[2020-05-16T00:59:13.439Z] [INFO] SureFire API ....................................... SUCCESS [ 22.538 s]
[2020-05-16T00:59:13.439Z] [INFO] Surefire Extensions API ............................ SUCCESS [ 6.630 s]
[2020-05-16T00:59:13.439Z] [INFO] Surefire Extensions SPI ............................ SUCCESS [ 2.199 s]
[2020-05-16T00:59:13.439Z] [INFO] SureFire Booter .................................... SUCCESS [ 23.420 s]
[2020-05-16T00:59:13.439Z] [INFO] Maven Surefire Test-Grouping Support ............... SUCCESS [ 14.268 s]
[2020-05-16T00:59:13.439Z] [INFO] SureFire Providers ................................. SUCCESS [ 0.913 s]
[2020-05-16T00:59:13.439Z] [INFO] Shared JUnit3 Provider Code ........................ SUCCESS [ 4.095 s]
[2020-05-16T00:59:13.439Z] [INFO] Shared Java 5 Provider Base ........................ SUCCESS [ 5.597 s]
[2020-05-16T00:59:13.439Z] [INFO] Shared JUnit4 Provider Code ........................ SUCCESS [ 5.874 s]
[2020-05-16T00:59:13.439Z] [INFO] Shared JUnit48 Provider Code ....................... SUCCESS [ 9.627 s]
[2020-05-16T00:59:13.439Z] [INFO] SureFire JUnit Runner .............................. SUCCESS [ 4.693 s]
[2020-05-16T00:59:13.439Z] [INFO] SureFire JUnit4 Runner ............................. SUCCESS [ 4.955 s]
[2020-05-16T00:59:13.439Z] [INFO] Maven Surefire Common .............................. FAILURE [ 59.243 s]
[2020-05-16T00:59:13.439Z] [INFO] SureFire JUnitCore Runner .......................... SKIPPED
[2020-05-16T00:59:13.439Z] [INFO] SureFire JUnit Platform Runner ..................... SKIPPED
[2020-05-16T00:59:13.439Z] [INFO] SureFire TestNG Utils .............................. SKIPPED
[2020-05-16T00:59:13.439Z] [INFO] SureFire TestNG Runner ............................. SKIPPED
[2020-05-16T00:59:13.439Z] [INFO] ShadeFire JUnit3 Provider .......................... SKIPPED
[2020-05-16T00:59:13.439Z] [INFO] Surefire Report Parser ............................. SKIPPED
[2020-05-16T00:59:13.439Z] [INFO] Maven Surefire Plugin .............................. SKIPPED
[2020-05-16T00:59:13.439Z] [INFO] Maven Failsafe Plugin .............................. SKIPPED
[2020-05-16T00:59:13.439Z] [INFO] Maven Surefire Report Plugin ....................... SKIPPED
[2020-05-16T00:59:13.439Z] [INFO] Maven Surefire Integration Tests ................... SKIPPED
[2020-05-16T00:59:13.439Z] [INFO] Surefire Shared Utils .............................. SKIPPED
[2020-05-16T00:59:13.439Z] [INFO] ------------------------------------------------------------------------
[2020-05-16T00:59:13.439Z] [INFO] BUILD FAILURE
[2020-05-16T00:59:13.439Z] [INFO] ------------------------------------------------------------------------
[2020-05-16T00:59:13.439Z] [INFO] Total time: 04:05 min
[2020-05-16T00:59:13.439Z] [INFO] Finished at: 2020-05-15T17:59:13-07:00
[2020-05-16T00:59:13.439Z] [INFO] ------------------------------------------------------------------------
[2020-05-16T00:59:13.439Z] [ERROR] Failed to execute goal org.apache.maven.plugins:maven-checkstyle-plugin:3.0.0:check (checkstyle-check) on project maven-surefire-common: You have 4 Checkstyle violations. -> [Help 1]
[2020-05-16T00:59:13.439Z] org.apache.maven.lifecycle.LifecycleExecutionException: Failed to execute goal org.apache.maven.plugins:maven-checkstyle-plugin:3.0.0:check (checkstyle-check) on project maven-surefire-common: You have 4 Checkstyle violations.
[2020-05-16T00:59:13.439Z] at org.apache.maven.lifecycle.internal.MojoExecutor.execute (MojoExecutor.java:215)
[2020-05-16T00:59:13.440Z] at org.apache.maven.lifecycle.internal.MojoExecutor.execute (MojoExecutor.java:156)
[2020-05-16T00:59:13.440Z] at org.apache.maven.lifecycle.internal.MojoExecutor.execute (MojoExecutor.java:148)
[2020-05-16T00:59:13.440Z] at org.apache.maven.lifecycle.internal.LifecycleModuleBuilder.buildProject (LifecycleModuleBuilder.java:117)
[2020-05-16T00:59:13.440Z] at org.apache.maven.lifecycle.internal.LifecycleModuleBuilder.buildProject (LifecycleModuleBuilder.java:81)
[2020-05-16T00:59:13.440Z] at org.apache.maven.lifecycle.internal.builder.singlethreaded.SingleThreadedBuilder.build (SingleThreadedBuilder.java:56)
[2020-05-16T00:59:13.440Z] at org.apache.maven.lifecycle.internal.LifecycleStarter.execute (LifecycleStarter.java:128)
[2020-05-16T00:59:13.440Z] at org.apache.maven.DefaultMaven.doExecute (DefaultMaven.java:305)
[2020-05-16T00:59:13.440Z] at org.apache.maven.DefaultMaven.doExecute (DefaultMaven.java:192)
[2020-05-16T00:59:13.440Z] at org.apache.maven.DefaultMaven.execute (DefaultMaven.java:105)
[2020-05-16T00:59:13.440Z] at org.apache.maven.cli.MavenCli.execute (MavenCli.java:956)
[2020-05-16T00:59:13.440Z] at org.apache.maven.cli.MavenCli.doMain (MavenCli.java:288)
[2020-05-16T00:59:13.440Z] at org.apache.maven.cli.MavenCli.main (MavenCli.java:192)
[2020-05-16T00:59:13.440Z] at sun.reflect.NativeMethodAccessorImpl.invoke0 (Native Method)
[2020-05-16T00:59:13.440Z] at sun.reflect.NativeMethodAccessorImpl.invoke (NativeMethodAccessorImpl.java:62)
[2020-05-16T00:59:13.440Z] at sun.reflect.DelegatingMethodAccessorImpl.invoke (DelegatingMethodAccessorImpl.java:43)
[2020-05-16T00:59:13.440Z] at java.lang.reflect.Method.invoke (Method.java:498)
[2020-05-16T00:59:13.440Z] at org.codehaus.plexus.classworlds.launcher.Launcher.launchEnhanced (Launcher.java:282)
[2020-05-16T00:59:13.440Z] at org.codehaus.plexus.classworlds.launcher.Launcher.launch (Launcher.java:225)
[2020-05-16T00:59:13.440Z] at org.codehaus.plexus.classworlds.launcher.Launcher.mainWithExitCode (Launcher.java:406)
[2020-05-16T00:59:13.440Z] at org.codehaus.plexus.classworlds.launcher.Launcher.main (Launcher.java:347)
[2020-05-16T00:59:13.440Z] Caused by: org.apache.maven.plugin.MojoFailureException: You have 4 Checkstyle violations.
[2020-05-16T00:59:13.440Z] at org.apache.maven.plugins.checkstyle.CheckstyleViolationCheckMojo.execute (CheckstyleViolationCheckMojo.java:576)
[2020-05-16T00:59:13.440Z] at org.apache.maven.plugin.DefaultBuildPluginManager.executeMojo (DefaultBuildPluginManager.java:137)
[2020-05-16T00:59:13.440Z] at org.apache.maven.lifecycle.internal.MojoExecutor.execute (MojoExecutor.java:210)
[2020-05-16T00:59:13.440Z] at org.apache.maven.lifecycle.internal.MojoExecutor.execute (MojoExecutor.java:156)
[2020-05-16T00:59:13.440Z] at org.apache.maven.lifecycle.internal.MojoExecutor.execute (MojoExecutor.java:148)
[2020-05-16T00:59:13.440Z] at org.apache.maven.lifecycle.internal.LifecycleModuleBuilder.buildProject (LifecycleModuleBuilder.java:117)
[2020-05-16T00:59:13.440Z] at org.apache.maven.lifecycle.internal.LifecycleModuleBuilder.buildProject (LifecycleModuleBuilder.java:81)
[2020-05-16T00:59:13.440Z] at org.apache.maven.lifecycle.internal.builder.singlethreaded.SingleThreadedBuilder.build (SingleThreadedBuilder.java:56)
[2020-05-16T00:59:13.440Z] at org.apache.maven.lifecycle.internal.LifecycleStarter.execute (LifecycleStarter.java:128)
[2020-05-16T00:59:13.440Z] at org.apache.maven.DefaultMaven.doExecute (DefaultMaven.java:305)
[2020-05-16T00:59:13.440Z] at org.apache.maven.DefaultMaven.doExecute (DefaultMaven.java:192)
[2020-05-16T00:59:13.440Z] at org.apache.maven.DefaultMaven.execute (DefaultMaven.java:105)
[2020-05-16T00:59:13.440Z] at org.apache.maven.cli.MavenCli.execute (MavenCli.java:956)
[2020-05-16T00:59:13.440Z] at org.apache.maven.cli.MavenCli.doMain (MavenCli.java:288)
[2020-05-16T00:59:13.440Z] at org.apache.maven.cli.MavenCli.main (MavenCli.java:192)
[2020-05-16T00:59:13.440Z] at sun.reflect.NativeMethodAccessorImpl.invoke0 (Native Method)
[2020-05-16T00:59:13.440Z] at sun.reflect.NativeMethodAccessorImpl.invoke (NativeMethodAccessorImpl.java:62)
[2020-05-16T00:59:13.440Z] at sun.reflect.DelegatingMethodAccessorImpl.invoke (DelegatingMethodAccessorImpl.java:43)
[2020-05-16T00:59:13.440Z] at java.lang.reflect.Method.invoke (Method.java:498)
[2020-05-16T00:59:13.440Z] at org.codehaus.plexus.classworlds.launcher.Launcher.launchEnhanced (Launcher.java:282)
[2020-05-16T00:59:13.440Z] at org.codehaus.plexus.classworlds.launcher.Launcher.launch (Launcher.java:225)
[2020-05-16T00:59:13.440Z] at org.codehaus.plexus.classworlds.launcher.Launcher.mainWithExitCode (Launcher.java:406)
[2020-05-16T00:59:13.440Z] at org.codehaus.plexus.classworlds.launcher.Launcher.main (Launcher.java:347)
[2020-05-16T00:59:13.440Z] [ERROR]
[2020-05-16T00:59:13.440Z] [ERROR] Re-run Maven using the -X switch to enable full debug logging.
[2020-05-16T00:59:13.440Z] [ERROR]
[2020-05-16T00:59:13.440Z] [ERROR] For more information about the errors and possible solutions, please read the following articles:
[2020-05-16T00:59:13.440Z] [ERROR] [Help 1] http://cwiki.apache.org/confluence/display/MAVEN/MojoFailureException
[2020-05-16T00:59:13.440Z] [ERROR]
[2020-05-16T00:59:13.440Z] [ERROR] After correcting the problems, you can resume the build with the command
[2020-05-16T00:59:13.440Z] [ERROR] mvn <args> -rf :maven-surefire-common
[2020-05-16T00:59:13.449Z] [INFO] There are 16 errors reported by Checkstyle 6.18 with config/maven_checks.xml ruleset.
[2020-05-16T00:59:13.449Z] [ERROR] src\test\java\org\apache\maven\plugin\surefire\AbstractSurefireMojoTest.java:[256,59] (coding) MagicNumber: '0xCA' is a magic number.
[2020-05-16T00:59:13.449Z] [ERROR] src\test\java\org\apache\maven\plugin\surefire\AbstractSurefireMojoTest.java:[256,72] (coding) MagicNumber: '0xFE' is a magic number.
[2020-05-16T00:59:13.449Z] [ERROR] src\test\java\org\apache\maven\plugin\surefire\AbstractSurefireMojoTest.java:[256,85] (coding) MagicNumber: '0xBA' is a magic number.
[2020-05-16T00:59:13.450Z] [ERROR] src\test\java\org\apache\maven\plugin\surefire\AbstractSurefireMojoTest.java:[256,98] (coding) MagicNumber: '0xBE' is a magic number.
[2020-05-16T00:59:13.450Z] [INFO] Ignored 12 errors, 4 violations remaining.
[2020-05-16T00:59:13.450Z] [INFO] ------------------------------------------------------------------------
[2020-05-16T00:59:13.450Z] [INFO] Reactor Summary for Apache Maven Surefire 3.0.0-SNAPSHOT:
[2020-05-16T00:59:13.450Z] [INFO]
[2020-05-16T00:59:13.450Z] [INFO] Apache Maven Surefire .............................. SUCCESS [01:00 min]
[2020-05-16T00:59:13.450Z] [INFO] SureFire Logger API ................................ SUCCESS [ 19.541 s]
[2020-05-16T00:59:13.450Z] [INFO] SureFire API ....................................... SUCCESS [ 22.585 s]
[2020-05-16T00:59:13.450Z] [INFO] Surefire Extensions API ............................ SUCCESS [ 6.662 s]
[2020-05-16T00:59:13.450Z] [INFO] Surefire Extensions SPI ............................ SUCCESS [ 2.146 s]
[2020-05-16T00:59:13.450Z] [INFO] SureFire Booter .................................... SUCCESS [ 23.708 s]
[2020-05-16T00:59:13.450Z] [INFO] Maven Surefire Test-Grouping Support ............... SUCCESS [ 13.806 s]
[2020-05-16T00:59:13.450Z] [INFO] SureFire Providers ................................. SUCCESS [ 0.861 s]
[2020-05-16T00:59:13.450Z] [INFO] Shared JUnit3 Provider Code ........................ SUCCESS [ 4.315 s]
[2020-05-16T00:59:13.450Z] [INFO] Shared Java 5 Provider Base ........................ SUCCESS [ 5.350 s]
[2020-05-16T00:59:13.450Z] [INFO] Shared JUnit4 Provider Code ........................ SUCCESS [ 6.130 s]
[2020-05-16T00:59:13.450Z] [INFO] Shared JUnit48 Provider Code ....................... SUCCESS [ 9.270 s]
[2020-05-16T00:59:13.450Z] [INFO] SureFire JUnit Runner .............................. SUCCESS [ 4.912 s]
[2020-05-16T00:59:13.450Z] [INFO] SureFire JUnit4 Runner ............................. SUCCESS [ 4.931 s]
[2020-05-16T00:59:13.450Z] [INFO] Maven Surefire Common .............................. FAILURE [ 59.500 s]
[2020-05-16T00:59:13.450Z] [INFO] SureFire JUnitCore Runner .......................... SKIPPED
[2020-05-16T00:59:13.450Z] [INFO] SureFire JUnit Platform Runner ..................... SKIPPED
[2020-05-16T00:59:13.450Z] [INFO] SureFire TestNG Utils .............................. SKIPPED
[2020-05-16T00:59:13.450Z] [INFO] SureFire TestNG Runner ............................. SKIPPED
[2020-05-16T00:59:13.450Z] [INFO] ShadeFire JUnit3 Provider .......................... SKIPPED
[2020-05-16T00:59:13.450Z] [INFO] Surefire Report Parser ............................. SKIPPED
[2020-05-16T00:59:13.450Z] [INFO] Maven Surefire Plugin .............................. SKIPPED
[2020-05-16T00:59:13.450Z] [INFO] Maven Failsafe Plugin .............................. SKIPPED
[2020-05-16T00:59:13.450Z] [INFO] Maven Surefire Report Plugin ....................... SKIPPED
[2020-05-16T00:59:13.450Z] [INFO] Maven Surefire Integration Tests ................... SKIPPED
[2020-05-16T00:59:13.450Z] [INFO] Surefire Shared Utils .............................. SKIPPED
[2020-05-16T00:59:13.450Z] [INFO] ------------------------------------------------------------------------
[2020-05-16T00:59:13.450Z] [INFO] BUILD FAILURE
[2020-05-16T00:59:13.450Z] [INFO] ------------------------------------------------------------------------
[2020-05-16T00:59:13.450Z] [INFO] Total time: 04:06 min
[2020-05-16T00:59:13.450Z] [INFO] Finished at: 2020-05-15T17:59:13-07:00
[2020-05-16T00:59:13.450Z] [INFO] ------------------------------------------------------------------------
[2020-05-16T00:59:13.450Z] [ERROR] Failed to execute goal org.apache.maven.plugins:maven-checkstyle-plugin:3.0.0:check (checkstyle-check) on project maven-surefire-common: You have 4 Checkstyle violations. -> [Help 1]
[2020-05-16T00:59:13.450Z] org.apache.maven.lifecycle.LifecycleExecutionException: Failed to execute goal org.apache.maven.plugins:maven-checkstyle-plugin:3.0.0:check (checkstyle-check) on project maven-surefire-common: You have 4 Checkstyle violations.
[2020-05-16T00:59:13.450Z] at org.apache.maven.lifecycle.internal.MojoExecutor.execute (MojoExecutor.java:215)
[2020-05-16T00:59:13.450Z] at org.apache.maven.lifecycle.internal.MojoExecutor.execute (MojoExecutor.java:156)
[2020-05-16T00:59:13.450Z] at org.apache.maven.lifecycle.internal.MojoExecutor.execute (MojoExecutor.java:148)
[2020-05-16T00:59:13.450Z] at org.apache.maven.lifecycle.internal.LifecycleModuleBuilder.buildProject (LifecycleModuleBuilder.java:117)
[2020-05-16T00:59:13.450Z] at org.apache.maven.lifecycle.internal.LifecycleModuleBuilder.buildProject (LifecycleModuleBuilder.java:81)
[2020-05-16T00:59:13.450Z] at org.apache.maven.lifecycle.internal.builder.singlethreaded.SingleThreadedBuilder.build (SingleThreadedBuilder.java:56)
[2020-05-16T00:59:13.450Z] at org.apache.maven.lifecycle.internal.LifecycleStarter.execute (LifecycleStarter.java:128)
[2020-05-16T00:59:13.450Z] at org.apache.maven.DefaultMaven.doExecute (DefaultMaven.java:305)
[2020-05-16T00:59:13.450Z] at org.apache.maven.DefaultMaven.doExecute (DefaultMaven.java:192)
[2020-05-16T00:59:13.450Z] at org.apache.maven.DefaultMaven.execute (DefaultMaven.java:105)
[2020-05-16T00:59:13.450Z] at org.apache.maven.cli.MavenCli.execute (MavenCli.java:956)
[2020-05-16T00:59:13.450Z] at org.apache.maven.cli.MavenCli.doMain (MavenCli.java:288)
[2020-05-16T00:59:13.450Z] at org.apache.maven.cli.MavenCli.main (MavenCli.java:192)
[2020-05-16T00:59:13.450Z] at sun.reflect.NativeMethodAccessorImpl.invoke0 (Native Method)
[2020-05-16T00:59:13.450Z] at sun.reflect.NativeMethodAccessorImpl.invoke (NativeMethodAccessorImpl.java:62)
[2020-05-16T00:59:13.450Z] at sun.reflect.DelegatingMethodAccessorImpl.invoke (DelegatingMethodAccessorImpl.java:43)
[2020-05-16T00:59:13.450Z] at java.lang.reflect.Method.invoke (Method.java:498)
[2020-05-16T00:59:13.450Z] at org.codehaus.plexus.classworlds.launcher.Launcher.launchEnhanced (Launcher.java:282)
[2020-05-16T00:59:13.450Z] at org.codehaus.plexus.classworlds.launcher.Launcher.launch (Launcher.java:225)
[2020-05-16T00:59:13.450Z] at org.codehaus.plexus.classworlds.launcher.Launcher.mainWithExitCode (Launcher.java:406)
[2020-05-16T00:59:13.450Z] at org.codehaus.plexus.classworlds.launcher.Launcher.main (Launcher.java:347)
[2020-05-16T00:59:13.450Z] Caused by: org.apache.maven.plugin.MojoFailureException: You have 4 Checkstyle violations.
[2020-05-16T00:59:13.450Z] at org.apache.maven.plugins.checkstyle.CheckstyleViolationCheckMojo.execute (CheckstyleViolationCheckMojo.java:576)
[2020-05-16T00:59:13.450Z] at org.apache.maven.plugin.DefaultBuildPluginManager.executeMojo (DefaultBuildPluginManager.java:137)
[2020-05-16T00:59:13.450Z] at org.apache.maven.lifecycle.internal.MojoExecutor.execute (MojoExecutor.java:210)
[2020-05-16T00:59:13.450Z] at org.apache.maven.lifecycle.internal.MojoExecutor.execute (MojoExecutor.java:156)
[2020-05-16T00:59:13.450Z] at org.apache.maven.lifecycle.internal.MojoExecutor.execute (MojoExecutor.java:148)
[2020-05-16T00:59:13.450Z] at org.apache.maven.lifecycle.internal.LifecycleModuleBuilder.buildProject (LifecycleModuleBuilder.java:117)
[2020-05-16T00:59:13.450Z] at org.apache.maven.lifecycle.internal.LifecycleModuleBuilder.buildProject (LifecycleModuleBuilder.java:81)
[2020-05-16T00:59:13.450Z] at org.apache.maven.lifecycle.internal.builder.singlethreaded.SingleThreadedBuilder.build (SingleThreadedBuilder.java:56)
[2020-05-16T00:59:13.450Z] at org.apache.maven.lifecycle.internal.LifecycleStarter.execute (LifecycleStarter.java:128)
[2020-05-16T00:59:13.450Z] at org.apache.maven.DefaultMaven.doExecute (DefaultMaven.java:305)
[2020-05-16T00:59:13.450Z] at org.apache.maven.DefaultMaven.doExecute (DefaultMaven.java:192)
[2020-05-16T00:59:13.450Z] at org.apache.maven.DefaultMaven.execute (DefaultMaven.java:105)
[2020-05-16T00:59:13.450Z] at org.apache.maven.cli.MavenCli.execute (MavenCli.java:956)
[2020-05-16T00:59:13.450Z] at org.apache.maven.cli.MavenCli.doMain (MavenCli.java:288)
[2020-05-16T00:59:13.450Z] at org.apache.maven.cli.MavenCli.main (MavenCli.java:192)
[2020-05-16T00:59:13.450Z] at sun.reflect.NativeMethodAccessorImpl.invoke0 (Native Method)
[2020-05-16T00:59:13.450Z] at sun.reflect.NativeMethodAccessorImpl.invoke (NativeMethodAccessorImpl.java:62)
[2020-05-16T00:59:13.450Z] at sun.reflect.DelegatingMethodAccessorImpl.invoke (DelegatingMethodAccessorImpl.java:43)
[2020-05-16T00:59:13.450Z] at java.lang.reflect.Method.invoke (Method.java:498)
[2020-05-16T00:59:13.450Z] at org.codehaus.plexus.classworlds.launcher.Launcher.launchEnhanced (Launcher.java:282)
[2020-05-16T00:59:13.450Z] at org.codehaus.plexus.classworlds.launcher.Launcher.launch (Launcher.java:225)
[2020-05-16T00:59:13.450Z] at org.codehaus.plexus.classworlds.launcher.Launcher.mainWithExitCode (Launcher.java:406)
[2020-05-16T00:59:13.450Z] at org.codehaus.plexus.classworlds.launcher.Launcher.main (Launcher.java:347)
[2020-05-16T00:59:13.450Z] [ERROR]
[2020-05-16T00:59:13.450Z] [ERROR] Re-run Maven using the -X switch to enable full debug logging.
[2020-05-16T00:59:13.450Z] [ERROR]
[2020-05-16T00:59:13.450Z] [ERROR] For more information about the errors and possible solutions, please read the following articles:
[2020-05-16T00:59:13.450Z] [ERROR] [Help 1] http://cwiki.apache.org/confluence/display/MAVEN/MojoFailureException
[2020-05-16T00:59:13.450Z] [ERROR]
[2020-05-16T00:59:13.450Z] [ERROR] After correcting the problems, you can resume the build with the command
[2020-05-16T00:59:13.450Z] [ERROR] mvn <args> -rf :maven-surefire-common
[Pipeline] }
[Pipeline] // withEnv
[Pipeline] }
[Pipeline] // stage
[Pipeline] fileExists
[Pipeline] fileExists
[Pipeline] archiveArtifacts
[2020-05-16T00:59:13.604Z] Archiving artifacts
[Pipeline] cleanWs
[2020-05-16T00:59:13.650Z] [WS-CLEANUP] Deleting project workspace...
[2020-05-16T00:59:13.650Z] [WS-CLEANUP] Deferred wipeout is used...
[2020-05-16T00:59:13.690Z] [WS-CLEANUP] done
[Pipeline] }
[Pipeline] // ws
[Pipeline] }
[Pipeline] }
[Pipeline] // timestamps
[Pipeline] // withEnv
[Pipeline] }
[Pipeline] }
[Pipeline] // node
[Pipeline] // stage
[Pipeline] }
[Pipeline] fileExists
[Pipeline] fileExists
[Pipeline] archiveArtifacts
[2020-05-16T00:59:14.075Z] Archiving artifacts
[Pipeline] cleanWs
[2020-05-16T00:59:14.162Z] [WS-CLEANUP] Deleting project workspace...
[2020-05-16T00:59:14.162Z] [WS-CLEANUP] Deferred wipeout is used...
[2020-05-16T00:59:14.231Z] [WS-CLEANUP] done
[Pipeline] }
[Pipeline] // ws
[Pipeline] }
[Pipeline] // timestamps
[Pipeline] }
[Pipeline] // node
[Pipeline] }
[Pipeline] // parallel
[Pipeline] echo
hudson.AbortException: hudson.AbortException: Error cloning remote repo 'origin'
[Pipeline] echo
Build result: FAILURE
[Pipeline] jiraIssueSelector
[Pipeline] echo
The authors of changes [tibordigana].
[Pipeline] echo
Sending email ...
[Pipeline] emailext