You are viewing a plain text version of this content. The canonical link for it is here.
Posted to builds@cassandra.apache.org by Apache Jenkins Server <je...@builds.apache.org> on 2021/11/13 04:06:08 UTC
Build complete: Cassandra-trunk #826 [UNSTABLE] 4f112af6156b0ed35eb85124eaa525e5e0b9a059
-------------------------------------------------------------------------------
Build Cassandra-trunk #826 Unstable
URL: https://ci-cassandra.apache.org/job/Cassandra-trunk/826/
-------------------------------------------------------------------------------
Changes:
[Ekaterina Dimitrova] Fix cassandra.yaml formatting of parameters
-------------------------------------------------------------------------------
Failed Tests:
8 tests failed.
FAILED: org.apache.cassandra.distributed.upgrade.CompactStorageUpgradeTest.compactStorageHiddenColumnTest
FAILED: org.apache.cassandra.distributed.upgrade.CompactStorageUpgradeTest.compactStorageUpgradeTest
FAILED: org.apache.cassandra.distributed.test.NetstatsBootstrapWithEntireSSTablesCompressionStreamingTest.testWithStreamingEntireSSTablesWithoutCompressionWithoutThrottling
FAILED: org.apache.cassandra.repair.RepairJobTest.testNoTreesRetainedAfterDifference-cdc
FAILED: org.apache.cassandra.tools.BulkLoaderTest.testBulkLoader_WithArgs2-cdc
FAILED: org.apache.cassandra.utils.memory.LongBufferPoolTest.testPoolAllocateWithRecyclePartially
FAILED: org.apache.cassandra.repair.RepairJobTest.testNoTreesRetainedAfterDifference
FAILED: org.apache.cassandra.repair.RepairJobTest.testNoTreesRetainedAfterDifference
-------------------------------------------------------------------------------
For complete test report and logs see https://nightlies.apache.org/cassandra/Cassandra-trunk/826/