You are viewing a plain text version of this content. The canonical link for it is here.
Posted to builds@beam.apache.org by Apache Jenkins Server <je...@builds.apache.org> on 2020/04/09 06:24:28 UTC
Build failed in Jenkins: beam_PerformanceTests_AvroIOIT_HDFS #2929
See <https://builds.apache.org/job/beam_PerformanceTests_AvroIOIT_HDFS/2929/display/redirect?page=changes>
Changes:
[samuelw] Ensure that empty messages are not flushed to handler.
[chamikara] Adds nose back under packages needed for testing.
[robertwb] [BEAM-9618] Mark push registration as deprecated.
------------------------------------------
[...truncated 239.12 KB...]
> Task :sdks:java:io:xml:testClasses UP-TO-DATE
Skipping task ':sdks:java:io:xml:testClasses' as it has no actions.
:sdks:java:io:xml:testClasses (Thread[Daemon worker,5,main]) completed. Took 0.0 secs.
:sdks:java:extensions:google-cloud-platform-core:testJar (Thread[Execution worker for ':' Thread 9,5,main]) started.
:sdks:java:io:xml:testJar (Thread[Daemon worker,5,main]) started.
> Task :sdks:java:io:xml:testJar
Build cache key for task ':sdks:java:io:xml:testJar' is 7b61a9a81933475985e866207b3c39ae
Caching disabled for task ':sdks:java:io:xml:testJar': Caching has not been enabled for the task
Task ':sdks:java:io:xml:testJar' is not up-to-date because:
No history is available.
:sdks:java:io:xml:testJar (Thread[Daemon worker,5,main]) completed. Took 0.009 secs.
:sdks:java:io:file-based-io-tests:compileTestJava (Thread[Daemon worker,5,main]) started.
> Task :sdks:java:extensions:google-cloud-platform-core:testJar
Build cache key for task ':sdks:java:extensions:google-cloud-platform-core:testJar' is c513d91ccb06b52d0c128bc31974282f
Caching disabled for task ':sdks:java:extensions:google-cloud-platform-core:testJar': Caching has not been enabled for the task
Task ':sdks:java:extensions:google-cloud-platform-core:testJar' is not up-to-date because:
No history is available.
:sdks:java:extensions:google-cloud-platform-core:testJar (Thread[Execution worker for ':' Thread 9,5,main]) completed. Took 0.016 secs.
> Task :sdks:java:io:file-based-io-tests:compileTestJava FROM-CACHE
Build cache key for task ':sdks:java:io:file-based-io-tests:compileTestJava' is 2083f75b26d68ecd3cce00a5a31a876d
Task ':sdks:java:io:file-based-io-tests:compileTestJava' is not up-to-date because:
No history is available.
Origin for org.gradle.api.internal.tasks.execution.ExecuteActionsTaskExecuter$TaskExecution@5ee20f1c: {executionTime=5432, hostName=apache-beam-jenkins-12, operatingSystem=Linux, buildInvocationId=fabpmx3x7zg6pdcotp5ciebu54, creationTime=1586392637851, identity=:sdks:java:io:file-based-io-tests:compileTestJava, type=org.gradle.api.internal.tasks.execution.ExecuteActionsTaskExecuter.TaskExecution, userName=jenkins, gradleVersion=5.2.1, rootPath=/home/jenkins/jenkins-slave/workspace/beam_PerformanceTests_XmlIOIT_HDFS/src}
Unpacked trees for task ':sdks:java:io:file-based-io-tests:compileTestJava' from cache.
:sdks:java:io:file-based-io-tests:compileTestJava (Thread[Daemon worker,5,main]) completed. Took 0.059 secs.
:sdks:java:io:file-based-io-tests:testClasses (Thread[Daemon worker,5,main]) started.
> Task :sdks:java:io:file-based-io-tests:testClasses UP-TO-DATE
Skipping task ':sdks:java:io:file-based-io-tests:testClasses' as it has no actions.
:sdks:java:io:file-based-io-tests:testClasses (Thread[Daemon worker,5,main]) completed. Took 0.0 secs.
> Task :sdks:java:harness:shadowJar
*******************
GRADLE SHADOW STATS
Total Jars: 57 (includes project)
Total Time: 9.556s [9556ms]
Average Time/Jar: 0.167649122807s [167.649122807ms]
*******************
:sdks:java:harness:shadowJar (Thread[Execution worker for ':' Thread 2,5,main]) completed. Took 10.194 secs.
:runners:java-fn-execution:compileJava (Thread[Execution worker for ':' Thread 2,5,main]) started.
> Task :runners:java-fn-execution:compileJava FROM-CACHE
Build cache key for task ':runners:java-fn-execution:compileJava' is 2d0201a09e1f727a6655bb56b40311cc
Task ':runners:java-fn-execution:compileJava' is not up-to-date because:
No history is available.
Origin for org.gradle.api.internal.tasks.execution.ExecuteActionsTaskExecuter$TaskExecution@1069cb25: {executionTime=15964, hostName=apache-beam-jenkins-12, operatingSystem=Linux, buildInvocationId=z4ekbkefbvbtxc6z2a2zpamzvm, creationTime=1586388488653, identity=:runners:java-fn-execution:compileJava, type=org.gradle.api.internal.tasks.execution.ExecuteActionsTaskExecuter.TaskExecution, userName=jenkins, gradleVersion=5.2.1, rootPath=/home/jenkins/jenkins-slave/workspace/beam_PostCommit_Go_VR_Spark/src}
Unpacked trees for task ':runners:java-fn-execution:compileJava' from cache.
:runners:java-fn-execution:compileJava (Thread[Execution worker for ':' Thread 2,5,main]) completed. Took 2.708 secs.
:runners:java-fn-execution:classes (Thread[Execution worker for ':' Thread 2,5,main]) started.
> Task :runners:java-fn-execution:classes UP-TO-DATE
Skipping task ':runners:java-fn-execution:classes' as it has no actions.
:runners:java-fn-execution:classes (Thread[Execution worker for ':' Thread 2,5,main]) completed. Took 0.0 secs.
:runners:java-fn-execution:jar (Thread[Execution worker for ':' Thread 2,5,main]) started.
> Task :runners:java-fn-execution:jar
Build cache key for task ':runners:java-fn-execution:jar' is d7f6b2a66d641bad21a2851250cff6cb
Caching disabled for task ':runners:java-fn-execution:jar': Caching has not been enabled for the task
Task ':runners:java-fn-execution:jar' is not up-to-date because:
No history is available.
:runners:java-fn-execution:jar (Thread[Execution worker for ':' Thread 2,5,main]) completed. Took 0.05 secs.
:runners:direct-java:compileJava (Thread[Execution worker for ':' Thread 2,5,main]) started.
:runners:google-cloud-dataflow-java:worker:legacy-worker:compileJava (Thread[Execution worker for ':' Thread 6,5,main]) started.
> Task :runners:direct-java:compileJava FROM-CACHE
Build cache key for task ':runners:direct-java:compileJava' is e608b16859445e5610056154364ad5df
Task ':runners:direct-java:compileJava' is not up-to-date because:
No history is available.
Origin for org.gradle.api.internal.tasks.execution.ExecuteActionsTaskExecuter$TaskExecution@4d281518: {executionTime=54543, hostName=apache-beam-jenkins-12, operatingSystem=Linux, buildInvocationId=c4w5hcf6m5hyhdvvoeprz72m3y, creationTime=1586284019750, identity=:runners:direct-java:compileJava, type=org.gradle.api.internal.tasks.execution.ExecuteActionsTaskExecuter.TaskExecution, userName=jenkins, gradleVersion=5.2.1, rootPath=/home/jenkins/jenkins-slave/workspace/beam_PreCommit_Java_Commit/src}
Unpacked trees for task ':runners:direct-java:compileJava' from cache.
:runners:direct-java:compileJava (Thread[Execution worker for ':' Thread 2,5,main]) completed. Took 0.095 secs.
:runners:direct-java:classes (Thread[Execution worker for ':' Thread 2,5,main]) started.
> Task :runners:direct-java:classes UP-TO-DATE
Skipping task ':runners:direct-java:classes' as it has no actions.
:runners:direct-java:classes (Thread[Execution worker for ':' Thread 2,5,main]) completed. Took 0.0 secs.
:runners:direct-java:shadowJar (Thread[Execution worker for ':' Thread 2,5,main]) started.
> Task :runners:google-cloud-dataflow-java:worker:legacy-worker:compileJava FROM-CACHE
file or directory '<https://builds.apache.org/job/beam_PerformanceTests_AvroIOIT_HDFS/ws/src/runners/google-cloud-dataflow-java/worker/legacy-worker/src/main/java',> not found
Build cache key for task ':runners:google-cloud-dataflow-java:worker:legacy-worker:compileJava' is ee9af944eb43ddaf496acdb1515c37fb
Task ':runners:google-cloud-dataflow-java:worker:legacy-worker:compileJava' is not up-to-date because:
No history is available.
Origin for org.gradle.api.internal.tasks.execution.ExecuteActionsTaskExecuter$TaskExecution@7622260f: {executionTime=51524, hostName=apache-beam-jenkins-12, operatingSystem=Linux, buildInvocationId=yh7k4s2udvatnehpauk4k5gz3y, creationTime=1586401208175, identity=:runners:google-cloud-dataflow-java:worker:legacy-worker:compileJava, type=org.gradle.api.internal.tasks.execution.ExecuteActionsTaskExecuter.TaskExecution, userName=jenkins, gradleVersion=5.2.1, rootPath=/home/jenkins/jenkins-slave/workspace/beam_PostCommit_Java_Nexmark_Dataflow/src}
Unpacked trees for task ':runners:google-cloud-dataflow-java:worker:legacy-worker:compileJava' from cache.
:runners:google-cloud-dataflow-java:worker:legacy-worker:compileJava (Thread[Execution worker for ':' Thread 6,5,main]) completed. Took 0.261 secs.
:runners:google-cloud-dataflow-java:worker:legacy-worker:classes (Thread[Execution worker for ':' Thread 6,5,main]) started.
> Task :runners:google-cloud-dataflow-java:worker:legacy-worker:classes UP-TO-DATE
Skipping task ':runners:google-cloud-dataflow-java:worker:legacy-worker:classes' as it has no actions.
:runners:google-cloud-dataflow-java:worker:legacy-worker:classes (Thread[Execution worker for ':' Thread 6,5,main]) completed. Took 0.0 secs.
:runners:google-cloud-dataflow-java:worker:legacy-worker:shadowJar (Thread[Execution worker for ':' Thread 6,5,main]) started.
> Task :runners:direct-java:shadowJar
Build cache key for task ':runners:direct-java:shadowJar' is 646d5be3bb9887a22a2e8b647ae97df1
Caching disabled for task ':runners:direct-java:shadowJar': Caching has not been enabled for the task
Task ':runners:direct-java:shadowJar' is not up-to-date because:
No history is available.
Custom actions are attached to task ':runners:direct-java:shadowJar'.
*******************
GRADLE SHADOW STATS
Total Jars: 6 (includes project)
Total Time: 0.57s [570ms]
Average Time/Jar: 0.095s [95.0ms]
*******************
:runners:direct-java:shadowJar (Thread[Execution worker for ':' Thread 2,5,main]) completed. Took 0.752 secs.
:sdks:java:io:google-cloud-platform:compileTestJava (Thread[Execution worker for ':' Thread 2,5,main]) started.
> Task :sdks:java:io:google-cloud-platform:compileTestJava FROM-CACHE
Build cache key for task ':sdks:java:io:google-cloud-platform:compileTestJava' is 46a3a5f73822be4c2010aad21e5a4368
Task ':sdks:java:io:google-cloud-platform:compileTestJava' is not up-to-date because:
No history is available.
Origin for org.gradle.api.internal.tasks.execution.ExecuteActionsTaskExecuter$TaskExecution@22705665: {executionTime=18845, hostName=apache-beam-jenkins-12, operatingSystem=Linux, buildInvocationId=arrq3zxjanahxokmxlg3tkxvmu, creationTime=1586390122081, identity=:sdks:java:io:google-cloud-platform:compileTestJava, type=org.gradle.api.internal.tasks.execution.ExecuteActionsTaskExecuter.TaskExecution, userName=jenkins, gradleVersion=5.2.1, rootPath=/home/jenkins/jenkins-slave/workspace/beam_PostCommit_Java_ValidatesRunner_PortabilityApi_Dataflow/src}
Unpacked trees for task ':sdks:java:io:google-cloud-platform:compileTestJava' from cache.
:sdks:java:io:google-cloud-platform:compileTestJava (Thread[Execution worker for ':' Thread 2,5,main]) completed. Took 0.265 secs.
:sdks:java:io:google-cloud-platform:testClasses (Thread[Execution worker for ':' Thread 2,5,main]) started.
> Task :sdks:java:io:google-cloud-platform:testClasses UP-TO-DATE
Skipping task ':sdks:java:io:google-cloud-platform:testClasses' as it has no actions.
:sdks:java:io:google-cloud-platform:testClasses (Thread[Execution worker for ':' Thread 2,5,main]) completed. Took 0.0 secs.
:sdks:java:io:google-cloud-platform:testJar (Thread[Execution worker for ':' Thread 2,5,main]) started.
> Task :sdks:java:io:google-cloud-platform:testJar
Build cache key for task ':sdks:java:io:google-cloud-platform:testJar' is 6d2409cf32cc2596d61a3b729a499658
Caching disabled for task ':sdks:java:io:google-cloud-platform:testJar': Caching has not been enabled for the task
Task ':sdks:java:io:google-cloud-platform:testJar' is not up-to-date because:
No history is available.
:sdks:java:io:google-cloud-platform:testJar (Thread[Execution worker for ':' Thread 2,5,main]) completed. Took 0.056 secs.
:runners:google-cloud-dataflow-java:compileTestJava (Thread[Execution worker for ':' Thread 2,5,main]) started.
> Task :runners:google-cloud-dataflow-java:compileTestJava FROM-CACHE
Build cache key for task ':runners:google-cloud-dataflow-java:compileTestJava' is 1c7013d92543206b47133fe98665caef
Task ':runners:google-cloud-dataflow-java:compileTestJava' is not up-to-date because:
No history is available.
Origin for org.gradle.api.internal.tasks.execution.ExecuteActionsTaskExecuter$TaskExecution@1d1811f7: {executionTime=9488, hostName=apache-beam-jenkins-12, operatingSystem=Linux, buildInvocationId=arrq3zxjanahxokmxlg3tkxvmu, creationTime=1586390131701, identity=:runners:google-cloud-dataflow-java:compileTestJava, type=org.gradle.api.internal.tasks.execution.ExecuteActionsTaskExecuter.TaskExecution, userName=jenkins, gradleVersion=5.2.1, rootPath=/home/jenkins/jenkins-slave/workspace/beam_PostCommit_Java_ValidatesRunner_PortabilityApi_Dataflow/src}
Unpacked trees for task ':runners:google-cloud-dataflow-java:compileTestJava' from cache.
:runners:google-cloud-dataflow-java:compileTestJava (Thread[Execution worker for ':' Thread 2,5,main]) completed. Took 0.123 secs.
:runners:google-cloud-dataflow-java:testClasses (Thread[Execution worker for ':' Thread 2,5,main]) started.
> Task :runners:google-cloud-dataflow-java:testClasses UP-TO-DATE
Skipping task ':runners:google-cloud-dataflow-java:testClasses' as it has no actions.
:runners:google-cloud-dataflow-java:testClasses (Thread[Execution worker for ':' Thread 2,5,main]) completed. Took 0.0 secs.
:runners:google-cloud-dataflow-java:testJar (Thread[Execution worker for ':' Thread 2,5,main]) started.
> Task :runners:google-cloud-dataflow-java:testJar
Build cache key for task ':runners:google-cloud-dataflow-java:testJar' is a006f2176d34f3c2732f987e8b18bad2
Caching disabled for task ':runners:google-cloud-dataflow-java:testJar': Caching has not been enabled for the task
Task ':runners:google-cloud-dataflow-java:testJar' is not up-to-date because:
No history is available.
:runners:google-cloud-dataflow-java:testJar (Thread[Execution worker for ':' Thread 2,5,main]) completed. Took 0.027 secs.
> Task :runners:google-cloud-dataflow-java:worker:legacy-worker:shadowJar
Build cache key for task ':runners:google-cloud-dataflow-java:worker:legacy-worker:shadowJar' is 162aabc28e7d53d04eecb06b9bb909e2
Caching disabled for task ':runners:google-cloud-dataflow-java:worker:legacy-worker:shadowJar': Caching has not been enabled for the task
Task ':runners:google-cloud-dataflow-java:worker:legacy-worker:shadowJar' is not up-to-date because:
No history is available.
Custom actions are attached to task ':runners:google-cloud-dataflow-java:worker:legacy-worker:shadowJar'.
*******************
GRADLE SHADOW STATS
Total Jars: 16 (includes project)
Total Time: 3.011s [3011ms]
Average Time/Jar: 0.1881875s [188.1875ms]
*******************
:runners:google-cloud-dataflow-java:worker:legacy-worker:shadowJar (Thread[Execution worker for ':' Thread 6,5,main]) completed. Took 3.815 secs.
:sdks:java:io:file-based-io-tests:integrationTest (Thread[Execution worker for ':' Thread 6,5,main]) started.
Gradle Test Executor 1 started executing tests.
> Task :sdks:java:io:file-based-io-tests:integrationTest
Build cache key for task ':sdks:java:io:file-based-io-tests:integrationTest' is b7062cb9ebff4360ba47ebe8454cffb6
Task ':sdks:java:io:file-based-io-tests:integrationTest' is not up-to-date because:
Task.upToDateWhen is false.
Custom actions are attached to task ':sdks:java:io:file-based-io-tests:integrationTest'.
Starting process 'Gradle Test Executor 1'. Working directory: <https://builds.apache.org/job/beam_PerformanceTests_AvroIOIT_HDFS/ws/src/sdks/java/io/file-based-io-tests> Command: /usr/lib/jvm/java-8-openjdk-amd64/bin/java -DbeamTestPipelineOptions=["--bigQueryDataset=beam_performance","--bigQueryTable=avroioit_hdfs_results","--numberOfRecords=225000000","--expectedHash=2f9f5ca33ea464b25109c0297eb6aecb","--datasetSize=1089730000","--numWorkers=5","--autoscalingAlgorithm=NONE","--runner=DataflowRunner","--project=apache-beam-testing","--tempRoot=gs://temp-storage-for-perf-tests","--hdfsConfiguration=[{\"fs.defaultFS\":\"hdfs:35.224.152.188:9000\",\"dfs.replication\":1}]","--filenamePrefix=hdfs://35.224.152.188:9000/TEXTIO_IT_","--workerHarnessContainerImage=","--dataflowWorkerJar=${dataflowWorkerJar}"] -Djava.security.manager=worker.org.gradle.process.internal.worker.child.BootstrapSecurityManager -Dorg.gradle.native=false -Xmx2g -Dfile.encoding=UTF-8 -Duser.country=US -Duser.language=en -Duser.variant -ea -cp /home/jenkins/.gradle/caches/5.2.1/workerMain/gradle-worker.jar worker.org.gradle.process.internal.worker.GradleWorkerMain 'Gradle Test Executor 1'
Successfully started process 'Gradle Test Executor 1'
org.apache.beam.sdk.io.avro.AvroIOIT STANDARD_ERROR
SLF4J: Class path contains multiple SLF4J bindings.
SLF4J: Found binding in [jar:<https://builds.apache.org/job/beam_PerformanceTests_AvroIOIT_HDFS/ws/src/runners/google-cloud-dataflow-java/worker/legacy-worker/build/libs/beam-runners-google-cloud-dataflow-java-legacy-worker-2.21.0-SNAPSHOT.jar!/org/slf4j/impl/StaticLoggerBinder.class]>
SLF4J: Found binding in [jar:file:/home/jenkins/.gradle/caches/modules-2/files-2.1/org.slf4j/slf4j-jdk14/1.7.25/bccda40ebc8067491b32a88f49615a747d20082d/slf4j-jdk14-1.7.25.jar!/org/slf4j/impl/StaticLoggerBinder.class]
SLF4J: Found binding in [jar:file:/home/jenkins/.gradle/caches/modules-2/files-2.1/org.slf4j/slf4j-log4j12/1.7.25/110cefe2df103412849d72ef7a67e4e91e4266b4/slf4j-log4j12-1.7.25.jar!/org/slf4j/impl/StaticLoggerBinder.class]
SLF4J: See http://www.slf4j.org/codes.html#multiple_bindings for an explanation.
SLF4J: Actual binding is of type [org.slf4j.impl.JDK14LoggerFactory]
Gradle Test Executor 1 finished executing tests.
> Task :sdks:java:io:file-based-io-tests:integrationTest
org.apache.beam.sdk.io.avro.AvroIOIT > writeThenReadAll FAILED
java.lang.RuntimeException: Failed to construct instance from factory method DataflowRunner#fromOptions(interface org.apache.beam.sdk.options.PipelineOptions)
at org.apache.beam.sdk.util.InstanceBuilder.buildFromMethod(InstanceBuilder.java:224)
at org.apache.beam.sdk.util.InstanceBuilder.build(InstanceBuilder.java:155)
at org.apache.beam.sdk.PipelineRunner.fromOptions(PipelineRunner.java:55)
at org.apache.beam.sdk.Pipeline.run(Pipeline.java:311)
at org.apache.beam.sdk.testing.TestPipeline.run(TestPipeline.java:350)
at org.apache.beam.sdk.testing.TestPipeline.run(TestPipeline.java:331)
at org.apache.beam.sdk.io.avro.AvroIOIT.writeThenReadAll(AvroIOIT.java:156)
Caused by:
java.lang.reflect.InvocationTargetException
at sun.reflect.NativeMethodAccessorImpl.invoke0(Native Method)
at sun.reflect.NativeMethodAccessorImpl.invoke(NativeMethodAccessorImpl.java:62)
at sun.reflect.DelegatingMethodAccessorImpl.invoke(DelegatingMethodAccessorImpl.java:43)
at java.lang.reflect.Method.invoke(Method.java:498)
at org.apache.beam.sdk.util.InstanceBuilder.buildFromMethod(InstanceBuilder.java:214)
... 6 more
Caused by:
java.lang.IllegalArgumentException: Missing required values: region
at org.apache.beam.runners.dataflow.DataflowRunner.fromOptions(DataflowRunner.java:246)
... 11 more
1 test completed, 1 failed
Finished generating test XML results (0.013 secs) into: <https://builds.apache.org/job/beam_PerformanceTests_AvroIOIT_HDFS/ws/src/sdks/java/io/file-based-io-tests/build/test-results/integrationTest>
Generating HTML test report...
Finished generating test html results (0.024 secs) into: <https://builds.apache.org/job/beam_PerformanceTests_AvroIOIT_HDFS/ws/src/sdks/java/io/file-based-io-tests/build/reports/tests/integrationTest>
> Task :sdks:java:io:file-based-io-tests:integrationTest FAILED
:sdks:java:io:file-based-io-tests:integrationTest (Thread[Execution worker for ':' Thread 6,5,main]) completed. Took 5.334 secs.
FAILURE: Build failed with an exception.
* What went wrong:
Execution failed for task ':sdks:java:io:file-based-io-tests:integrationTest'.
> There were failing tests. See the report at: file://<https://builds.apache.org/job/beam_PerformanceTests_AvroIOIT_HDFS/ws/src/sdks/java/io/file-based-io-tests/build/reports/tests/integrationTest/index.html>
* Try:
Run with --stacktrace option to get the stack trace. Run with --debug option to get more log output. Run with --scan to get full insights.
* Get more help at https://help.gradle.org
Deprecated Gradle features were used in this build, making it incompatible with Gradle 6.0.
Use '--warning-mode all' to show the individual deprecation warnings.
See https://docs.gradle.org/5.2.1/userguide/command_line_interface.html#sec:command_line_warnings
BUILD FAILED in 49s
92 actionable tasks: 58 executed, 34 from cache
Publishing build scan...
https://gradle.com/s/ajjmc2i34iy4u
Build step 'Invoke Gradle script' changed build result to FAILURE
Build step 'Invoke Gradle script' marked build as failure
---------------------------------------------------------------------
To unsubscribe, e-mail: builds-unsubscribe@beam.apache.org
For additional commands, e-mail: builds-help@beam.apache.org
Jenkins build is back to normal :
beam_PerformanceTests_AvroIOIT_HDFS #2930
Posted by Apache Jenkins Server <je...@builds.apache.org>.
See <https://builds.apache.org/job/beam_PerformanceTests_AvroIOIT_HDFS/2930/display/redirect?page=changes>
---------------------------------------------------------------------
To unsubscribe, e-mail: builds-unsubscribe@beam.apache.org
For additional commands, e-mail: builds-help@beam.apache.org