You are viewing a plain text version of this content. The canonical link for it is here.
Posted to dev@brooklyn.apache.org by Apache Jenkins Server <je...@builds.apache.org> on 2017/05/08 03:55:52 UTC
Build failed in Jenkins: brooklyn-library-master #274
See <https://builds.apache.org/job/brooklyn-library-master/274/display/redirect>
------------------------------------------
[...truncated 238.78 KB...]
at org.apache.brooklyn.core.test.BrooklynMgmtUnitTestSupport.tearDown(BrooklynMgmtUnitTestSupport.java:58)
at java.util.concurrent.Executors$RunnableAdapter.call(Executors.java:511)
at java.util.concurrent.FutureTask.run(FutureTask.java:266)
at java.util.concurrent.ThreadPoolExecutor.runWorker(ThreadPoolExecutor.java:1142)
at java.util.concurrent.ThreadPoolExecutor$Worker.run(ThreadPoolExecutor.java:617)
at java.lang.Thread.run(Thread.java:745)
2017-05-08 03:55:26,438 INFO TESTNG INVOKING CONFIGURATION: "Surefire test" - @AfterMethod org.apache.brooklyn.core.test.BrooklynMgmtUnitTestSupport.tearDown()
2017-05-08 03:55:26,454 INFO TESTNG PASSED CONFIGURATION: "Surefire test" - @AfterMethod org.apache.brooklyn.core.test.BrooklynMgmtUnitTestSupport.tearDown() finished in 16 ms
2017-05-08 03:55:26,454 INFO TESTNG INVOKING CONFIGURATION: "Surefire test" - @BeforeMethod org.apache.brooklyn.entity.dns.AbstractGeoDnsServiceTest.setUp()
2017-05-08 03:55:26,468 WARN Deprecated use of unmanaged location (SshMachineLocation[West child:null@100.0.0.1/100.0.0.1:22(id=fahm9uvyiw)]); will be managed automatically now but not supported in future versions
2017-05-08 03:55:26,469 WARN Deprecated use of unmanaged location (SshMachineLocation[West child with location:null@100.0.0.1/100.0.0.1:22(id=z30o23d95t)]); will be managed automatically now but not supported in future versions
2017-05-08 03:55:26,470 WARN Deprecated use of unmanaged location (SshMachineLocation[East child:null@100.0.0.2/100.0.0.2:22(id=sdpmy7s71w)]); will be managed automatically now but not supported in future versions
2017-05-08 03:55:26,471 WARN Deprecated use of unmanaged location (SshMachineLocation[East child with location:null@100.0.0.2/100.0.0.2:22(id=atshh4hhok)]); will be managed automatically now but not supported in future versions
2017-05-08 03:55:26,472 WARN Deprecated use of unmanaged location (SshMachineLocation[North child:null@10.0.0.1/10.0.0.1:22(id=qahaahqcig)]); will be managed automatically now but not supported in future versions
2017-05-08 03:55:26,477 INFO No Camp-YAML parser registered for parsing catalog item DSL; skipping DSL-parsing
2017-05-08 03:55:26,511 INFO TESTNG PASSED CONFIGURATION: "Surefire test" - @BeforeMethod org.apache.brooklyn.entity.dns.AbstractGeoDnsServiceTest.setUp() finished in 57 ms
2017-05-08 03:55:26,511 INFO TESTNG INVOKING: "Surefire test" - org.apache.brooklyn.entity.dns.AbstractGeoDnsServiceTest.testSubscribesToHostname()
2017-05-08 03:55:26,511 INFO TESTNG SKIPPED: "Surefire test" - org.apache.brooklyn.entity.dns.AbstractGeoDnsServiceTest.testSubscribesToHostname() finished in 0 ms
org.testng.internal.thread.ThreadTimeoutException: Method org.apache.brooklyn.core.test.BrooklynMgmtUnitTestSupport.tearDown() didn't finish within the time-out 30000
at org.apache.brooklyn.core.test.BrooklynMgmtUnitTestSupport.destroyManagementContextSafely(BrooklynMgmtUnitTestSupport.java:73)
at org.apache.brooklyn.core.test.BrooklynMgmtUnitTestSupport.tearDown(BrooklynMgmtUnitTestSupport.java:58)
at java.util.concurrent.Executors$RunnableAdapter.call(Executors.java:511)
at java.util.concurrent.FutureTask.run(FutureTask.java:266)
at java.util.concurrent.ThreadPoolExecutor.runWorker(ThreadPoolExecutor.java:1142)
at java.util.concurrent.ThreadPoolExecutor$Worker.run(ThreadPoolExecutor.java:617)
at java.lang.Thread.run(Thread.java:745)
2017-05-08 03:55:26,512 INFO TESTNG INVOKING CONFIGURATION: "Surefire test" - @AfterMethod org.apache.brooklyn.core.test.BrooklynMgmtUnitTestSupport.tearDown()
2017-05-08 03:55:26,524 INFO TESTNG PASSED CONFIGURATION: "Surefire test" - @AfterMethod org.apache.brooklyn.core.test.BrooklynMgmtUnitTestSupport.tearDown() finished in 13 ms
2017-05-08 03:55:26,524 INFO TESTNG INVOKING CONFIGURATION: "Surefire test" - @BeforeMethod org.apache.brooklyn.entity.webapp.DynamicWebAppFabricTest.setUp()
2017-05-08 03:55:26,536 INFO TESTNG PASSED CONFIGURATION: "Surefire test" - @BeforeMethod org.apache.brooklyn.entity.webapp.DynamicWebAppFabricTest.setUp() finished in 12 ms
2017-05-08 03:55:26,537 INFO TESTNG INVOKING: "Surefire test" - org.apache.brooklyn.entity.webapp.DynamicWebAppFabricTest.testRequestCountAggregation()
2017-05-08 03:55:26,638 INFO No Camp-YAML parser registered for parsing catalog item DSL; skipping DSL-parsing
2017-05-08 03:55:26,647 INFO Creating entity in fabric DynamicWebAppFabricImpl{id=mwp79e7yjs} at SimulatedLocation{id=ms9ad3l9r7, name=SimulatedLocation:ms9a}
[GC (Allocation Failure) 262105K->26184K(774656K), 0.0159852 secs]
2017-05-08 03:55:26,775 WARN Task Task[sensor bhis8tkhxc:group.members.removed]@GumzObwY is being finalized before completion
2017-05-08 03:55:26,775 WARN Task Task[sensor bhis8tkhxc:group.members.removed]@PlYIOFED is being finalized before completion
2017-05-08 03:55:26,820 WARN Set no-arg constructor accessible for class org.apache.brooklyn.entity.software.base.SoftwareProcessImpl$UpdatingNotUpFromServiceProcessIsRunning (deprecated; should have public no-arg constructor)
2017-05-08 03:55:26,820 WARN Set no-arg constructor accessible for class org.apache.brooklyn.entity.software.base.SoftwareProcessImpl$ServiceNotUpDiagnosticsCollector (deprecated; should have public no-arg constructor)
2017-05-08 03:55:26,824 INFO Creating entity in fabric DynamicWebAppFabricImpl{id=mwp79e7yjs} at SimulatedLocation{id=aw0a4hcs02, name=SimulatedLocation:aw0a}
2017-05-08 03:55:26,973 WARN Set no-arg constructor accessible for class org.apache.brooklyn.entity.software.base.SoftwareProcessImpl$UpdatingNotUpFromServiceProcessIsRunning (deprecated; should have public no-arg constructor)
2017-05-08 03:55:26,974 WARN Set no-arg constructor accessible for class org.apache.brooklyn.entity.software.base.SoftwareProcessImpl$ServiceNotUpDiagnosticsCollector (deprecated; should have public no-arg constructor)
2017-05-08 03:55:26,987 INFO TESTNG PASSED: "Surefire test" - org.apache.brooklyn.entity.webapp.DynamicWebAppFabricTest.testRequestCountAggregation() finished in 451 ms
2017-05-08 03:55:26,988 INFO TESTNG INVOKING CONFIGURATION: "Surefire test" - @AfterMethod org.apache.brooklyn.entity.webapp.DynamicWebAppFabricTest.tearDown()
2017-05-08 03:55:26,998 INFO TESTNG PASSED CONFIGURATION: "Surefire test" - @AfterMethod org.apache.brooklyn.entity.webapp.DynamicWebAppFabricTest.tearDown() finished in 11 ms
2017-05-08 03:55:26,998 INFO TESTNG INVOKING CONFIGURATION: "Surefire test" - @BeforeMethod org.apache.brooklyn.entity.webapp.DynamicWebAppFabricTest.setUp()
2017-05-08 03:55:27,011 INFO TESTNG PASSED CONFIGURATION: "Surefire test" - @BeforeMethod org.apache.brooklyn.entity.webapp.DynamicWebAppFabricTest.setUp() finished in 13 ms
2017-05-08 03:55:27,012 INFO TESTNG INVOKING: "Surefire test" - org.apache.brooklyn.entity.webapp.DynamicWebAppFabricTest.testRequestCountAggregationOverClusters()
2017-05-08 03:55:27,105 INFO No Camp-YAML parser registered for parsing catalog item DSL; skipping DSL-parsing
2017-05-08 03:55:27,109 INFO Creating entity in fabric DynamicWebAppFabricImpl{id=htazzhtkn5} at SimulatedLocation{id=wehfxpto1u, name=SimulatedLocation:wehf}
[GC (Allocation Failure) 265288K->24505K(775680K), 0.0103294 secs]
2017-05-08 03:55:27,137 WARN Task Task[sensor mwp79e7yjs:group.members.removed]@WorLM3AQ is being finalized before completion
2017-05-08 03:55:27,138 WARN Task Task[sensor mwp79e7yjs:group.members.removed]@GB1BULxh is being finalized before completion
2017-05-08 03:55:27,138 WARN Task Task[sensor mwp79e7yjs:group.members.removed]@z55Y7daF is being finalized before completion
2017-05-08 03:55:27,138 WARN Task Task[sensor mwp79e7yjs:group.members.removed]@vNniSXfC is being finalized before completion
2017-05-08 03:55:27,138 WARN Task Task[sensor mwp79e7yjs:group.members.removed]@FXNfWbX6 is being finalized before completion
2017-05-08 03:55:27,138 WARN Task Task[sensor mwp79e7yjs:group.members.removed]@s8twcVmw is being finalized before completion
2017-05-08 03:55:27,138 WARN Task Task[sensor mwp79e7yjs:group.members.removed]@p90YpwZB is being finalized before completion
2017-05-08 03:55:27,138 WARN Task Task[sensor mwp79e7yjs:group.members.removed]@dktv9CEE is being finalized before completion
2017-05-08 03:55:27,138 WARN Task Task[sensor mwp79e7yjs:entity.children.removed]@CqNP5PO4 is being finalized before completion
2017-05-08 03:55:27,138 WARN Task Task[sensor mwp79e7yjs:entity.children.removed]@oKAHKYfb is being finalized before completion
2017-05-08 03:55:27,138 WARN Task Task[sensor mwp79e7yjs:group.members.removed]@cNmtrxAN is being finalized before completion
2017-05-08 03:55:27,138 WARN Task Task[sensor mwp79e7yjs:group.members.removed]@OP0Ou7bf is being finalized before completion
2017-05-08 03:55:27,138 WARN Task Task[sensor mwp79e7yjs:group.members.removed]@pgSFTAxg is being finalized before completion
2017-05-08 03:55:27,138 WARN Task Task[sensor mwp79e7yjs:group.members.removed]@oXIfHjSL is being finalized before completion
2017-05-08 03:55:27,138 WARN Task Task[sensor mwp79e7yjs:group.members.removed]@TIC7XL9Z is being finalized before completion
2017-05-08 03:55:27,138 WARN Task Task[sensor mwp79e7yjs:group.members.removed]@o6KLmYKu is being finalized before completion
2017-05-08 03:55:27,218 INFO Creating entity in fabric DynamicWebAppFabricImpl{id=htazzhtkn5} at SimulatedLocation{id=kms9u5yui0, name=SimulatedLocation:kms9}
2017-05-08 03:55:27,228 INFO Resize DynamicWebAppClusterImpl{id=igyzffh9rr} from 0 to 2
2017-05-08 03:55:27,322 INFO Resize DynamicWebAppClusterImpl{id=lbvxf2fy1j} from 0 to 2
[GC (Allocation Failure) 264633K->25075K(775168K), 0.0077402 secs]
2017-05-08 03:55:27,382 WARN Set no-arg constructor accessible for class org.apache.brooklyn.entity.software.base.SoftwareProcessImpl$UpdatingNotUpFromServiceProcessIsRunning (deprecated; should have public no-arg constructor)
2017-05-08 03:55:27,382 WARN Set no-arg constructor accessible for class org.apache.brooklyn.entity.software.base.SoftwareProcessImpl$ServiceNotUpDiagnosticsCollector (deprecated; should have public no-arg constructor)
2017-05-08 03:55:27,477 WARN Set no-arg constructor accessible for class org.apache.brooklyn.entity.software.base.SoftwareProcessImpl$UpdatingNotUpFromServiceProcessIsRunning (deprecated; should have public no-arg constructor)
2017-05-08 03:55:27,478 WARN Set no-arg constructor accessible for class org.apache.brooklyn.entity.software.base.SoftwareProcessImpl$ServiceNotUpDiagnosticsCollector (deprecated; should have public no-arg constructor)
[GC (Allocation Failure) 265203K->25356K(776704K), 0.0128663 secs]
2017-05-08 03:55:27,544 WARN Set no-arg constructor accessible for class org.apache.brooklyn.entity.software.base.SoftwareProcessImpl$UpdatingNotUpFromServiceProcessIsRunning (deprecated; should have public no-arg constructor)
2017-05-08 03:55:27,545 WARN Set no-arg constructor accessible for class org.apache.brooklyn.entity.software.base.SoftwareProcessImpl$ServiceNotUpDiagnosticsCollector (deprecated; should have public no-arg constructor)
2017-05-08 03:55:27,645 WARN Set no-arg constructor accessible for class org.apache.brooklyn.entity.software.base.SoftwareProcessImpl$UpdatingNotUpFromServiceProcessIsRunning (deprecated; should have public no-arg constructor)
2017-05-08 03:55:27,645 WARN Set no-arg constructor accessible for class org.apache.brooklyn.entity.software.base.SoftwareProcessImpl$ServiceNotUpDiagnosticsCollector (deprecated; should have public no-arg constructor)
2017-05-08 03:55:27,682 INFO TESTNG PASSED: "Surefire test" - org.apache.brooklyn.entity.webapp.DynamicWebAppFabricTest.testRequestCountAggregationOverClusters() finished in 670 ms
2017-05-08 03:55:27,683 INFO TESTNG INVOKING CONFIGURATION: "Surefire test" - @AfterMethod org.apache.brooklyn.entity.webapp.DynamicWebAppFabricTest.tearDown()
2017-05-08 03:55:27,699 INFO TESTNG PASSED CONFIGURATION: "Surefire test" - @AfterMethod org.apache.brooklyn.entity.webapp.DynamicWebAppFabricTest.tearDown() finished in 17 ms
2017-05-08 03:55:27,745 INFO TESTNG
===============================================
Surefire test
Tests run: 41, Failures: 0, Skips: 4
Configuration Failures: 1, Skips: 0
===============================================
2017-05-08 03:55:27,746 WARN Management Context LocalManagementContext[?-OS8s1axY] running, creation stacktrace:
java.lang.Throwable: for construction stacktrace
at org.apache.brooklyn.core.mgmt.internal.LocalManagementContext.<init>(LocalManagementContext.java:142)
at org.apache.brooklyn.core.mgmt.internal.LocalManagementContext.<init>(LocalManagementContext.java:175)
at org.apache.brooklyn.core.mgmt.internal.LocalManagementContext.<init>(LocalManagementContext.java:167)
at org.apache.brooklyn.core.mgmt.internal.LocalManagementContext.<init>(LocalManagementContext.java:154)
at org.apache.brooklyn.core.test.entity.LocalManagementContextForTests.<init>(LocalManagementContextForTests.java:44)
at org.apache.brooklyn.core.test.entity.LocalManagementContextForTests$Builder.build(LocalManagementContextForTests.java:184)
at org.apache.brooklyn.core.test.entity.LocalManagementContextForTests.newInstance(LocalManagementContextForTests.java:199)
at org.apache.brooklyn.core.test.BrooklynMgmtUnitTestSupport.setUp(BrooklynMgmtUnitTestSupport.java:50)
at org.apache.brooklyn.core.test.BrooklynAppUnitTestSupport.setUp(BrooklynAppUnitTestSupport.java:38)
at org.apache.brooklyn.entity.dns.AbstractGeoDnsServiceTest.setUp(AbstractGeoDnsServiceTest.java:98)
at sun.reflect.NativeMethodAccessorImpl.invoke0(Native Method)
at sun.reflect.NativeMethodAccessorImpl.invoke(NativeMethodAccessorImpl.java:62)
at sun.reflect.DelegatingMethodAccessorImpl.invoke(DelegatingMethodAccessorImpl.java:43)
at java.lang.reflect.Method.invoke(Method.java:498)
at org.testng.internal.MethodInvocationHelper.invokeMethod(MethodInvocationHelper.java:104)
at org.testng.internal.Invoker.invokeConfigurationMethod(Invoker.java:515)
at org.testng.internal.Invoker.invokeConfigurations(Invoker.java:217)
at org.testng.internal.Invoker.invokeMethod(Invoker.java:590)
at org.testng.internal.Invoker.invokeTestMethod(Invoker.java:851)
at org.testng.internal.Invoker.invokeTestMethods(Invoker.java:1177)
at org.testng.internal.TestMethodWorker.invokeTestMethods(TestMethodWorker.java:129)
at org.testng.internal.TestMethodWorker.run(TestMethodWorker.java:112)
at org.testng.TestRunner.privateRun(TestRunner.java:756)
at org.testng.TestRunner.run(TestRunner.java:610)
at org.testng.SuiteRunner.runTest(SuiteRunner.java:387)
at org.testng.SuiteRunner.runSequentially(SuiteRunner.java:382)
at org.testng.SuiteRunner.privateRun(SuiteRunner.java:340)
at org.testng.SuiteRunner.run(SuiteRunner.java:289)
at org.testng.SuiteRunnerWorker.runSuite(SuiteRunnerWorker.java:52)
at org.testng.SuiteRunnerWorker.run(SuiteRunnerWorker.java:86)
at org.testng.TestNG.runSuitesSequentially(TestNG.java:1293)
at org.testng.TestNG.runSuitesLocally(TestNG.java:1218)
at org.testng.TestNG.runSuites(TestNG.java:1133)
at org.testng.TestNG.run(TestNG.java:1104)
at org.apache.maven.surefire.testng.TestNGExecutor.run(TestNGExecutor.java:132)
at org.apache.maven.surefire.testng.TestNGDirectoryTestSuite.executeMulti(TestNGDirectoryTestSuite.java:193)
at org.apache.maven.surefire.testng.TestNGDirectoryTestSuite.execute(TestNGDirectoryTestSuite.java:94)
at org.apache.maven.surefire.testng.TestNGProvider.invoke(TestNGProvider.java:147)
at org.apache.maven.surefire.booter.ForkedBooter.invokeProviderInSameClassLoader(ForkedBooter.java:290)
at org.apache.maven.surefire.booter.ForkedBooter.runSuitesInProcess(ForkedBooter.java:242)
at org.apache.maven.surefire.booter.ForkedBooter.main(ForkedBooter.java:121)
2017-05-08 03:55:27,746 INFO BrooklynLeakListener.onFinish attempting to terminate all extant ManagementContexts: name=Surefire test; includedGroups=[]; excludedGroups=[Integration, Acceptance, Live, Live-sanity, WIP, Broken]; suiteName=Surefire suite; outDir=<https://builds.apache.org/job/brooklyn-library-master/ws/software/webapp/target/surefire-reports/Surefire> suite: 1 ManagementContexts terminated
2017-05-08 03:55:27,748 ERROR Problem refreshing group membership: org.apache.brooklyn.util.exceptions.RuntimeInterruptedException: java.lang.InterruptedException
org.apache.brooklyn.util.exceptions.RuntimeInterruptedException: java.lang.InterruptedException
at org.apache.brooklyn.util.exceptions.Exceptions.propagate(Exceptions.java:124) ~[brooklyn-utils-common-0.12.0-SNAPSHOT.jar:0.12.0-SNAPSHOT]
Caused by: java.lang.InterruptedException: null
at java.util.concurrent.FutureTask.awaitDone(FutureTask.java:404) [na:1.8.0_121]
Tests run: 42, Failures: 1, Errors: 0, Skipped: 4, Time elapsed: 50.947 sec <<< FAILURE! - in TestSuite
tearDown(org.apache.brooklyn.entity.dns.AbstractGeoDnsServiceTest) Time elapsed: 30.077 sec <<< FAILURE!
org.testng.internal.thread.ThreadTimeoutException: Method org.apache.brooklyn.core.test.BrooklynMgmtUnitTestSupport.tearDown() didn't finish within the time-out 30000
Results :
Failed tests:
AbstractGeoDnsServiceTest>BrooklynMgmtUnitTestSupport.tearDown:58->BrooklynMgmtUnitTestSupport.destroyManagementContextSafely:73 » ThreadTimeout
Tests run: 42, Failures: 1, Errors: 0, Skipped: 4
[JENKINS] Recording test results
[INFO] ------------------------------------------------------------------------
[INFO] Reactor Summary:
[INFO]
[INFO] Brooklyn Library Root .............................. SUCCESS [ 3.731 s]
[INFO] Brooklyn CM SaltStack .............................. SUCCESS [ 32.858 s]
[INFO] Brooklyn CM Ansible ................................ SUCCESS [ 6.164 s]
[INFO] Brooklyn CM Integration Root ....................... SUCCESS [ 0.843 s]
[INFO] Brooklyn Network Software Entities ................. SUCCESS [ 6.674 s]
[INFO] Brooklyn OSGi Software Entities .................... SUCCESS [ 6.629 s]
[INFO] Brooklyn Database Software Entities ................ SUCCESS [ 9.356 s]
[INFO] Brooklyn Web App Software Entities ................. FAILURE [ 56.874 s]
[INFO] Brooklyn Messaging Software Entities ............... SKIPPED
[INFO] Brooklyn NoSQL Data Store Software Entities ........ SKIPPED
[INFO] Brooklyn Monitoring Software Entities .............. SKIPPED
[INFO] Brooklyn QA ........................................ SKIPPED
[INFO] Brooklyn Examples Aggregator Project ............... SKIPPED
[INFO] Brooklyn Examples Aggregator Project - Webapps ..... SKIPPED
[INFO] hello-world-webapp Maven Webapp .................... SKIPPED
[INFO] hello-world-sql-webapp Maven Webapp ................ SKIPPED
[INFO] Brooklyn Simple Web Cluster Example ................ SKIPPED
[INFO] Brooklyn Global Web Fabric Example ................. SKIPPED
[INFO] Brooklyn Simple Messaging Publish-Subscribe Example SKIPPED
[INFO] Brooklyn NoSQL Cluster Examples .................... SKIPPED
[INFO] Brooklyn Library Karaf integration ................. SKIPPED
[INFO] Brooklyn Library Catalog ........................... SKIPPED
[INFO] Brooklyn Library Karaf Features .................... SKIPPED
[INFO] ------------------------------------------------------------------------
[INFO] BUILD FAILURE
[INFO] ------------------------------------------------------------------------
[INFO] Total time: 02:19 min
[INFO] Finished at: 2017-05-08T03:55:33+00:00
[INFO] Final Memory: 93M/728M
[INFO] ------------------------------------------------------------------------
Waiting for Jenkins to finish collecting data
[ERROR] Failed to execute goal org.apache.maven.plugins:maven-surefire-plugin:2.19.1:test (default-test) on project brooklyn-software-webapp: There are test failures.
[ERROR]
[ERROR] Please refer to <https://builds.apache.org/job/brooklyn-library-master/ws/software/webapp/target/surefire-reports> for the individual test results.
[ERROR] -> [Help 1]
[ERROR]
[ERROR] To see the full stack trace of the errors, re-run Maven with the -e switch.
[ERROR] Re-run Maven using the -X switch to enable full debug logging.
[ERROR]
[ERROR] For more information about the errors and possible solutions, please read the following articles:
[ERROR] [Help 1] http://cwiki.apache.org/confluence/display/MAVEN/MojoFailureException
[ERROR]
[ERROR] After correcting the problems, you can resume the build with the command
[ERROR] mvn <goals> -rf :brooklyn-software-webapp
[JENKINS] Archiving <https://builds.apache.org/job/brooklyn-library-master/ws/software/cm/salt/pom.xml> to org.apache.brooklyn/brooklyn-software-cm-salt/0.12.0-SNAPSHOT/brooklyn-software-cm-salt-0.12.0-SNAPSHOT.pom
[JENKINS] Archiving <https://builds.apache.org/job/brooklyn-library-master/ws/software/cm/salt/target/brooklyn-software-cm-salt-0.12.0-SNAPSHOT.jar> to org.apache.brooklyn/brooklyn-software-cm-salt/0.12.0-SNAPSHOT/brooklyn-software-cm-salt-0.12.0-SNAPSHOT.jar
[JENKINS] Archiving <https://builds.apache.org/job/brooklyn-library-master/ws/software/cm/salt/target/brooklyn-software-cm-salt-0.12.0-SNAPSHOT-tests.jar> to org.apache.brooklyn/brooklyn-software-cm-salt/0.12.0-SNAPSHOT/brooklyn-software-cm-salt-0.12.0-SNAPSHOT-tests.jar
[JENKINS] Archiving <https://builds.apache.org/job/brooklyn-library-master/ws/software/cm/salt/target/brooklyn-software-cm-salt-0.12.0-SNAPSHOT-sources.jar> to org.apache.brooklyn/brooklyn-software-cm-salt/0.12.0-SNAPSHOT/brooklyn-software-cm-salt-0.12.0-SNAPSHOT-sources.jar
[JENKINS] Archiving <https://builds.apache.org/job/brooklyn-library-master/ws/software/cm/salt/target/brooklyn-software-cm-salt-0.12.0-SNAPSHOT-test-sources.jar> to org.apache.brooklyn/brooklyn-software-cm-salt/0.12.0-SNAPSHOT/brooklyn-software-cm-salt-0.12.0-SNAPSHOT-test-sources.jar
No artifacts from brooklyn-library-master » Brooklyn CM SaltStack #273 to compare, so performing full copy of artifacts
[JENKINS] Archiving <https://builds.apache.org/job/brooklyn-library-master/ws/software/osgi/pom.xml> to org.apache.brooklyn/brooklyn-software-osgi/0.12.0-SNAPSHOT/brooklyn-software-osgi-0.12.0-SNAPSHOT.pom
[JENKINS] Archiving <https://builds.apache.org/job/brooklyn-library-master/ws/software/osgi/target/brooklyn-software-osgi-0.12.0-SNAPSHOT.jar> to org.apache.brooklyn/brooklyn-software-osgi/0.12.0-SNAPSHOT/brooklyn-software-osgi-0.12.0-SNAPSHOT.jar
[JENKINS] Archiving <https://builds.apache.org/job/brooklyn-library-master/ws/software/osgi/target/brooklyn-software-osgi-0.12.0-SNAPSHOT-tests.jar> to org.apache.brooklyn/brooklyn-software-osgi/0.12.0-SNAPSHOT/brooklyn-software-osgi-0.12.0-SNAPSHOT-tests.jar
[JENKINS] Archiving <https://builds.apache.org/job/brooklyn-library-master/ws/software/osgi/target/brooklyn-software-osgi-0.12.0-SNAPSHOT-sources.jar> to org.apache.brooklyn/brooklyn-software-osgi/0.12.0-SNAPSHOT/brooklyn-software-osgi-0.12.0-SNAPSHOT-sources.jar
[JENKINS] Archiving <https://builds.apache.org/job/brooklyn-library-master/ws/software/osgi/target/brooklyn-software-osgi-0.12.0-SNAPSHOT-test-sources.jar> to org.apache.brooklyn/brooklyn-software-osgi/0.12.0-SNAPSHOT/brooklyn-software-osgi-0.12.0-SNAPSHOT-test-sources.jar
No artifacts from brooklyn-library-master » Brooklyn OSGi Software Entities #273 to compare, so performing full copy of artifacts
[JENKINS] Archiving <https://builds.apache.org/job/brooklyn-library-master/ws/pom.xml> to org.apache.brooklyn/brooklyn-library/0.12.0-SNAPSHOT/brooklyn-library-0.12.0-SNAPSHOT.pom
No artifacts from brooklyn-library-master » Brooklyn Library Root #273 to compare, so performing full copy of artifacts
[JENKINS] Archiving <https://builds.apache.org/job/brooklyn-library-master/ws/software/database/pom.xml> to org.apache.brooklyn/brooklyn-software-database/0.12.0-SNAPSHOT/brooklyn-software-database-0.12.0-SNAPSHOT.pom
[JENKINS] Archiving <https://builds.apache.org/job/brooklyn-library-master/ws/software/database/target/brooklyn-software-database-0.12.0-SNAPSHOT.jar> to org.apache.brooklyn/brooklyn-software-database/0.12.0-SNAPSHOT/brooklyn-software-database-0.12.0-SNAPSHOT.jar
[JENKINS] Archiving <https://builds.apache.org/job/brooklyn-library-master/ws/software/database/target/brooklyn-software-database-0.12.0-SNAPSHOT-tests.jar> to org.apache.brooklyn/brooklyn-software-database/0.12.0-SNAPSHOT/brooklyn-software-database-0.12.0-SNAPSHOT-tests.jar
[JENKINS] Archiving <https://builds.apache.org/job/brooklyn-library-master/ws/software/database/target/brooklyn-software-database-0.12.0-SNAPSHOT-sources.jar> to org.apache.brooklyn/brooklyn-software-database/0.12.0-SNAPSHOT/brooklyn-software-database-0.12.0-SNAPSHOT-sources.jar
[JENKINS] Archiving <https://builds.apache.org/job/brooklyn-library-master/ws/software/database/target/brooklyn-software-database-0.12.0-SNAPSHOT-test-sources.jar> to org.apache.brooklyn/brooklyn-software-database/0.12.0-SNAPSHOT/brooklyn-software-database-0.12.0-SNAPSHOT-test-sources.jar
No artifacts from brooklyn-library-master » Brooklyn Database Software Entities #273 to compare, so performing full copy of artifacts
[JENKINS] Archiving <https://builds.apache.org/job/brooklyn-library-master/ws/examples/webapps/hello-world-webapp/pom.xml> to org.apache.brooklyn.example/brooklyn-example-hello-world-webapp/0.12.0-SNAPSHOT/brooklyn-example-hello-world-webapp-0.12.0-SNAPSHOT.pom
[JENKINS] Archiving <https://builds.apache.org/job/brooklyn-library-master/ws/software/messaging/pom.xml> to org.apache.brooklyn/brooklyn-software-messaging/0.12.0-SNAPSHOT/brooklyn-software-messaging-0.12.0-SNAPSHOT.pom
[JENKINS] Archiving <https://builds.apache.org/job/brooklyn-library-master/ws/qa/pom.xml> to org.apache.brooklyn/brooklyn-qa/0.12.0-SNAPSHOT/brooklyn-qa-0.12.0-SNAPSHOT.pom
[JENKINS] Archiving <https://builds.apache.org/job/brooklyn-library-master/ws/software/cm/ansible/pom.xml> to org.apache.brooklyn/brooklyn-software-cm-ansible/0.12.0-SNAPSHOT/brooklyn-software-cm-ansible-0.12.0-SNAPSHOT.pom
[JENKINS] Archiving <https://builds.apache.org/job/brooklyn-library-master/ws/software/cm/ansible/target/brooklyn-software-cm-ansible-0.12.0-SNAPSHOT.jar> to org.apache.brooklyn/brooklyn-software-cm-ansible/0.12.0-SNAPSHOT/brooklyn-software-cm-ansible-0.12.0-SNAPSHOT.jar
[JENKINS] Archiving <https://builds.apache.org/job/brooklyn-library-master/ws/software/cm/ansible/target/brooklyn-software-cm-ansible-0.12.0-SNAPSHOT-tests.jar> to org.apache.brooklyn/brooklyn-software-cm-ansible/0.12.0-SNAPSHOT/brooklyn-software-cm-ansible-0.12.0-SNAPSHOT-tests.jar
[JENKINS] Archiving <https://builds.apache.org/job/brooklyn-library-master/ws/software/cm/ansible/target/brooklyn-software-cm-ansible-0.12.0-SNAPSHOT-sources.jar> to org.apache.brooklyn/brooklyn-software-cm-ansible/0.12.0-SNAPSHOT/brooklyn-software-cm-ansible-0.12.0-SNAPSHOT-sources.jar
[JENKINS] Archiving <https://builds.apache.org/job/brooklyn-library-master/ws/software/cm/ansible/target/brooklyn-software-cm-ansible-0.12.0-SNAPSHOT-test-sources.jar> to org.apache.brooklyn/brooklyn-software-cm-ansible/0.12.0-SNAPSHOT/brooklyn-software-cm-ansible-0.12.0-SNAPSHOT-test-sources.jar
No artifacts from brooklyn-library-master » Brooklyn CM Ansible #273 to compare, so performing full copy of artifacts
[JENKINS] Archiving <https://builds.apache.org/job/brooklyn-library-master/ws/software/monitoring/pom.xml> to org.apache.brooklyn/brooklyn-software-monitoring/0.12.0-SNAPSHOT/brooklyn-software-monitoring-0.12.0-SNAPSHOT.pom
[JENKINS] Archiving <https://builds.apache.org/job/brooklyn-library-master/ws/examples/global-web-fabric/pom.xml> to org.apache.brooklyn.example/brooklyn-example-global-web-fabric/0.12.0-SNAPSHOT/brooklyn-example-global-web-fabric-0.12.0-SNAPSHOT.pom
[JENKINS] Archiving <https://builds.apache.org/job/brooklyn-library-master/ws/karaf/catalog/pom.xml> to org.apache.brooklyn/brooklyn-library-catalog/0.12.0-SNAPSHOT/brooklyn-library-catalog-0.12.0-SNAPSHOT.pom
[JENKINS] Archiving <https://builds.apache.org/job/brooklyn-library-master/ws/software/cm/pom.xml> to org.apache.brooklyn/brooklyn-software-cm/0.12.0-SNAPSHOT/brooklyn-software-cm-0.12.0-SNAPSHOT.pom
No artifacts from brooklyn-library-master » Brooklyn CM Integration Root #273 to compare, so performing full copy of artifacts
[JENKINS] Archiving <https://builds.apache.org/job/brooklyn-library-master/ws/examples/webapps/hello-world-sql/pom.xml> to org.apache.brooklyn.example/brooklyn-example-hello-world-sql-webapp/0.12.0-SNAPSHOT/brooklyn-example-hello-world-sql-webapp-0.12.0-SNAPSHOT.pom
[JENKINS] Archiving <https://builds.apache.org/job/brooklyn-library-master/ws/examples/simple-messaging-pubsub/pom.xml> to org.apache.brooklyn.example/brooklyn-example-simple-messaging-pubsub/0.12.0-SNAPSHOT/brooklyn-example-simple-messaging-pubsub-0.12.0-SNAPSHOT.pom
[JENKINS] Archiving <https://builds.apache.org/job/brooklyn-library-master/ws/software/network/pom.xml> to org.apache.brooklyn/brooklyn-software-network/0.12.0-SNAPSHOT/brooklyn-software-network-0.12.0-SNAPSHOT.pom
[JENKINS] Archiving <https://builds.apache.org/job/brooklyn-library-master/ws/software/network/target/brooklyn-software-network-0.12.0-SNAPSHOT.jar> to org.apache.brooklyn/brooklyn-software-network/0.12.0-SNAPSHOT/brooklyn-software-network-0.12.0-SNAPSHOT.jar
[JENKINS] Archiving <https://builds.apache.org/job/brooklyn-library-master/ws/software/network/target/brooklyn-software-network-0.12.0-SNAPSHOT-tests.jar> to org.apache.brooklyn/brooklyn-software-network/0.12.0-SNAPSHOT/brooklyn-software-network-0.12.0-SNAPSHOT-tests.jar
[JENKINS] Archiving <https://builds.apache.org/job/brooklyn-library-master/ws/software/network/target/brooklyn-software-network-0.12.0-SNAPSHOT-sources.jar> to org.apache.brooklyn/brooklyn-software-network/0.12.0-SNAPSHOT/brooklyn-software-network-0.12.0-SNAPSHOT-sources.jar
[JENKINS] Archiving <https://builds.apache.org/job/brooklyn-library-master/ws/software/network/target/brooklyn-software-network-0.12.0-SNAPSHOT-test-sources.jar> to org.apache.brooklyn/brooklyn-software-network/0.12.0-SNAPSHOT/brooklyn-software-network-0.12.0-SNAPSHOT-test-sources.jar
No artifacts from brooklyn-library-master » Brooklyn Network Software Entities #273 to compare, so performing full copy of artifacts
[JENKINS] Archiving <https://builds.apache.org/job/brooklyn-library-master/ws/software/webapp/pom.xml> to org.apache.brooklyn/brooklyn-software-webapp/0.12.0-SNAPSHOT/brooklyn-software-webapp-0.12.0-SNAPSHOT.pom
[JENKINS] Archiving <https://builds.apache.org/job/brooklyn-library-master/ws/software/nosql/pom.xml> to org.apache.brooklyn/brooklyn-software-nosql/0.12.0-SNAPSHOT/brooklyn-software-nosql-0.12.0-SNAPSHOT.pom
[JENKINS] Archiving <https://builds.apache.org/job/brooklyn-library-master/ws/karaf/features/pom.xml> to org.apache.brooklyn/brooklyn-library-features/0.12.0-SNAPSHOT/brooklyn-library-features-0.12.0-SNAPSHOT.pom
[JENKINS] Archiving <https://builds.apache.org/job/brooklyn-library-master/ws/karaf/pom.xml> to org.apache.brooklyn/brooklyn-library-karaf/0.12.0-SNAPSHOT/brooklyn-library-karaf-0.12.0-SNAPSHOT.pom
[JENKINS] Archiving <https://builds.apache.org/job/brooklyn-library-master/ws/examples/simple-nosql-cluster/pom.xml> to org.apache.brooklyn.example/brooklyn-example-simple-nosql-cluster/0.12.0-SNAPSHOT/brooklyn-example-simple-nosql-cluster-0.12.0-SNAPSHOT.pom
[JENKINS] Archiving <https://builds.apache.org/job/brooklyn-library-master/ws/examples/webapps/pom.xml> to org.apache.brooklyn.example/brooklyn-examples-webapps-parent/0.12.0-SNAPSHOT/brooklyn-examples-webapps-parent-0.12.0-SNAPSHOT.pom
[JENKINS] Archiving <https://builds.apache.org/job/brooklyn-library-master/ws/examples/simple-web-cluster/pom.xml> to org.apache.brooklyn.example/brooklyn-example-simple-web-cluster/0.12.0-SNAPSHOT/brooklyn-example-simple-web-cluster-0.12.0-SNAPSHOT.pom
[JENKINS] Archiving <https://builds.apache.org/job/brooklyn-library-master/ws/examples/pom.xml> to org.apache.brooklyn.example/brooklyn-examples-parent/0.12.0-SNAPSHOT/brooklyn-examples-parent-0.12.0-SNAPSHOT.pom
channel stopped
Jenkins build is back to normal : brooklyn-library-master #277
Posted by Apache Jenkins Server <je...@builds.apache.org>.
See <https://builds.apache.org/job/brooklyn-library-master/277/display/redirect?page=changes>
Build failed in Jenkins: brooklyn-library-master #276
Posted by Apache Jenkins Server <je...@builds.apache.org>.
See <https://builds.apache.org/job/brooklyn-library-master/276/display/redirect>
------------------------------------------
[...truncated 245.45 KB...]
2017-05-10 03:59:20,548 INFO test controller reconfigure, targets []
2017-05-10 03:59:20,572 INFO TESTNG PASSED CONFIGURATION: "Surefire test" - @BeforeMethod org.apache.brooklyn.entity.proxy.AbstractControllerTest.setUp() finished in 462 ms
2017-05-10 03:59:20,572 INFO TESTNG INVOKING: "Surefire test" - org.apache.brooklyn.entity.proxy.AbstractControllerTest.testUpdateCalledWithAddressesRemovedForServiceDownChildrenThatHaveClearedHostnamePort()
2017-05-10 03:59:20,573 INFO TESTNG SKIPPED: "Surefire test" - org.apache.brooklyn.entity.proxy.AbstractControllerTest.testUpdateCalledWithAddressesRemovedForServiceDownChildrenThatHaveClearedHostnamePort() finished in 0 ms
org.testng.internal.thread.ThreadTimeoutException: Method org.apache.brooklyn.core.test.BrooklynMgmtUnitTestSupport.tearDown() didn't finish within the time-out 30000
at java.lang.Thread.currentThread(Native Method)
at java.util.concurrent.locks.ReentrantLock$NonfairSync.lock(ReentrantLock.java:207)
at java.util.concurrent.locks.ReentrantLock.lock(ReentrantLock.java:285)
at java.util.concurrent.ThreadPoolExecutor.interruptIdleWorkers(ThreadPoolExecutor.java:783)
at java.util.concurrent.ThreadPoolExecutor.tryTerminate(ThreadPoolExecutor.java:697)
at java.util.concurrent.ThreadPoolExecutor.shutdownNow(ThreadPoolExecutor.java:1426)
at com.google.common.util.concurrent.MoreExecutors$ListeningDecorator.shutdownNow(MoreExecutors.java:545)
at org.apache.brooklyn.core.entity.Entities.destroyAll(Entities.java:930)
at org.apache.brooklyn.core.test.BrooklynMgmtUnitTestSupport.destroyManagementContextSafely(BrooklynMgmtUnitTestSupport.java:71)
at org.apache.brooklyn.core.test.BrooklynMgmtUnitTestSupport.tearDown(BrooklynMgmtUnitTestSupport.java:58)
at java.util.concurrent.Executors$RunnableAdapter.call(Executors.java:511)
at java.util.concurrent.FutureTask.run(FutureTask.java:266)
at java.util.concurrent.ThreadPoolExecutor.runWorker(ThreadPoolExecutor.java:1142)
at java.util.concurrent.ThreadPoolExecutor$Worker.run(ThreadPoolExecutor.java:617)
at java.lang.Thread.run(Thread.java:745)
2017-05-10 03:59:20,574 INFO TESTNG INVOKING CONFIGURATION: "Surefire test" - @AfterMethod org.apache.brooklyn.core.test.BrooklynMgmtUnitTestSupport.tearDown()
2017-05-10 03:59:20,581 INFO Stopping TrackingAbstractControllerImpl{id=x05jncye0d} in [SshMachineLocation[SshMachineLocation:il0c:null@1.1.1.1/1.1.1.1:22(id=il0c5fk2lh)]]
2017-05-10 03:59:20,602 INFO TESTNG PASSED CONFIGURATION: "Surefire test" - @AfterMethod org.apache.brooklyn.core.test.BrooklynMgmtUnitTestSupport.tearDown() finished in 28 ms
2017-05-10 03:59:20,603 INFO TESTNG INVOKING CONFIGURATION: "Surefire test" - @BeforeMethod org.apache.brooklyn.entity.proxy.AbstractControllerTest.setUp()
2017-05-10 03:59:20,823 WARN Set no-arg constructor accessible for class org.apache.brooklyn.entity.software.base.SoftwareProcessImpl$UpdatingNotUpFromServiceProcessIsRunning (deprecated; should have public no-arg constructor)
2017-05-10 03:59:20,824 WARN Set no-arg constructor accessible for class org.apache.brooklyn.entity.software.base.SoftwareProcessImpl$ServiceNotUpDiagnosticsCollector (deprecated; should have public no-arg constructor)
2017-05-10 03:59:20,854 INFO No Camp-YAML parser registered for parsing catalog item DSL; skipping DSL-parsing
2017-05-10 03:59:20,864 INFO Starting TrackingAbstractControllerImpl{id=y1w1coxpyg}, obtaining a new location instance in FixedListMachineProvisioningLocation{id=iz5a64n9lw, name=FixedListMachineProvisioningLocation:iz5a} with ports [22, 8000, 8443]
2017-05-10 03:59:20,867 INFO Starting TrackingAbstractControllerImpl{id=y1w1coxpyg} on machine SshMachineLocation[SshMachineLocation:rpho:null@/1.1.1.1:22(id=rphovmsf1y)]
2017-05-10 03:59:20,998 INFO Added policy ServerPoolMemberTrackerPolicy{id=lsje07vsqu, name=Controller targets tracker, running=true} to TrackingAbstractControllerImpl{id=y1w1coxpyg}
2017-05-10 03:59:20,998 INFO Resetting TrackingAbstractControllerImpl{id=y1w1coxpyg}, server pool targets {}
2017-05-10 03:59:21,000 INFO Updating TrackingAbstractControllerImpl{id=y1w1coxpyg}, server pool targets {}
2017-05-10 03:59:21,000 INFO test controller reconfigure, targets []
2017-05-10 03:59:21,016 INFO TESTNG PASSED CONFIGURATION: "Surefire test" - @BeforeMethod org.apache.brooklyn.entity.proxy.AbstractControllerTest.setUp() finished in 412 ms
2017-05-10 03:59:21,016 INFO TESTNG INVOKING: "Surefire test" - org.apache.brooklyn.entity.proxy.AbstractControllerTest.testUpdateCalledWithAddressesRemovedForStoppedChildren()
2017-05-10 03:59:21,017 INFO TESTNG SKIPPED: "Surefire test" - org.apache.brooklyn.entity.proxy.AbstractControllerTest.testUpdateCalledWithAddressesRemovedForStoppedChildren() finished in 0 ms
org.testng.internal.thread.ThreadTimeoutException: Method org.apache.brooklyn.core.test.BrooklynMgmtUnitTestSupport.tearDown() didn't finish within the time-out 30000
at java.lang.Thread.currentThread(Native Method)
at java.util.concurrent.locks.ReentrantLock$NonfairSync.lock(ReentrantLock.java:207)
at java.util.concurrent.locks.ReentrantLock.lock(ReentrantLock.java:285)
at java.util.concurrent.ThreadPoolExecutor.interruptIdleWorkers(ThreadPoolExecutor.java:783)
at java.util.concurrent.ThreadPoolExecutor.tryTerminate(ThreadPoolExecutor.java:697)
at java.util.concurrent.ThreadPoolExecutor.shutdownNow(ThreadPoolExecutor.java:1426)
at com.google.common.util.concurrent.MoreExecutors$ListeningDecorator.shutdownNow(MoreExecutors.java:545)
at org.apache.brooklyn.core.entity.Entities.destroyAll(Entities.java:930)
at org.apache.brooklyn.core.test.BrooklynMgmtUnitTestSupport.destroyManagementContextSafely(BrooklynMgmtUnitTestSupport.java:71)
at org.apache.brooklyn.core.test.BrooklynMgmtUnitTestSupport.tearDown(BrooklynMgmtUnitTestSupport.java:58)
at java.util.concurrent.Executors$RunnableAdapter.call(Executors.java:511)
at java.util.concurrent.FutureTask.run(FutureTask.java:266)
at java.util.concurrent.ThreadPoolExecutor.runWorker(ThreadPoolExecutor.java:1142)
at java.util.concurrent.ThreadPoolExecutor$Worker.run(ThreadPoolExecutor.java:617)
at java.lang.Thread.run(Thread.java:745)
2017-05-10 03:59:21,017 INFO TESTNG INVOKING CONFIGURATION: "Surefire test" - @AfterMethod org.apache.brooklyn.core.test.BrooklynMgmtUnitTestSupport.tearDown()
2017-05-10 03:59:21,056 INFO Stopping TrackingAbstractControllerImpl{id=y1w1coxpyg} in [SshMachineLocation[SshMachineLocation:rpho:null@1.1.1.1/1.1.1.1:22(id=rphovmsf1y)]]
2017-05-10 03:59:21,090 INFO TESTNG PASSED CONFIGURATION: "Surefire test" - @AfterMethod org.apache.brooklyn.core.test.BrooklynMgmtUnitTestSupport.tearDown() finished in 72 ms
2017-05-10 03:59:21,090 INFO TESTNG INVOKING CONFIGURATION: "Surefire test" - @BeforeMethod org.apache.brooklyn.entity.proxy.AbstractControllerTest.setUp()
2017-05-10 03:59:21,299 WARN Set no-arg constructor accessible for class org.apache.brooklyn.entity.software.base.SoftwareProcessImpl$UpdatingNotUpFromServiceProcessIsRunning (deprecated; should have public no-arg constructor)
2017-05-10 03:59:21,300 WARN Set no-arg constructor accessible for class org.apache.brooklyn.entity.software.base.SoftwareProcessImpl$ServiceNotUpDiagnosticsCollector (deprecated; should have public no-arg constructor)
2017-05-10 03:59:21,311 INFO No Camp-YAML parser registered for parsing catalog item DSL; skipping DSL-parsing
2017-05-10 03:59:21,360 INFO Starting TrackingAbstractControllerImpl{id=u1tc25id8w}, obtaining a new location instance in FixedListMachineProvisioningLocation{id=yuqbx9ok8t, name=FixedListMachineProvisioningLocation:yuqb} with ports [22, 8000, 8443]
2017-05-10 03:59:21,388 INFO Starting TrackingAbstractControllerImpl{id=u1tc25id8w} on machine SshMachineLocation[SshMachineLocation:wqof:null@/1.1.1.1:22(id=wqofutel4v)]
2017-05-10 03:59:21,519 INFO Added policy ServerPoolMemberTrackerPolicy{id=ssjcu3p4ts, name=Controller targets tracker, running=true} to TrackingAbstractControllerImpl{id=u1tc25id8w}
2017-05-10 03:59:21,519 INFO Resetting TrackingAbstractControllerImpl{id=u1tc25id8w}, server pool targets {}
2017-05-10 03:59:21,520 INFO Updating TrackingAbstractControllerImpl{id=u1tc25id8w}, server pool targets {}
2017-05-10 03:59:21,520 INFO test controller reconfigure, targets []
2017-05-10 03:59:21,536 INFO TESTNG PASSED CONFIGURATION: "Surefire test" - @BeforeMethod org.apache.brooklyn.entity.proxy.AbstractControllerTest.setUp() finished in 446 ms
2017-05-10 03:59:21,536 INFO TESTNG INVOKING: "Surefire test" - org.apache.brooklyn.entity.proxy.AbstractControllerTest.testUsesHostAndPortSensor()
2017-05-10 03:59:21,537 INFO TESTNG SKIPPED: "Surefire test" - org.apache.brooklyn.entity.proxy.AbstractControllerTest.testUsesHostAndPortSensor() finished in 1 ms
org.testng.internal.thread.ThreadTimeoutException: Method org.apache.brooklyn.core.test.BrooklynMgmtUnitTestSupport.tearDown() didn't finish within the time-out 30000
at java.lang.Thread.currentThread(Native Method)
at java.util.concurrent.locks.ReentrantLock$NonfairSync.lock(ReentrantLock.java:207)
at java.util.concurrent.locks.ReentrantLock.lock(ReentrantLock.java:285)
at java.util.concurrent.ThreadPoolExecutor.interruptIdleWorkers(ThreadPoolExecutor.java:783)
at java.util.concurrent.ThreadPoolExecutor.tryTerminate(ThreadPoolExecutor.java:697)
at java.util.concurrent.ThreadPoolExecutor.shutdownNow(ThreadPoolExecutor.java:1426)
at com.google.common.util.concurrent.MoreExecutors$ListeningDecorator.shutdownNow(MoreExecutors.java:545)
at org.apache.brooklyn.core.entity.Entities.destroyAll(Entities.java:930)
at org.apache.brooklyn.core.test.BrooklynMgmtUnitTestSupport.destroyManagementContextSafely(BrooklynMgmtUnitTestSupport.java:71)
at org.apache.brooklyn.core.test.BrooklynMgmtUnitTestSupport.tearDown(BrooklynMgmtUnitTestSupport.java:58)
at java.util.concurrent.Executors$RunnableAdapter.call(Executors.java:511)
at java.util.concurrent.FutureTask.run(FutureTask.java:266)
at java.util.concurrent.ThreadPoolExecutor.runWorker(ThreadPoolExecutor.java:1142)
at java.util.concurrent.ThreadPoolExecutor$Worker.run(ThreadPoolExecutor.java:617)
at java.lang.Thread.run(Thread.java:745)
2017-05-10 03:59:21,538 INFO TESTNG INVOKING CONFIGURATION: "Surefire test" - @AfterMethod org.apache.brooklyn.core.test.BrooklynMgmtUnitTestSupport.tearDown()
2017-05-10 03:59:21,545 INFO Stopping TrackingAbstractControllerImpl{id=u1tc25id8w} in [SshMachineLocation[SshMachineLocation:wqof:null@1.1.1.1/1.1.1.1:22(id=wqofutel4v)]]
2017-05-10 03:59:21,578 INFO TESTNG PASSED CONFIGURATION: "Surefire test" - @AfterMethod org.apache.brooklyn.core.test.BrooklynMgmtUnitTestSupport.tearDown() finished in 40 ms
2017-05-10 03:59:21,579 INFO TESTNG INVOKING: "Surefire test" - org.apache.brooklyn.entity.dns.geoscaling.GeoscalingScriptGeneratorTest.testScriptGeneration()
2017-05-10 03:59:21,585 INFO TESTNG PASSED: "Surefire test" - org.apache.brooklyn.entity.dns.geoscaling.GeoscalingScriptGeneratorTest.testScriptGeneration() finished in 6 ms
2017-05-10 03:59:21,689 INFO TESTNG
===============================================
Surefire test
Tests run: 41, Failures: 0, Skips: 22
Configuration Failures: 1, Skips: 0
===============================================
2017-05-10 03:59:21,691 WARN Management Context LocalManagementContext[?-Vt1iH10T] running, creation stacktrace:
java.lang.Throwable: for construction stacktrace
at org.apache.brooklyn.core.mgmt.internal.LocalManagementContext.<init>(LocalManagementContext.java:141)
at org.apache.brooklyn.core.mgmt.internal.LocalManagementContext.<init>(LocalManagementContext.java:163)
at org.apache.brooklyn.core.mgmt.internal.LocalManagementContext.<init>(LocalManagementContext.java:159)
at org.apache.brooklyn.core.test.entity.LocalManagementContextForTests.<init>(LocalManagementContextForTests.java:44)
at org.apache.brooklyn.core.test.entity.LocalManagementContextForTests$Builder.build(LocalManagementContextForTests.java:184)
at org.apache.brooklyn.core.test.entity.LocalManagementContextForTests.newInstance(LocalManagementContextForTests.java:199)
at org.apache.brooklyn.core.test.BrooklynMgmtUnitTestSupport.setUp(BrooklynMgmtUnitTestSupport.java:50)
at org.apache.brooklyn.core.test.BrooklynAppUnitTestSupport.setUp(BrooklynAppUnitTestSupport.java:38)
at org.apache.brooklyn.entity.dns.AbstractGeoDnsServiceTest.setUp(AbstractGeoDnsServiceTest.java:98)
at sun.reflect.NativeMethodAccessorImpl.invoke0(Native Method)
at sun.reflect.NativeMethodAccessorImpl.invoke(NativeMethodAccessorImpl.java:62)
at sun.reflect.DelegatingMethodAccessorImpl.invoke(DelegatingMethodAccessorImpl.java:43)
at java.lang.reflect.Method.invoke(Method.java:498)
at org.testng.internal.MethodInvocationHelper.invokeMethod(MethodInvocationHelper.java:104)
at org.testng.internal.Invoker.invokeConfigurationMethod(Invoker.java:515)
at org.testng.internal.Invoker.invokeConfigurations(Invoker.java:217)
at org.testng.internal.Invoker.invokeMethod(Invoker.java:590)
at org.testng.internal.Invoker.invokeTestMethod(Invoker.java:851)
at org.testng.internal.Invoker.invokeTestMethods(Invoker.java:1177)
at org.testng.internal.TestMethodWorker.invokeTestMethods(TestMethodWorker.java:129)
at org.testng.internal.TestMethodWorker.run(TestMethodWorker.java:112)
at org.testng.TestRunner.privateRun(TestRunner.java:756)
at org.testng.TestRunner.run(TestRunner.java:610)
at org.testng.SuiteRunner.runTest(SuiteRunner.java:387)
at org.testng.SuiteRunner.runSequentially(SuiteRunner.java:382)
at org.testng.SuiteRunner.privateRun(SuiteRunner.java:340)
at org.testng.SuiteRunner.run(SuiteRunner.java:289)
at org.testng.SuiteRunnerWorker.runSuite(SuiteRunnerWorker.java:52)
at org.testng.SuiteRunnerWorker.run(SuiteRunnerWorker.java:86)
at org.testng.TestNG.runSuitesSequentially(TestNG.java:1293)
at org.testng.TestNG.runSuitesLocally(TestNG.java:1218)
at org.testng.TestNG.runSuites(TestNG.java:1133)
at org.testng.TestNG.run(TestNG.java:1104)
at org.apache.maven.surefire.testng.TestNGExecutor.run(TestNGExecutor.java:132)
at org.apache.maven.surefire.testng.TestNGDirectoryTestSuite.executeMulti(TestNGDirectoryTestSuite.java:193)
at org.apache.maven.surefire.testng.TestNGDirectoryTestSuite.execute(TestNGDirectoryTestSuite.java:94)
at org.apache.maven.surefire.testng.TestNGProvider.invoke(TestNGProvider.java:147)
at org.apache.maven.surefire.booter.ForkedBooter.invokeProviderInSameClassLoader(ForkedBooter.java:290)
at org.apache.maven.surefire.booter.ForkedBooter.runSuitesInProcess(ForkedBooter.java:242)
at org.apache.maven.surefire.booter.ForkedBooter.main(ForkedBooter.java:121)
2017-05-10 03:59:21,692 INFO BrooklynLeakListener.onFinish attempting to terminate all extant ManagementContexts: name=Surefire test; includedGroups=[]; excludedGroups=[Integration, Acceptance, Live, Live-sanity, WIP, Broken]; suiteName=Surefire suite; outDir=<https://builds.apache.org/job/brooklyn-library-master/ws/software/webapp/target/surefire-reports/Surefire> suite: 1 ManagementContexts terminated
2017-05-10 03:59:21,695 ERROR Problem refreshing group membership: org.apache.brooklyn.util.exceptions.RuntimeInterruptedException: java.lang.InterruptedException
org.apache.brooklyn.util.exceptions.RuntimeInterruptedException: java.lang.InterruptedException
at org.apache.brooklyn.util.exceptions.Exceptions.propagate(Exceptions.java:124) ~[brooklyn-utils-common-0.12.0-SNAPSHOT.jar:0.12.0-SNAPSHOT]
Caused by: java.lang.InterruptedException: null
at java.util.concurrent.FutureTask.awaitDone(FutureTask.java:404) [na:1.8.0_121]
Tests run: 42, Failures: 1, Errors: 0, Skipped: 22, Time elapsed: 57.834 sec <<< FAILURE! - in TestSuite
tearDown(org.apache.brooklyn.entity.dns.AbstractGeoDnsServiceTest) Time elapsed: 31.464 sec <<< FAILURE!
org.testng.internal.thread.ThreadTimeoutException: Method org.apache.brooklyn.core.test.BrooklynMgmtUnitTestSupport.tearDown() didn't finish within the time-out 30000
Results :
Failed tests:
AbstractGeoDnsServiceTest>BrooklynMgmtUnitTestSupport.tearDown:58->BrooklynMgmtUnitTestSupport.destroyManagementContextSafely:71 » ThreadTimeout
Tests run: 42, Failures: 1, Errors: 0, Skipped: 22
[JENKINS] Recording test results
[INFO] ------------------------------------------------------------------------
[INFO] Reactor Summary:
[INFO]
[INFO] Brooklyn Library Root .............................. SUCCESS [ 12.920 s]
[INFO] Brooklyn CM SaltStack .............................. SUCCESS [02:07 min]
[INFO] Brooklyn CM Ansible ................................ SUCCESS [ 15.610 s]
[INFO] Brooklyn CM Integration Root ....................... SUCCESS [ 3.818 s]
[INFO] Brooklyn Network Software Entities ................. SUCCESS [ 16.188 s]
[INFO] Brooklyn OSGi Software Entities .................... SUCCESS [ 15.526 s]
[INFO] Brooklyn Database Software Entities ................ SUCCESS [ 26.041 s]
[INFO] Brooklyn Web App Software Entities ................. FAILURE [01:15 min]
[INFO] Brooklyn Messaging Software Entities ............... SKIPPED
[INFO] Brooklyn NoSQL Data Store Software Entities ........ SKIPPED
[INFO] Brooklyn Monitoring Software Entities .............. SKIPPED
[INFO] Brooklyn QA ........................................ SKIPPED
[INFO] Brooklyn Examples Aggregator Project ............... SKIPPED
[INFO] Brooklyn Examples Aggregator Project - Webapps ..... SKIPPED
[INFO] hello-world-webapp Maven Webapp .................... SKIPPED
[INFO] hello-world-sql-webapp Maven Webapp ................ SKIPPED
[INFO] Brooklyn Simple Web Cluster Example ................ SKIPPED
[INFO] Brooklyn Global Web Fabric Example ................. SKIPPED
[INFO] Brooklyn Simple Messaging Publish-Subscribe Example SKIPPED
[INFO] Brooklyn NoSQL Cluster Examples .................... SKIPPED
[INFO] Brooklyn Library Karaf integration ................. SKIPPED
[INFO] Brooklyn Library Catalog ........................... SKIPPED
[INFO] Brooklyn Library Karaf Features .................... SKIPPED
[INFO] ------------------------------------------------------------------------
[INFO] BUILD FAILURE
[INFO] ------------------------------------------------------------------------
[INFO] Total time: 06:01 min
[INFO] Finished at: 2017-05-10T03:59:54+00:00
[INFO] Final Memory: 87M/710M
[INFO] ------------------------------------------------------------------------
Waiting for Jenkins to finish collecting data
[ERROR] Failed to execute goal org.apache.maven.plugins:maven-surefire-plugin:2.19.1:test (default-test) on project brooklyn-software-webapp: There are test failures.
[ERROR]
[ERROR] Please refer to <https://builds.apache.org/job/brooklyn-library-master/ws/software/webapp/target/surefire-reports> for the individual test results.
[ERROR] -> [Help 1]
[ERROR]
[ERROR] To see the full stack trace of the errors, re-run Maven with the -e switch.
[ERROR] Re-run Maven using the -X switch to enable full debug logging.
[ERROR]
[ERROR] For more information about the errors and possible solutions, please read the following articles:
[ERROR] [Help 1] http://cwiki.apache.org/confluence/display/MAVEN/MojoFailureException
[ERROR]
[ERROR] After correcting the problems, you can resume the build with the command
[ERROR] mvn <goals> -rf :brooklyn-software-webapp
[JENKINS] Archiving <https://builds.apache.org/job/brooklyn-library-master/ws/software/cm/salt/pom.xml> to org.apache.brooklyn/brooklyn-software-cm-salt/0.12.0-SNAPSHOT/brooklyn-software-cm-salt-0.12.0-SNAPSHOT.pom
[JENKINS] Archiving <https://builds.apache.org/job/brooklyn-library-master/ws/software/cm/salt/target/brooklyn-software-cm-salt-0.12.0-SNAPSHOT.jar> to org.apache.brooklyn/brooklyn-software-cm-salt/0.12.0-SNAPSHOT/brooklyn-software-cm-salt-0.12.0-SNAPSHOT.jar
[JENKINS] Archiving <https://builds.apache.org/job/brooklyn-library-master/ws/software/cm/salt/target/brooklyn-software-cm-salt-0.12.0-SNAPSHOT-tests.jar> to org.apache.brooklyn/brooklyn-software-cm-salt/0.12.0-SNAPSHOT/brooklyn-software-cm-salt-0.12.0-SNAPSHOT-tests.jar
[JENKINS] Archiving <https://builds.apache.org/job/brooklyn-library-master/ws/software/cm/salt/target/brooklyn-software-cm-salt-0.12.0-SNAPSHOT-sources.jar> to org.apache.brooklyn/brooklyn-software-cm-salt/0.12.0-SNAPSHOT/brooklyn-software-cm-salt-0.12.0-SNAPSHOT-sources.jar
[JENKINS] Archiving <https://builds.apache.org/job/brooklyn-library-master/ws/software/cm/salt/target/brooklyn-software-cm-salt-0.12.0-SNAPSHOT-test-sources.jar> to org.apache.brooklyn/brooklyn-software-cm-salt/0.12.0-SNAPSHOT/brooklyn-software-cm-salt-0.12.0-SNAPSHOT-test-sources.jar
[JENKINS] Archiving <https://builds.apache.org/job/brooklyn-library-master/ws/software/osgi/pom.xml> to org.apache.brooklyn/brooklyn-software-osgi/0.12.0-SNAPSHOT/brooklyn-software-osgi-0.12.0-SNAPSHOT.pom
[JENKINS] Archiving <https://builds.apache.org/job/brooklyn-library-master/ws/software/osgi/target/brooklyn-software-osgi-0.12.0-SNAPSHOT.jar> to org.apache.brooklyn/brooklyn-software-osgi/0.12.0-SNAPSHOT/brooklyn-software-osgi-0.12.0-SNAPSHOT.jar
[JENKINS] Archiving <https://builds.apache.org/job/brooklyn-library-master/ws/software/osgi/target/brooklyn-software-osgi-0.12.0-SNAPSHOT-tests.jar> to org.apache.brooklyn/brooklyn-software-osgi/0.12.0-SNAPSHOT/brooklyn-software-osgi-0.12.0-SNAPSHOT-tests.jar
[JENKINS] Archiving <https://builds.apache.org/job/brooklyn-library-master/ws/software/osgi/target/brooklyn-software-osgi-0.12.0-SNAPSHOT-sources.jar> to org.apache.brooklyn/brooklyn-software-osgi/0.12.0-SNAPSHOT/brooklyn-software-osgi-0.12.0-SNAPSHOT-sources.jar
[JENKINS] Archiving <https://builds.apache.org/job/brooklyn-library-master/ws/software/osgi/target/brooklyn-software-osgi-0.12.0-SNAPSHOT-test-sources.jar> to org.apache.brooklyn/brooklyn-software-osgi/0.12.0-SNAPSHOT/brooklyn-software-osgi-0.12.0-SNAPSHOT-test-sources.jar
[JENKINS] Archiving <https://builds.apache.org/job/brooklyn-library-master/ws/pom.xml> to org.apache.brooklyn/brooklyn-library/0.12.0-SNAPSHOT/brooklyn-library-0.12.0-SNAPSHOT.pom
[JENKINS] Archiving <https://builds.apache.org/job/brooklyn-library-master/ws/software/database/pom.xml> to org.apache.brooklyn/brooklyn-software-database/0.12.0-SNAPSHOT/brooklyn-software-database-0.12.0-SNAPSHOT.pom
[JENKINS] Archiving <https://builds.apache.org/job/brooklyn-library-master/ws/software/database/target/brooklyn-software-database-0.12.0-SNAPSHOT.jar> to org.apache.brooklyn/brooklyn-software-database/0.12.0-SNAPSHOT/brooklyn-software-database-0.12.0-SNAPSHOT.jar
[JENKINS] Archiving <https://builds.apache.org/job/brooklyn-library-master/ws/software/database/target/brooklyn-software-database-0.12.0-SNAPSHOT-tests.jar> to org.apache.brooklyn/brooklyn-software-database/0.12.0-SNAPSHOT/brooklyn-software-database-0.12.0-SNAPSHOT-tests.jar
[JENKINS] Archiving <https://builds.apache.org/job/brooklyn-library-master/ws/software/database/target/brooklyn-software-database-0.12.0-SNAPSHOT-sources.jar> to org.apache.brooklyn/brooklyn-software-database/0.12.0-SNAPSHOT/brooklyn-software-database-0.12.0-SNAPSHOT-sources.jar
[JENKINS] Archiving <https://builds.apache.org/job/brooklyn-library-master/ws/software/database/target/brooklyn-software-database-0.12.0-SNAPSHOT-test-sources.jar> to org.apache.brooklyn/brooklyn-software-database/0.12.0-SNAPSHOT/brooklyn-software-database-0.12.0-SNAPSHOT-test-sources.jar
Compressed 663.70 KB of artifacts by 19.3% relative to #275
[JENKINS] Archiving <https://builds.apache.org/job/brooklyn-library-master/ws/examples/webapps/hello-world-webapp/pom.xml> to org.apache.brooklyn.example/brooklyn-example-hello-world-webapp/0.12.0-SNAPSHOT/brooklyn-example-hello-world-webapp-0.12.0-SNAPSHOT.pom
[JENKINS] Archiving <https://builds.apache.org/job/brooklyn-library-master/ws/software/messaging/pom.xml> to org.apache.brooklyn/brooklyn-software-messaging/0.12.0-SNAPSHOT/brooklyn-software-messaging-0.12.0-SNAPSHOT.pom
[JENKINS] Archiving <https://builds.apache.org/job/brooklyn-library-master/ws/qa/pom.xml> to org.apache.brooklyn/brooklyn-qa/0.12.0-SNAPSHOT/brooklyn-qa-0.12.0-SNAPSHOT.pom
[JENKINS] Archiving <https://builds.apache.org/job/brooklyn-library-master/ws/software/cm/ansible/pom.xml> to org.apache.brooklyn/brooklyn-software-cm-ansible/0.12.0-SNAPSHOT/brooklyn-software-cm-ansible-0.12.0-SNAPSHOT.pom
[JENKINS] Archiving <https://builds.apache.org/job/brooklyn-library-master/ws/software/cm/ansible/target/brooklyn-software-cm-ansible-0.12.0-SNAPSHOT.jar> to org.apache.brooklyn/brooklyn-software-cm-ansible/0.12.0-SNAPSHOT/brooklyn-software-cm-ansible-0.12.0-SNAPSHOT.jar
[JENKINS] Archiving <https://builds.apache.org/job/brooklyn-library-master/ws/software/cm/ansible/target/brooklyn-software-cm-ansible-0.12.0-SNAPSHOT-tests.jar> to org.apache.brooklyn/brooklyn-software-cm-ansible/0.12.0-SNAPSHOT/brooklyn-software-cm-ansible-0.12.0-SNAPSHOT-tests.jar
[JENKINS] Archiving <https://builds.apache.org/job/brooklyn-library-master/ws/software/cm/ansible/target/brooklyn-software-cm-ansible-0.12.0-SNAPSHOT-sources.jar> to org.apache.brooklyn/brooklyn-software-cm-ansible/0.12.0-SNAPSHOT/brooklyn-software-cm-ansible-0.12.0-SNAPSHOT-sources.jar
[JENKINS] Archiving <https://builds.apache.org/job/brooklyn-library-master/ws/software/cm/ansible/target/brooklyn-software-cm-ansible-0.12.0-SNAPSHOT-test-sources.jar> to org.apache.brooklyn/brooklyn-software-cm-ansible/0.12.0-SNAPSHOT/brooklyn-software-cm-ansible-0.12.0-SNAPSHOT-test-sources.jar
[JENKINS] Archiving <https://builds.apache.org/job/brooklyn-library-master/ws/software/monitoring/pom.xml> to org.apache.brooklyn/brooklyn-software-monitoring/0.12.0-SNAPSHOT/brooklyn-software-monitoring-0.12.0-SNAPSHOT.pom
[JENKINS] Archiving <https://builds.apache.org/job/brooklyn-library-master/ws/examples/global-web-fabric/pom.xml> to org.apache.brooklyn.example/brooklyn-example-global-web-fabric/0.12.0-SNAPSHOT/brooklyn-example-global-web-fabric-0.12.0-SNAPSHOT.pom
[JENKINS] Archiving <https://builds.apache.org/job/brooklyn-library-master/ws/karaf/catalog/pom.xml> to org.apache.brooklyn/brooklyn-library-catalog/0.12.0-SNAPSHOT/brooklyn-library-catalog-0.12.0-SNAPSHOT.pom
[JENKINS] Archiving <https://builds.apache.org/job/brooklyn-library-master/ws/software/cm/pom.xml> to org.apache.brooklyn/brooklyn-software-cm/0.12.0-SNAPSHOT/brooklyn-software-cm-0.12.0-SNAPSHOT.pom
[JENKINS] Archiving <https://builds.apache.org/job/brooklyn-library-master/ws/examples/webapps/hello-world-sql/pom.xml> to org.apache.brooklyn.example/brooklyn-example-hello-world-sql-webapp/0.12.0-SNAPSHOT/brooklyn-example-hello-world-sql-webapp-0.12.0-SNAPSHOT.pom
[JENKINS] Archiving <https://builds.apache.org/job/brooklyn-library-master/ws/examples/simple-messaging-pubsub/pom.xml> to org.apache.brooklyn.example/brooklyn-example-simple-messaging-pubsub/0.12.0-SNAPSHOT/brooklyn-example-simple-messaging-pubsub-0.12.0-SNAPSHOT.pom
[JENKINS] Archiving <https://builds.apache.org/job/brooklyn-library-master/ws/software/network/pom.xml> to org.apache.brooklyn/brooklyn-software-network/0.12.0-SNAPSHOT/brooklyn-software-network-0.12.0-SNAPSHOT.pom
[JENKINS] Archiving <https://builds.apache.org/job/brooklyn-library-master/ws/software/network/target/brooklyn-software-network-0.12.0-SNAPSHOT.jar> to org.apache.brooklyn/brooklyn-software-network/0.12.0-SNAPSHOT/brooklyn-software-network-0.12.0-SNAPSHOT.jar
[JENKINS] Archiving <https://builds.apache.org/job/brooklyn-library-master/ws/software/network/target/brooklyn-software-network-0.12.0-SNAPSHOT-tests.jar> to org.apache.brooklyn/brooklyn-software-network/0.12.0-SNAPSHOT/brooklyn-software-network-0.12.0-SNAPSHOT-tests.jar
[JENKINS] Archiving <https://builds.apache.org/job/brooklyn-library-master/ws/software/network/target/brooklyn-software-network-0.12.0-SNAPSHOT-sources.jar> to org.apache.brooklyn/brooklyn-software-network/0.12.0-SNAPSHOT/brooklyn-software-network-0.12.0-SNAPSHOT-sources.jar
[JENKINS] Archiving <https://builds.apache.org/job/brooklyn-library-master/ws/software/network/target/brooklyn-software-network-0.12.0-SNAPSHOT-test-sources.jar> to org.apache.brooklyn/brooklyn-software-network/0.12.0-SNAPSHOT/brooklyn-software-network-0.12.0-SNAPSHOT-test-sources.jar
[JENKINS] Archiving <https://builds.apache.org/job/brooklyn-library-master/ws/software/webapp/pom.xml> to org.apache.brooklyn/brooklyn-software-webapp/0.12.0-SNAPSHOT/brooklyn-software-webapp-0.12.0-SNAPSHOT.pom
[JENKINS] Archiving <https://builds.apache.org/job/brooklyn-library-master/ws/software/nosql/pom.xml> to org.apache.brooklyn/brooklyn-software-nosql/0.12.0-SNAPSHOT/brooklyn-software-nosql-0.12.0-SNAPSHOT.pom
[JENKINS] Archiving <https://builds.apache.org/job/brooklyn-library-master/ws/karaf/features/pom.xml> to org.apache.brooklyn/brooklyn-library-features/0.12.0-SNAPSHOT/brooklyn-library-features-0.12.0-SNAPSHOT.pom
[JENKINS] Archiving <https://builds.apache.org/job/brooklyn-library-master/ws/karaf/pom.xml> to org.apache.brooklyn/brooklyn-library-karaf/0.12.0-SNAPSHOT/brooklyn-library-karaf-0.12.0-SNAPSHOT.pom
[JENKINS] Archiving <https://builds.apache.org/job/brooklyn-library-master/ws/examples/simple-nosql-cluster/pom.xml> to org.apache.brooklyn.example/brooklyn-example-simple-nosql-cluster/0.12.0-SNAPSHOT/brooklyn-example-simple-nosql-cluster-0.12.0-SNAPSHOT.pom
[JENKINS] Archiving <https://builds.apache.org/job/brooklyn-library-master/ws/examples/webapps/pom.xml> to org.apache.brooklyn.example/brooklyn-examples-webapps-parent/0.12.0-SNAPSHOT/brooklyn-examples-webapps-parent-0.12.0-SNAPSHOT.pom
[JENKINS] Archiving <https://builds.apache.org/job/brooklyn-library-master/ws/examples/simple-web-cluster/pom.xml> to org.apache.brooklyn.example/brooklyn-example-simple-web-cluster/0.12.0-SNAPSHOT/brooklyn-example-simple-web-cluster-0.12.0-SNAPSHOT.pom
[JENKINS] Archiving <https://builds.apache.org/job/brooklyn-library-master/ws/examples/pom.xml> to org.apache.brooklyn.example/brooklyn-examples-parent/0.12.0-SNAPSHOT/brooklyn-examples-parent-0.12.0-SNAPSHOT.pom
channel stopped
Build failed in Jenkins: brooklyn-library-master #275
Posted by Apache Jenkins Server <je...@builds.apache.org>.
See <https://builds.apache.org/job/brooklyn-library-master/275/display/redirect>
------------------------------------------
[...truncated 257.76 KB...]
2017-05-09 03:55:53,245 INFO TESTNG INVOKING CONFIGURATION: "Surefire test" - @AfterMethod org.apache.brooklyn.core.test.BrooklynMgmtUnitTestSupport.tearDown()
2017-05-09 03:55:53,258 INFO TESTNG PASSED CONFIGURATION: "Surefire test" - @AfterMethod org.apache.brooklyn.core.test.BrooklynMgmtUnitTestSupport.tearDown() finished in 13 ms
2017-05-09 03:55:53,259 INFO TESTNG INVOKING CONFIGURATION: "Surefire test" - @BeforeMethod org.apache.brooklyn.entity.dns.AbstractGeoDnsServiceTest.setUp()
2017-05-09 03:55:53,278 WARN Deprecated use of unmanaged location (SshMachineLocation[West child:null@100.0.0.1/100.0.0.1:22(id=s17s71wfvm)]); will be managed automatically now but not supported in future versions
2017-05-09 03:55:53,279 WARN Deprecated use of unmanaged location (SshMachineLocation[West child with location:null@100.0.0.1/100.0.0.1:22(id=eqqgg8uxls)]); will be managed automatically now but not supported in future versions
2017-05-09 03:55:53,281 WARN Deprecated use of unmanaged location (SshMachineLocation[East child:null@100.0.0.2/100.0.0.2:22(id=vbfh8l9ejd)]); will be managed automatically now but not supported in future versions
2017-05-09 03:55:53,283 WARN Deprecated use of unmanaged location (SshMachineLocation[East child with location:null@100.0.0.2/100.0.0.2:22(id=mdnv195iud)]); will be managed automatically now but not supported in future versions
2017-05-09 03:55:53,285 WARN Deprecated use of unmanaged location (SshMachineLocation[North child:null@10.0.0.1/10.0.0.1:22(id=mk1oo6fvbv)]); will be managed automatically now but not supported in future versions
2017-05-09 03:55:53,290 INFO No Camp-YAML parser registered for parsing catalog item DSL; skipping DSL-parsing
2017-05-09 03:55:53,326 INFO TESTNG PASSED CONFIGURATION: "Surefire test" - @BeforeMethod org.apache.brooklyn.entity.dns.AbstractGeoDnsServiceTest.setUp() finished in 67 ms
2017-05-09 03:55:53,326 INFO TESTNG INVOKING: "Surefire test" - org.apache.brooklyn.entity.dns.AbstractGeoDnsServiceTest.testGeoInfoOnLocation()
2017-05-09 03:55:53,327 INFO TESTNG SKIPPED: "Surefire test" - org.apache.brooklyn.entity.dns.AbstractGeoDnsServiceTest.testGeoInfoOnLocation() finished in 0 ms
org.testng.internal.thread.ThreadTimeoutException: Method org.apache.brooklyn.core.test.BrooklynMgmtUnitTestSupport.tearDown() didn't finish within the time-out 30000
at java.lang.Throwable.getStackTraceElement(Native Method)
at java.lang.Throwable.getOurStackTrace(Throwable.java:827)
at java.lang.Throwable.getStackTrace(Throwable.java:816)
at ch.qos.logback.classic.spi.ThrowableProxy.<init>(ThrowableProxy.java:55)
at ch.qos.logback.classic.spi.ThrowableProxy.<init>(ThrowableProxy.java:61)
at ch.qos.logback.classic.spi.LoggingEvent.<init>(LoggingEvent.java:125)
at ch.qos.logback.classic.Logger.buildLoggingEventAndAppend(Logger.java:447)
at ch.qos.logback.classic.Logger.filterAndLog_0_Or3Plus(Logger.java:403)
at ch.qos.logback.classic.Logger.error(Logger.java:566)
at org.apache.brooklyn.core.test.BrooklynMgmtUnitTestSupport.destroyManagementContextSafely(BrooklynMgmtUnitTestSupport.java:73)
at org.apache.brooklyn.core.test.BrooklynMgmtUnitTestSupport.tearDown(BrooklynMgmtUnitTestSupport.java:58)
at java.util.concurrent.Executors$RunnableAdapter.call(Executors.java:511)
at java.util.concurrent.FutureTask.run(FutureTask.java:266)
at java.util.concurrent.ThreadPoolExecutor.runWorker(ThreadPoolExecutor.java:1142)
at java.util.concurrent.ThreadPoolExecutor$Worker.run(ThreadPoolExecutor.java:617)
at java.lang.Thread.run(Thread.java:745)
2017-05-09 03:55:53,327 INFO TESTNG INVOKING CONFIGURATION: "Surefire test" - @AfterMethod org.apache.brooklyn.core.test.BrooklynMgmtUnitTestSupport.tearDown()
2017-05-09 03:55:53,338 INFO TESTNG PASSED CONFIGURATION: "Surefire test" - @AfterMethod org.apache.brooklyn.core.test.BrooklynMgmtUnitTestSupport.tearDown() finished in 11 ms
2017-05-09 03:55:53,338 INFO TESTNG INVOKING CONFIGURATION: "Surefire test" - @BeforeMethod org.apache.brooklyn.entity.dns.AbstractGeoDnsServiceTest.setUp()
2017-05-09 03:55:53,351 WARN Deprecated use of unmanaged location (SshMachineLocation[West child:null@100.0.0.1/100.0.0.1:22(id=wpajhesle7)]); will be managed automatically now but not supported in future versions
2017-05-09 03:55:53,352 WARN Deprecated use of unmanaged location (SshMachineLocation[West child with location:null@100.0.0.1/100.0.0.1:22(id=vjy6phm5ek)]); will be managed automatically now but not supported in future versions
2017-05-09 03:55:53,353 WARN Deprecated use of unmanaged location (SshMachineLocation[East child:null@100.0.0.2/100.0.0.2:22(id=efmx39ccui)]); will be managed automatically now but not supported in future versions
2017-05-09 03:55:53,354 WARN Deprecated use of unmanaged location (SshMachineLocation[East child with location:null@100.0.0.2/100.0.0.2:22(id=kjtdkh3ngy)]); will be managed automatically now but not supported in future versions
2017-05-09 03:55:53,355 WARN Deprecated use of unmanaged location (SshMachineLocation[North child:null@10.0.0.1/10.0.0.1:22(id=kcmclzab4t)]); will be managed automatically now but not supported in future versions
2017-05-09 03:55:53,360 INFO No Camp-YAML parser registered for parsing catalog item DSL; skipping DSL-parsing
2017-05-09 03:55:53,395 INFO TESTNG PASSED CONFIGURATION: "Surefire test" - @BeforeMethod org.apache.brooklyn.entity.dns.AbstractGeoDnsServiceTest.setUp() finished in 57 ms
2017-05-09 03:55:53,395 INFO TESTNG INVOKING: "Surefire test" - org.apache.brooklyn.entity.dns.AbstractGeoDnsServiceTest.testGeoInfoOnParentLocation()
2017-05-09 03:55:53,395 INFO TESTNG SKIPPED: "Surefire test" - org.apache.brooklyn.entity.dns.AbstractGeoDnsServiceTest.testGeoInfoOnParentLocation() finished in 0 ms
org.testng.internal.thread.ThreadTimeoutException: Method org.apache.brooklyn.core.test.BrooklynMgmtUnitTestSupport.tearDown() didn't finish within the time-out 30000
at java.lang.Throwable.getStackTraceElement(Native Method)
at java.lang.Throwable.getOurStackTrace(Throwable.java:827)
at java.lang.Throwable.getStackTrace(Throwable.java:816)
at ch.qos.logback.classic.spi.ThrowableProxy.<init>(ThrowableProxy.java:55)
at ch.qos.logback.classic.spi.ThrowableProxy.<init>(ThrowableProxy.java:61)
at ch.qos.logback.classic.spi.LoggingEvent.<init>(LoggingEvent.java:125)
at ch.qos.logback.classic.Logger.buildLoggingEventAndAppend(Logger.java:447)
at ch.qos.logback.classic.Logger.filterAndLog_0_Or3Plus(Logger.java:403)
at ch.qos.logback.classic.Logger.error(Logger.java:566)
at org.apache.brooklyn.core.test.BrooklynMgmtUnitTestSupport.destroyManagementContextSafely(BrooklynMgmtUnitTestSupport.java:73)
at org.apache.brooklyn.core.test.BrooklynMgmtUnitTestSupport.tearDown(BrooklynMgmtUnitTestSupport.java:58)
at java.util.concurrent.Executors$RunnableAdapter.call(Executors.java:511)
at java.util.concurrent.FutureTask.run(FutureTask.java:266)
at java.util.concurrent.ThreadPoolExecutor.runWorker(ThreadPoolExecutor.java:1142)
at java.util.concurrent.ThreadPoolExecutor$Worker.run(ThreadPoolExecutor.java:617)
at java.lang.Thread.run(Thread.java:745)
2017-05-09 03:55:53,396 INFO TESTNG INVOKING CONFIGURATION: "Surefire test" - @AfterMethod org.apache.brooklyn.core.test.BrooklynMgmtUnitTestSupport.tearDown()
2017-05-09 03:55:53,404 INFO TESTNG PASSED CONFIGURATION: "Surefire test" - @AfterMethod org.apache.brooklyn.core.test.BrooklynMgmtUnitTestSupport.tearDown() finished in 8 ms
2017-05-09 03:55:53,404 INFO TESTNG INVOKING CONFIGURATION: "Surefire test" - @BeforeMethod org.apache.brooklyn.entity.dns.AbstractGeoDnsServiceTest.setUp()
2017-05-09 03:55:53,417 WARN Deprecated use of unmanaged location (SshMachineLocation[West child:null@100.0.0.1/100.0.0.1:22(id=n0ktwkak3k)]); will be managed automatically now but not supported in future versions
2017-05-09 03:55:53,418 WARN Deprecated use of unmanaged location (SshMachineLocation[West child with location:null@100.0.0.1/100.0.0.1:22(id=b00uqykqdo)]); will be managed automatically now but not supported in future versions
2017-05-09 03:55:53,419 WARN Deprecated use of unmanaged location (SshMachineLocation[East child:null@100.0.0.2/100.0.0.2:22(id=itil1vpizk)]); will be managed automatically now but not supported in future versions
2017-05-09 03:55:53,420 WARN Deprecated use of unmanaged location (SshMachineLocation[East child with location:null@100.0.0.2/100.0.0.2:22(id=qoio726tfa)]); will be managed automatically now but not supported in future versions
2017-05-09 03:55:53,421 WARN Deprecated use of unmanaged location (SshMachineLocation[North child:null@10.0.0.1/10.0.0.1:22(id=m84ad8bbdv)]); will be managed automatically now but not supported in future versions
2017-05-09 03:55:53,426 INFO No Camp-YAML parser registered for parsing catalog item DSL; skipping DSL-parsing
2017-05-09 03:55:53,461 INFO TESTNG PASSED CONFIGURATION: "Surefire test" - @BeforeMethod org.apache.brooklyn.entity.dns.AbstractGeoDnsServiceTest.setUp() finished in 57 ms
2017-05-09 03:55:53,461 INFO TESTNG INVOKING: "Surefire test" - org.apache.brooklyn.entity.dns.AbstractGeoDnsServiceTest.testSubscribesToHostname()
2017-05-09 03:55:53,461 INFO TESTNG SKIPPED: "Surefire test" - org.apache.brooklyn.entity.dns.AbstractGeoDnsServiceTest.testSubscribesToHostname() finished in 0 ms
org.testng.internal.thread.ThreadTimeoutException: Method org.apache.brooklyn.core.test.BrooklynMgmtUnitTestSupport.tearDown() didn't finish within the time-out 30000
at java.lang.Throwable.getStackTraceElement(Native Method)
at java.lang.Throwable.getOurStackTrace(Throwable.java:827)
at java.lang.Throwable.getStackTrace(Throwable.java:816)
at ch.qos.logback.classic.spi.ThrowableProxy.<init>(ThrowableProxy.java:55)
at ch.qos.logback.classic.spi.ThrowableProxy.<init>(ThrowableProxy.java:61)
at ch.qos.logback.classic.spi.LoggingEvent.<init>(LoggingEvent.java:125)
at ch.qos.logback.classic.Logger.buildLoggingEventAndAppend(Logger.java:447)
at ch.qos.logback.classic.Logger.filterAndLog_0_Or3Plus(Logger.java:403)
at ch.qos.logback.classic.Logger.error(Logger.java:566)
at org.apache.brooklyn.core.test.BrooklynMgmtUnitTestSupport.destroyManagementContextSafely(BrooklynMgmtUnitTestSupport.java:73)
at org.apache.brooklyn.core.test.BrooklynMgmtUnitTestSupport.tearDown(BrooklynMgmtUnitTestSupport.java:58)
at java.util.concurrent.Executors$RunnableAdapter.call(Executors.java:511)
at java.util.concurrent.FutureTask.run(FutureTask.java:266)
at java.util.concurrent.ThreadPoolExecutor.runWorker(ThreadPoolExecutor.java:1142)
at java.util.concurrent.ThreadPoolExecutor$Worker.run(ThreadPoolExecutor.java:617)
at java.lang.Thread.run(Thread.java:745)
2017-05-09 03:55:53,462 INFO TESTNG INVOKING CONFIGURATION: "Surefire test" - @AfterMethod org.apache.brooklyn.core.test.BrooklynMgmtUnitTestSupport.tearDown()
2017-05-09 03:55:53,469 INFO TESTNG PASSED CONFIGURATION: "Surefire test" - @AfterMethod org.apache.brooklyn.core.test.BrooklynMgmtUnitTestSupport.tearDown() finished in 8 ms
2017-05-09 03:55:53,518 INFO TESTNG
===============================================
Surefire test
Tests run: 41, Failures: 0, Skips: 4
Configuration Failures: 1, Skips: 0
===============================================
2017-05-09 03:55:53,518 WARN Management Context LocalManagementContext[?-bFrkuvBL] running, creation stacktrace:
java.lang.Throwable: for construction stacktrace
at org.apache.brooklyn.core.mgmt.internal.LocalManagementContext.<init>(LocalManagementContext.java:141)
at org.apache.brooklyn.core.mgmt.internal.LocalManagementContext.<init>(LocalManagementContext.java:163)
at org.apache.brooklyn.core.mgmt.internal.LocalManagementContext.<init>(LocalManagementContext.java:159)
at org.apache.brooklyn.core.test.entity.LocalManagementContextForTests.<init>(LocalManagementContextForTests.java:44)
at org.apache.brooklyn.core.test.entity.LocalManagementContextForTests$Builder.build(LocalManagementContextForTests.java:184)
at org.apache.brooklyn.core.test.entity.LocalManagementContextForTests.newInstance(LocalManagementContextForTests.java:199)
at org.apache.brooklyn.core.test.BrooklynMgmtUnitTestSupport.setUp(BrooklynMgmtUnitTestSupport.java:50)
at org.apache.brooklyn.core.test.BrooklynAppUnitTestSupport.setUp(BrooklynAppUnitTestSupport.java:38)
at org.apache.brooklyn.entity.dns.AbstractGeoDnsServiceTest.setUp(AbstractGeoDnsServiceTest.java:98)
at sun.reflect.NativeMethodAccessorImpl.invoke0(Native Method)
at sun.reflect.NativeMethodAccessorImpl.invoke(NativeMethodAccessorImpl.java:62)
at sun.reflect.DelegatingMethodAccessorImpl.invoke(DelegatingMethodAccessorImpl.java:43)
at java.lang.reflect.Method.invoke(Method.java:498)
at org.testng.internal.MethodInvocationHelper.invokeMethod(MethodInvocationHelper.java:104)
at org.testng.internal.Invoker.invokeConfigurationMethod(Invoker.java:515)
at org.testng.internal.Invoker.invokeConfigurations(Invoker.java:217)
at org.testng.internal.Invoker.invokeMethod(Invoker.java:590)
at org.testng.internal.Invoker.invokeTestMethod(Invoker.java:851)
at org.testng.internal.Invoker.invokeTestMethods(Invoker.java:1177)
at org.testng.internal.TestMethodWorker.invokeTestMethods(TestMethodWorker.java:129)
at org.testng.internal.TestMethodWorker.run(TestMethodWorker.java:112)
at org.testng.TestRunner.privateRun(TestRunner.java:756)
at org.testng.TestRunner.run(TestRunner.java:610)
at org.testng.SuiteRunner.runTest(SuiteRunner.java:387)
at org.testng.SuiteRunner.runSequentially(SuiteRunner.java:382)
at org.testng.SuiteRunner.privateRun(SuiteRunner.java:340)
at org.testng.SuiteRunner.run(SuiteRunner.java:289)
at org.testng.SuiteRunnerWorker.runSuite(SuiteRunnerWorker.java:52)
at org.testng.SuiteRunnerWorker.run(SuiteRunnerWorker.java:86)
at org.testng.TestNG.runSuitesSequentially(TestNG.java:1293)
at org.testng.TestNG.runSuitesLocally(TestNG.java:1218)
at org.testng.TestNG.runSuites(TestNG.java:1133)
at org.testng.TestNG.run(TestNG.java:1104)
at org.apache.maven.surefire.testng.TestNGExecutor.run(TestNGExecutor.java:132)
at org.apache.maven.surefire.testng.TestNGDirectoryTestSuite.executeMulti(TestNGDirectoryTestSuite.java:193)
at org.apache.maven.surefire.testng.TestNGDirectoryTestSuite.execute(TestNGDirectoryTestSuite.java:94)
at org.apache.maven.surefire.testng.TestNGProvider.invoke(TestNGProvider.java:147)
at org.apache.maven.surefire.booter.ForkedBooter.invokeProviderInSameClassLoader(ForkedBooter.java:290)
at org.apache.maven.surefire.booter.ForkedBooter.runSuitesInProcess(ForkedBooter.java:242)
at org.apache.maven.surefire.booter.ForkedBooter.main(ForkedBooter.java:121)
2017-05-09 03:55:53,519 INFO BrooklynLeakListener.onFinish attempting to terminate all extant ManagementContexts: name=Surefire test; includedGroups=[]; excludedGroups=[Integration, Acceptance, Live, Live-sanity, WIP, Broken]; suiteName=Surefire suite; outDir=<https://builds.apache.org/job/brooklyn-library-master/ws/software/webapp/target/surefire-reports/Surefire> suite: 1 ManagementContexts terminated
2017-05-09 03:55:53,520 ERROR Problem refreshing group membership: org.apache.brooklyn.util.exceptions.RuntimeInterruptedException: java.lang.InterruptedException
org.apache.brooklyn.util.exceptions.RuntimeInterruptedException: java.lang.InterruptedException
at org.apache.brooklyn.util.exceptions.Exceptions.propagate(Exceptions.java:124) ~[brooklyn-utils-common-0.12.0-SNAPSHOT.jar:0.12.0-SNAPSHOT]
Caused by: java.lang.InterruptedException: null
at java.util.concurrent.FutureTask.awaitDone(FutureTask.java:404) [na:1.8.0_121]
Tests run: 42, Failures: 1, Errors: 0, Skipped: 4, Time elapsed: 50.301 sec <<< FAILURE! - in TestSuite
tearDown(org.apache.brooklyn.entity.dns.AbstractGeoDnsServiceTest) Time elapsed: 30.073 sec <<< FAILURE!
org.testng.internal.thread.ThreadTimeoutException: Method org.apache.brooklyn.core.test.BrooklynMgmtUnitTestSupport.tearDown() didn't finish within the time-out 30000
Results :
Failed tests:
AbstractGeoDnsServiceTest>BrooklynMgmtUnitTestSupport.tearDown:58->BrooklynMgmtUnitTestSupport.destroyManagementContextSafely:73 » ThreadTimeout
Tests run: 42, Failures: 1, Errors: 0, Skipped: 4
[JENKINS] Recording test results
[INFO] ------------------------------------------------------------------------
[INFO] Reactor Summary:
[INFO]
[INFO] Brooklyn Library Root .............................. SUCCESS [ 8.792 s]
[INFO] Brooklyn CM SaltStack .............................. SUCCESS [ 47.200 s]
[INFO] Brooklyn CM Ansible ................................ SUCCESS [ 5.905 s]
[INFO] Brooklyn CM Integration Root ....................... SUCCESS [ 1.342 s]
[INFO] Brooklyn Network Software Entities ................. SUCCESS [ 6.391 s]
[INFO] Brooklyn OSGi Software Entities .................... SUCCESS [ 5.835 s]
[INFO] Brooklyn Database Software Entities ................ SUCCESS [ 9.793 s]
[INFO] Brooklyn Web App Software Entities ................. FAILURE [ 57.489 s]
[INFO] Brooklyn Messaging Software Entities ............... SKIPPED
[INFO] Brooklyn NoSQL Data Store Software Entities ........ SKIPPED
[INFO] Brooklyn Monitoring Software Entities .............. SKIPPED
[INFO] Brooklyn QA ........................................ SKIPPED
[INFO] Brooklyn Examples Aggregator Project ............... SKIPPED
[INFO] Brooklyn Examples Aggregator Project - Webapps ..... SKIPPED
[INFO] hello-world-webapp Maven Webapp .................... SKIPPED
[INFO] hello-world-sql-webapp Maven Webapp ................ SKIPPED
[INFO] Brooklyn Simple Web Cluster Example ................ SKIPPED
[INFO] Brooklyn Global Web Fabric Example ................. SKIPPED
[INFO] Brooklyn Simple Messaging Publish-Subscribe Example SKIPPED
[INFO] Brooklyn NoSQL Cluster Examples .................... SKIPPED
[INFO] Brooklyn Library Karaf integration ................. SKIPPED
[INFO] Brooklyn Library Catalog ........................... SKIPPED
[INFO] Brooklyn Library Karaf Features .................... SKIPPED
[INFO] ------------------------------------------------------------------------
[INFO] BUILD FAILURE
[INFO] ------------------------------------------------------------------------
[INFO] Total time: 02:41 min
[INFO] Finished at: 2017-05-09T03:56:00+00:00
[INFO] Final Memory: 94M/653M
[INFO] ------------------------------------------------------------------------
Waiting for Jenkins to finish collecting data
[ERROR] Failed to execute goal org.apache.maven.plugins:maven-surefire-plugin:2.19.1:test (default-test) on project brooklyn-software-webapp: There are test failures.
[ERROR]
[ERROR] Please refer to <https://builds.apache.org/job/brooklyn-library-master/ws/software/webapp/target/surefire-reports> for the individual test results.
[ERROR] -> [Help 1]
[ERROR]
[ERROR] To see the full stack trace of the errors, re-run Maven with the -e switch.
[ERROR] Re-run Maven using the -X switch to enable full debug logging.
[ERROR]
[ERROR] For more information about the errors and possible solutions, please read the following articles:
[ERROR] [Help 1] http://cwiki.apache.org/confluence/display/MAVEN/MojoFailureException
[ERROR]
[ERROR] After correcting the problems, you can resume the build with the command
[ERROR] mvn <goals> -rf :brooklyn-software-webapp
[JENKINS] Archiving <https://builds.apache.org/job/brooklyn-library-master/ws/software/cm/salt/pom.xml> to org.apache.brooklyn/brooklyn-software-cm-salt/0.12.0-SNAPSHOT/brooklyn-software-cm-salt-0.12.0-SNAPSHOT.pom
[JENKINS] Archiving <https://builds.apache.org/job/brooklyn-library-master/ws/software/cm/salt/target/brooklyn-software-cm-salt-0.12.0-SNAPSHOT.jar> to org.apache.brooklyn/brooklyn-software-cm-salt/0.12.0-SNAPSHOT/brooklyn-software-cm-salt-0.12.0-SNAPSHOT.jar
[JENKINS] Archiving <https://builds.apache.org/job/brooklyn-library-master/ws/software/cm/salt/target/brooklyn-software-cm-salt-0.12.0-SNAPSHOT-tests.jar> to org.apache.brooklyn/brooklyn-software-cm-salt/0.12.0-SNAPSHOT/brooklyn-software-cm-salt-0.12.0-SNAPSHOT-tests.jar
[JENKINS] Archiving <https://builds.apache.org/job/brooklyn-library-master/ws/software/cm/salt/target/brooklyn-software-cm-salt-0.12.0-SNAPSHOT-sources.jar> to org.apache.brooklyn/brooklyn-software-cm-salt/0.12.0-SNAPSHOT/brooklyn-software-cm-salt-0.12.0-SNAPSHOT-sources.jar
[JENKINS] Archiving <https://builds.apache.org/job/brooklyn-library-master/ws/software/cm/salt/target/brooklyn-software-cm-salt-0.12.0-SNAPSHOT-test-sources.jar> to org.apache.brooklyn/brooklyn-software-cm-salt/0.12.0-SNAPSHOT/brooklyn-software-cm-salt-0.12.0-SNAPSHOT-test-sources.jar
[JENKINS] Archiving <https://builds.apache.org/job/brooklyn-library-master/ws/software/osgi/pom.xml> to org.apache.brooklyn/brooklyn-software-osgi/0.12.0-SNAPSHOT/brooklyn-software-osgi-0.12.0-SNAPSHOT.pom
[JENKINS] Archiving <https://builds.apache.org/job/brooklyn-library-master/ws/software/osgi/target/brooklyn-software-osgi-0.12.0-SNAPSHOT.jar> to org.apache.brooklyn/brooklyn-software-osgi/0.12.0-SNAPSHOT/brooklyn-software-osgi-0.12.0-SNAPSHOT.jar
[JENKINS] Archiving <https://builds.apache.org/job/brooklyn-library-master/ws/software/osgi/target/brooklyn-software-osgi-0.12.0-SNAPSHOT-tests.jar> to org.apache.brooklyn/brooklyn-software-osgi/0.12.0-SNAPSHOT/brooklyn-software-osgi-0.12.0-SNAPSHOT-tests.jar
[JENKINS] Archiving <https://builds.apache.org/job/brooklyn-library-master/ws/software/osgi/target/brooklyn-software-osgi-0.12.0-SNAPSHOT-sources.jar> to org.apache.brooklyn/brooklyn-software-osgi/0.12.0-SNAPSHOT/brooklyn-software-osgi-0.12.0-SNAPSHOT-sources.jar
[JENKINS] Archiving <https://builds.apache.org/job/brooklyn-library-master/ws/software/osgi/target/brooklyn-software-osgi-0.12.0-SNAPSHOT-test-sources.jar> to org.apache.brooklyn/brooklyn-software-osgi/0.12.0-SNAPSHOT/brooklyn-software-osgi-0.12.0-SNAPSHOT-test-sources.jar
[JENKINS] Archiving <https://builds.apache.org/job/brooklyn-library-master/ws/pom.xml> to org.apache.brooklyn/brooklyn-library/0.12.0-SNAPSHOT/brooklyn-library-0.12.0-SNAPSHOT.pom
[JENKINS] Archiving <https://builds.apache.org/job/brooklyn-library-master/ws/software/database/pom.xml> to org.apache.brooklyn/brooklyn-software-database/0.12.0-SNAPSHOT/brooklyn-software-database-0.12.0-SNAPSHOT.pom
[JENKINS] Archiving <https://builds.apache.org/job/brooklyn-library-master/ws/software/database/target/brooklyn-software-database-0.12.0-SNAPSHOT.jar> to org.apache.brooklyn/brooklyn-software-database/0.12.0-SNAPSHOT/brooklyn-software-database-0.12.0-SNAPSHOT.jar
[JENKINS] Archiving <https://builds.apache.org/job/brooklyn-library-master/ws/software/database/target/brooklyn-software-database-0.12.0-SNAPSHOT-tests.jar> to org.apache.brooklyn/brooklyn-software-database/0.12.0-SNAPSHOT/brooklyn-software-database-0.12.0-SNAPSHOT-tests.jar
[JENKINS] Archiving <https://builds.apache.org/job/brooklyn-library-master/ws/software/database/target/brooklyn-software-database-0.12.0-SNAPSHOT-sources.jar> to org.apache.brooklyn/brooklyn-software-database/0.12.0-SNAPSHOT/brooklyn-software-database-0.12.0-SNAPSHOT-sources.jar
[JENKINS] Archiving <https://builds.apache.org/job/brooklyn-library-master/ws/software/database/target/brooklyn-software-database-0.12.0-SNAPSHOT-test-sources.jar> to org.apache.brooklyn/brooklyn-software-database/0.12.0-SNAPSHOT/brooklyn-software-database-0.12.0-SNAPSHOT-test-sources.jar
Compressed 663.70 KB of artifacts by 19.3% relative to #274
[JENKINS] Archiving <https://builds.apache.org/job/brooklyn-library-master/ws/examples/webapps/hello-world-webapp/pom.xml> to org.apache.brooklyn.example/brooklyn-example-hello-world-webapp/0.12.0-SNAPSHOT/brooklyn-example-hello-world-webapp-0.12.0-SNAPSHOT.pom
[JENKINS] Archiving <https://builds.apache.org/job/brooklyn-library-master/ws/software/messaging/pom.xml> to org.apache.brooklyn/brooklyn-software-messaging/0.12.0-SNAPSHOT/brooklyn-software-messaging-0.12.0-SNAPSHOT.pom
[JENKINS] Archiving <https://builds.apache.org/job/brooklyn-library-master/ws/qa/pom.xml> to org.apache.brooklyn/brooklyn-qa/0.12.0-SNAPSHOT/brooklyn-qa-0.12.0-SNAPSHOT.pom
[JENKINS] Archiving <https://builds.apache.org/job/brooklyn-library-master/ws/software/cm/ansible/pom.xml> to org.apache.brooklyn/brooklyn-software-cm-ansible/0.12.0-SNAPSHOT/brooklyn-software-cm-ansible-0.12.0-SNAPSHOT.pom
[JENKINS] Archiving <https://builds.apache.org/job/brooklyn-library-master/ws/software/cm/ansible/target/brooklyn-software-cm-ansible-0.12.0-SNAPSHOT.jar> to org.apache.brooklyn/brooklyn-software-cm-ansible/0.12.0-SNAPSHOT/brooklyn-software-cm-ansible-0.12.0-SNAPSHOT.jar
[JENKINS] Archiving <https://builds.apache.org/job/brooklyn-library-master/ws/software/cm/ansible/target/brooklyn-software-cm-ansible-0.12.0-SNAPSHOT-tests.jar> to org.apache.brooklyn/brooklyn-software-cm-ansible/0.12.0-SNAPSHOT/brooklyn-software-cm-ansible-0.12.0-SNAPSHOT-tests.jar
[JENKINS] Archiving <https://builds.apache.org/job/brooklyn-library-master/ws/software/cm/ansible/target/brooklyn-software-cm-ansible-0.12.0-SNAPSHOT-sources.jar> to org.apache.brooklyn/brooklyn-software-cm-ansible/0.12.0-SNAPSHOT/brooklyn-software-cm-ansible-0.12.0-SNAPSHOT-sources.jar
[JENKINS] Archiving <https://builds.apache.org/job/brooklyn-library-master/ws/software/cm/ansible/target/brooklyn-software-cm-ansible-0.12.0-SNAPSHOT-test-sources.jar> to org.apache.brooklyn/brooklyn-software-cm-ansible/0.12.0-SNAPSHOT/brooklyn-software-cm-ansible-0.12.0-SNAPSHOT-test-sources.jar
[JENKINS] Archiving <https://builds.apache.org/job/brooklyn-library-master/ws/software/monitoring/pom.xml> to org.apache.brooklyn/brooklyn-software-monitoring/0.12.0-SNAPSHOT/brooklyn-software-monitoring-0.12.0-SNAPSHOT.pom
[JENKINS] Archiving <https://builds.apache.org/job/brooklyn-library-master/ws/examples/global-web-fabric/pom.xml> to org.apache.brooklyn.example/brooklyn-example-global-web-fabric/0.12.0-SNAPSHOT/brooklyn-example-global-web-fabric-0.12.0-SNAPSHOT.pom
[JENKINS] Archiving <https://builds.apache.org/job/brooklyn-library-master/ws/karaf/catalog/pom.xml> to org.apache.brooklyn/brooklyn-library-catalog/0.12.0-SNAPSHOT/brooklyn-library-catalog-0.12.0-SNAPSHOT.pom
[JENKINS] Archiving <https://builds.apache.org/job/brooklyn-library-master/ws/software/cm/pom.xml> to org.apache.brooklyn/brooklyn-software-cm/0.12.0-SNAPSHOT/brooklyn-software-cm-0.12.0-SNAPSHOT.pom
[JENKINS] Archiving <https://builds.apache.org/job/brooklyn-library-master/ws/examples/webapps/hello-world-sql/pom.xml> to org.apache.brooklyn.example/brooklyn-example-hello-world-sql-webapp/0.12.0-SNAPSHOT/brooklyn-example-hello-world-sql-webapp-0.12.0-SNAPSHOT.pom
[JENKINS] Archiving <https://builds.apache.org/job/brooklyn-library-master/ws/examples/simple-messaging-pubsub/pom.xml> to org.apache.brooklyn.example/brooklyn-example-simple-messaging-pubsub/0.12.0-SNAPSHOT/brooklyn-example-simple-messaging-pubsub-0.12.0-SNAPSHOT.pom
[JENKINS] Archiving <https://builds.apache.org/job/brooklyn-library-master/ws/software/network/pom.xml> to org.apache.brooklyn/brooklyn-software-network/0.12.0-SNAPSHOT/brooklyn-software-network-0.12.0-SNAPSHOT.pom
[JENKINS] Archiving <https://builds.apache.org/job/brooklyn-library-master/ws/software/network/target/brooklyn-software-network-0.12.0-SNAPSHOT.jar> to org.apache.brooklyn/brooklyn-software-network/0.12.0-SNAPSHOT/brooklyn-software-network-0.12.0-SNAPSHOT.jar
[JENKINS] Archiving <https://builds.apache.org/job/brooklyn-library-master/ws/software/network/target/brooklyn-software-network-0.12.0-SNAPSHOT-tests.jar> to org.apache.brooklyn/brooklyn-software-network/0.12.0-SNAPSHOT/brooklyn-software-network-0.12.0-SNAPSHOT-tests.jar
[JENKINS] Archiving <https://builds.apache.org/job/brooklyn-library-master/ws/software/network/target/brooklyn-software-network-0.12.0-SNAPSHOT-sources.jar> to org.apache.brooklyn/brooklyn-software-network/0.12.0-SNAPSHOT/brooklyn-software-network-0.12.0-SNAPSHOT-sources.jar
[JENKINS] Archiving <https://builds.apache.org/job/brooklyn-library-master/ws/software/network/target/brooklyn-software-network-0.12.0-SNAPSHOT-test-sources.jar> to org.apache.brooklyn/brooklyn-software-network/0.12.0-SNAPSHOT/brooklyn-software-network-0.12.0-SNAPSHOT-test-sources.jar
[JENKINS] Archiving <https://builds.apache.org/job/brooklyn-library-master/ws/software/webapp/pom.xml> to org.apache.brooklyn/brooklyn-software-webapp/0.12.0-SNAPSHOT/brooklyn-software-webapp-0.12.0-SNAPSHOT.pom
[JENKINS] Archiving <https://builds.apache.org/job/brooklyn-library-master/ws/software/nosql/pom.xml> to org.apache.brooklyn/brooklyn-software-nosql/0.12.0-SNAPSHOT/brooklyn-software-nosql-0.12.0-SNAPSHOT.pom
[JENKINS] Archiving <https://builds.apache.org/job/brooklyn-library-master/ws/karaf/features/pom.xml> to org.apache.brooklyn/brooklyn-library-features/0.12.0-SNAPSHOT/brooklyn-library-features-0.12.0-SNAPSHOT.pom
[JENKINS] Archiving <https://builds.apache.org/job/brooklyn-library-master/ws/karaf/pom.xml> to org.apache.brooklyn/brooklyn-library-karaf/0.12.0-SNAPSHOT/brooklyn-library-karaf-0.12.0-SNAPSHOT.pom
[JENKINS] Archiving <https://builds.apache.org/job/brooklyn-library-master/ws/examples/simple-nosql-cluster/pom.xml> to org.apache.brooklyn.example/brooklyn-example-simple-nosql-cluster/0.12.0-SNAPSHOT/brooklyn-example-simple-nosql-cluster-0.12.0-SNAPSHOT.pom
[JENKINS] Archiving <https://builds.apache.org/job/brooklyn-library-master/ws/examples/webapps/pom.xml> to org.apache.brooklyn.example/brooklyn-examples-webapps-parent/0.12.0-SNAPSHOT/brooklyn-examples-webapps-parent-0.12.0-SNAPSHOT.pom
[JENKINS] Archiving <https://builds.apache.org/job/brooklyn-library-master/ws/examples/simple-web-cluster/pom.xml> to org.apache.brooklyn.example/brooklyn-example-simple-web-cluster/0.12.0-SNAPSHOT/brooklyn-example-simple-web-cluster-0.12.0-SNAPSHOT.pom
[JENKINS] Archiving <https://builds.apache.org/job/brooklyn-library-master/ws/examples/pom.xml> to org.apache.brooklyn.example/brooklyn-examples-parent/0.12.0-SNAPSHOT/brooklyn-examples-parent-0.12.0-SNAPSHOT.pom
channel stopped