You are viewing a plain text version of this content. The canonical link for it is here.
Posted to notifications@jclouds.apache.org by BuildHive <bu...@cloudbees.com> on 2014/09/08 03:23:19 UTC
Build failed in Jenkins: jclouds » jclouds-labs #1498
See <https://buildhive.cloudbees.com/job/jclouds/job/jclouds-labs/1498/changes>
Changes:
[devcsrj] JCloud ProfitBricks provider implementation
[devcsrj] Added profitbricks module to parent pom
------------------------------------------
[...truncated 6442 lines...]
[INFO]
[INFO] --- maven-compiler-plugin:3.1:testCompile (default-testCompile) @ profitbricks-c2 ---
[INFO] Changes detected - recompiling the module!
[INFO] Compiling 10 source files to <https://buildhive.cloudbees.com/job/jclouds/job/jclouds-labs/ws/profitbricks-c2/target/test-classes>
[INFO]
[INFO] --- maven-surefire-plugin:2.17:test (default-test) @ profitbricks-c2 ---
[INFO] Surefire report directory: <https://buildhive.cloudbees.com/job/jclouds/job/jclouds-labs/ws/profitbricks-c2/target/surefire-reports>
-------------------------------------------------------
T E S T S
-------------------------------------------------------
Running TestSuite
Configuring TestNG with: TestNG652Configurator
Starting test testConvert(org.jclouds.profitbricks.functions.VdcToLocationTest)
[pool-1-thread-1] Test testConvert(org.jclouds.profitbricks.functions.VdcToLocationTest) succeeded: 144ms
Test suite progress: tests succeeded: 1, failed: 0, skipped: 0.
Starting test testConvert(org.jclouds.profitbricks.functions.TemplateToNewServerTest)
[pool-2-thread-1] Test testConvert(org.jclouds.profitbricks.functions.TemplateToNewServerTest) succeeded: 164ms
Test suite progress: tests succeeded: 2, failed: 0, skipped: 0.
Starting test testConvert(org.jclouds.profitbricks.functions.PBImageToImageTest)
[pool-3-thread-1] Test testConvert(org.jclouds.profitbricks.functions.PBImageToImageTest) succeeded: 56ms
Test suite progress: tests succeeded: 3, failed: 0, skipped: 0.
Starting test testConvert(org.jclouds.profitbricks.functions.ServerToNodeMetadataTest)
[pool-4-thread-1] Test testConvert(org.jclouds.profitbricks.functions.ServerToNodeMetadataTest) succeeded: 43ms
Test suite progress: tests succeeded: 4, failed: 0, skipped: 0.
Tests run: 4, Failures: 0, Errors: 0, Skipped: 0, Time elapsed: 2.595 sec - in TestSuite
Results :
Tests run: 4, Failures: 0, Errors: 0, Skipped: 0
[JENKINS] Recording test results
[INFO]
[INFO] --- maven-bundle-plugin:2.3.7:bundle (default-bundle) @ profitbricks-c2 ---
[INFO]
[INFO] --- maven-site-plugin:3.3:attach-descriptor (attach-descriptor) @ profitbricks-c2 ---
[INFO]
[INFO] --- apache-rat-plugin:0.10:check (default) @ profitbricks-c2 ---
[INFO] 51 implicit excludes (use -debug for more details).
[INFO] Exclude: **/src/test/resources/**/*.sh
[INFO] Exclude: **/src/test/resources/**/*.bat
[INFO] Exclude: **/src/test/resources/**/*.cmd
[INFO] Exclude: **/src/test/resources/**/*.txt
[INFO] Exclude: **/src/test/resources/**/*.gz
[INFO] Exclude: **/src/test/resources/**/*.xml
[INFO] Exclude: **/src/test/resources/**/*.iso
[INFO] Exclude: **/LICENSE.txt
[INFO] Exclude: **/header.txt
[INFO] Exclude: **/NOTICE.txt
[INFO] Exclude: **/DISCLAIMER
[INFO] Exclude: **/BUILD.txt
[INFO] Exclude: **/CHANGES.txt
[INFO] Exclude: **/README.md
[INFO] Exclude: **/README.txt
[INFO] Exclude: **/DEPENDENCIES
[INFO] Exclude: **/CONTRIBUTING.md
[INFO] Exclude: **/*json
[INFO] Exclude: **/*readme
[INFO] Exclude: **/*ProviderMetadata
[INFO] Exclude: **/*ApiMetadata
[INFO] Exclude: **/*LoggingModule
[INFO] Exclude: **/*ViewMBeanFactory
[INFO] Exclude: **/target/**
[INFO] Exclude: **/test-output/**
[INFO] Exclude: **/bin/**
[INFO] Exclude: **/.settings/**
[INFO] Exclude: **/.classpath
[INFO] Exclude: **/.dir-locals.el
[INFO] Exclude: **/.project
[INFO] Exclude: **/.idea/**
[INFO] Exclude: **/*.iml
[INFO] Exclude: **/*.eml
[INFO] Exclude: **/*.ipr
[INFO] Exclude: **/*.iws
[INFO] Exclude: **/*.DS_STORE
[INFO] Exclude: **/TAGS
[INFO] Exclude: **/.metadata/**
[INFO] Exclude: **/atlassian-ide-plugin.xml
[INFO] Exclude: **/.DS_Store
[INFO] Exclude: .mailmap
[INFO] Exclude: .git/**
[INFO] Exclude: **/.gitignore
[INFO] Exclude: **/.gitattributes
[INFO] Exclude: .repository/**
[INFO] Exclude: .repository/**
[INFO] Exclude: gc.log
[INFO] 108 resources included (use -debug for more details)
Warning: org.apache.xerces.jaxp.SAXParserImpl$JAXPSAXParser: Property 'http://www.oracle.com/xml/jaxp/properties/entityExpansionLimit' is not recognized.
Compiler warnings:
WARNING: 'org.apache.xerces.jaxp.SAXParserImpl: Property 'http://javax.xml.XMLConstants/property/accessExternalDTD' is not recognized.'
Warning: org.apache.xerces.parsers.SAXParser: Feature 'http://javax.xml.XMLConstants/feature/secure-processing' is not recognized.
Warning: org.apache.xerces.parsers.SAXParser: Property 'http://javax.xml.XMLConstants/property/accessExternalDTD' is not recognized.
Warning: org.apache.xerces.parsers.SAXParser: Property 'http://www.oracle.com/xml/jaxp/properties/entityExpansionLimit' is not recognized.
[INFO] Rat check: Summary of files. Unapproved: 2 unknown: 2 generated: 0 approved: 106 licence.
[INFO] ------------------------------------------------------------------------
[INFO] Reactor Summary:
[INFO]
[INFO] Apache jclouds labs ............................... SUCCESS [44.023s]
[INFO] jclouds docker API ................................ SUCCESS [1:16.837s]
[INFO] jclouds virtualbox api ............................ SUCCESS [1:00.046s]
[INFO] jclouds dmtf domain objects ....................... SUCCESS [6.225s]
[INFO] jclouds vcloud-director api ....................... SUCCESS [2:07.453s]
[INFO] jclouds cdmi api .................................. SUCCESS [16.662s]
[INFO] jclouds CloudSigma v2 API ......................... SUCCESS [1:22.981s]
[INFO] jclouds CloudSigma v2 Las Vegas Provider .......... SUCCESS [5.131s]
[INFO] jclouds CloudSigma v2 Washington DC Provider ...... SUCCESS [3.695s]
[INFO] jclouds CloudSigma v2 Zurich Provider ............. SUCCESS [6.023s]
[INFO] jclouds DigitalOcean Provider ..................... SUCCESS [1:11.474s]
[INFO] jclouds joyent-cloudapi api ....................... SUCCESS [50.739s]
[INFO] jclouds joyentcloud provider ...................... SUCCESS [7.295s]
[INFO] jclouds Fujitsu Global Cloud Platform ............. SUCCESS [1:27.934s]
[INFO] jclouds Fujitsu Global Cloud Platform AU provider . SUCCESS [7.923s]
[INFO] jclouds Fujitsu Global Cloud Platform DE provider . SUCCESS [11.695s]
[INFO] jclouds Abiquo api ................................ SUCCESS [2:13.444s]
[INFO] jclouds :: representations ........................ SUCCESS [1.042s]
[INFO] jclouds :: representations :: core ................ SUCCESS [9.367s]
[INFO] jclouds :: representations :: codec ............... SUCCESS [23.244s]
[INFO] jclouds :: management ............................. SUCCESS [0.859s]
[INFO] jclouds :: management :: core ..................... SUCCESS [12.371s]
[INFO] jclouds :: management :: compute .................. SUCCESS [2.645s]
[INFO] jclouds :: management :: blobstore ................ SUCCESS [2.142s]
[INFO] jclouds ProfitBricks Provider ..................... FAILURE [8.414s]
[INFO] ------------------------------------------------------------------------
[INFO] BUILD FAILURE
[INFO] ------------------------------------------------------------------------
[INFO] Total time: 14:35.654s
[INFO] Finished at: Mon Sep 08 01:23:01 UTC 2014
[INFO] Final Memory: 59M/192M
[INFO] ------------------------------------------------------------------------
Waiting for Jenkins to finish collecting data
[ERROR] Failed to execute goal org.apache.rat:apache-rat-plugin:0.10:check (default) on project profitbricks-c2: Too many files with unapproved license: 2 See RAT report in: <https://buildhive.cloudbees.com/job/jclouds/job/jclouds-labs/ws/profitbricks-c2/target/rat.txt> -> [Help 1]
org.apache.maven.lifecycle.LifecycleExecutionException: Failed to execute goal org.apache.rat:apache-rat-plugin:0.10:check (default) on project profitbricks-c2: Too many files with unapproved license: 2 See RAT report in: <https://buildhive.cloudbees.com/job/jclouds/job/jclouds-labs/ws/profitbricks-c2/target/rat.txt>
at org.apache.maven.lifecycle.internal.MojoExecutor.execute(MojoExecutor.java:213)
at org.apache.maven.lifecycle.internal.MojoExecutor.execute(MojoExecutor.java:153)
at org.apache.maven.lifecycle.internal.MojoExecutor.execute(MojoExecutor.java:145)
at org.apache.maven.lifecycle.internal.LifecycleModuleBuilder.buildProject(LifecycleModuleBuilder.java:84)
at org.apache.maven.lifecycle.internal.LifecycleModuleBuilder.buildProject(LifecycleModuleBuilder.java:59)
at org.apache.maven.lifecycle.internal.LifecycleStarter.singleThreadedBuild(LifecycleStarter.java:183)
at org.apache.maven.lifecycle.internal.LifecycleStarter.execute(LifecycleStarter.java:161)
at org.apache.maven.DefaultMaven.doExecute(DefaultMaven.java:320)
at org.apache.maven.DefaultMaven.execute(DefaultMaven.java:156)
at org.jvnet.hudson.maven3.launcher.Maven3Launcher.main(Maven3Launcher.java:117)
at sun.reflect.NativeMethodAccessorImpl.invoke0(Native Method)
at sun.reflect.NativeMethodAccessorImpl.invoke(NativeMethodAccessorImpl.java:57)
at sun.reflect.DelegatingMethodAccessorImpl.invoke(DelegatingMethodAccessorImpl.java:43)
at java.lang.reflect.Method.invoke(Method.java:606)
at org.codehaus.plexus.classworlds.launcher.Launcher.launchStandard(Launcher.java:329)
at org.codehaus.plexus.classworlds.launcher.Launcher.launch(Launcher.java:239)
at org.jvnet.hudson.maven3.agent.Maven3Main.launch(Maven3Main.java:178)
at sun.reflect.NativeMethodAccessorImpl.invoke0(Native Method)
at sun.reflect.NativeMethodAccessorImpl.invoke(NativeMethodAccessorImpl.java:57)
at sun.reflect.DelegatingMethodAccessorImpl.invoke(DelegatingMethodAccessorImpl.java:43)
at java.lang.reflect.Method.invoke(Method.java:606)
at hudson.maven.Maven3Builder.call(Maven3Builder.java:134)
at hudson.maven.Maven3Builder.call(Maven3Builder.java:69)
at hudson.remoting.UserRequest.perform(UserRequest.java:118)
at hudson.remoting.UserRequest.perform(UserRequest.java:48)
at hudson.remoting.Request$2.run(Request.java:328)
at hudson.remoting.InterceptingExecutorService$1.call(InterceptingExecutorService.java:72)
at java.util.concurrent.FutureTask.run(FutureTask.java:262)
at java.util.concurrent.ThreadPoolExecutor.runWorker(ThreadPoolExecutor.java:1145)
at java.util.concurrent.ThreadPoolExecutor$Worker.run(ThreadPoolExecutor.java:615)
at java.lang.Thread.run(Thread.java:744)
Caused by: org.apache.rat.mp.RatCheckException: Too many files with unapproved license: 2 See RAT report in: <https://buildhive.cloudbees.com/job/jclouds/job/jclouds-labs/ws/profitbricks-c2/target/rat.txt>
at org.apache.rat.mp.RatCheckMojo.check(RatCheckMojo.java:183)
at org.apache.rat.mp.RatCheckMojo.execute(RatCheckMojo.java:171)
at org.apache.maven.plugin.DefaultBuildPluginManager.executeMojo(DefaultBuildPluginManager.java:101)
at org.apache.maven.lifecycle.internal.MojoExecutor.execute(MojoExecutor.java:209)
... 30 more
[ERROR]
[ERROR] Re-run Maven using the -X switch to enable full debug logging.
[ERROR]
[ERROR] For more information about the errors and possible solutions, please read the following articles:
[ERROR] [Help 1] http://cwiki.apache.org/confluence/display/MAVEN/MojoFailureException
[ERROR]
[ERROR] After correcting the problems, you can resume the build with the command
[ERROR] mvn <goals> -rf :profitbricks-c2
[JENKINS] Archiving <https://buildhive.cloudbees.com/job/jclouds/job/jclouds-labs/ws/cloudsigma2/pom.xml> to org.apache.jclouds.labs/cloudsigma2/2.0.0-SNAPSHOT/cloudsigma2-2.0.0-SNAPSHOT.pom
[JENKINS] Archiving <https://buildhive.cloudbees.com/job/jclouds/job/jclouds-labs/ws/cloudsigma2/target/cloudsigma2-2.0.0-SNAPSHOT.jar> to org.apache.jclouds.labs/cloudsigma2/2.0.0-SNAPSHOT/cloudsigma2-2.0.0-SNAPSHOT.jar
[JENKINS] Archiving <https://buildhive.cloudbees.com/job/jclouds/job/jclouds-labs/ws/cloudsigma2/target/cloudsigma2-2.0.0-SNAPSHOT-tests.jar> to org.apache.jclouds.labs/cloudsigma2/2.0.0-SNAPSHOT/cloudsigma2-2.0.0-SNAPSHOT-tests.jar
[JENKINS] Archiving <https://buildhive.cloudbees.com/job/jclouds/job/jclouds-labs/ws/joyent-cloudapi/pom.xml> to org.apache.jclouds.labs/joyent-cloudapi/2.0.0-SNAPSHOT/joyent-cloudapi-2.0.0-SNAPSHOT.pom
[JENKINS] Archiving <https://buildhive.cloudbees.com/job/jclouds/job/jclouds-labs/ws/joyent-cloudapi/target/joyent-cloudapi-2.0.0-SNAPSHOT.jar> to org.apache.jclouds.labs/joyent-cloudapi/2.0.0-SNAPSHOT/joyent-cloudapi-2.0.0-SNAPSHOT.jar
[JENKINS] Archiving <https://buildhive.cloudbees.com/job/jclouds/job/jclouds-labs/ws/joyent-cloudapi/target/joyent-cloudapi-2.0.0-SNAPSHOT-tests.jar> to org.apache.jclouds.labs/joyent-cloudapi/2.0.0-SNAPSHOT/joyent-cloudapi-2.0.0-SNAPSHOT-tests.jar
[JENKINS] Archiving <https://buildhive.cloudbees.com/job/jclouds/job/jclouds-labs/ws/cloudsigma2-zrh/pom.xml> to org.apache.jclouds.labs/cloudsigma2-zrh/2.0.0-SNAPSHOT/cloudsigma2-zrh-2.0.0-SNAPSHOT.pom
[JENKINS] Archiving <https://buildhive.cloudbees.com/job/jclouds/job/jclouds-labs/ws/cloudsigma2-zrh/target/cloudsigma2-zrh-2.0.0-SNAPSHOT.jar> to org.apache.jclouds.labs/cloudsigma2-zrh/2.0.0-SNAPSHOT/cloudsigma2-zrh-2.0.0-SNAPSHOT.jar
[JENKINS] Archiving <https://buildhive.cloudbees.com/job/jclouds/job/jclouds-labs/ws/cloudsigma2-zrh/target/cloudsigma2-zrh-2.0.0-SNAPSHOT-tests.jar> to org.apache.jclouds.labs/cloudsigma2-zrh/2.0.0-SNAPSHOT/cloudsigma2-zrh-2.0.0-SNAPSHOT-tests.jar
[JENKINS] Archiving <https://buildhive.cloudbees.com/job/jclouds/job/jclouds-labs/ws/docker/pom.xml> to org.apache.jclouds.labs/docker/2.0.0-SNAPSHOT/docker-2.0.0-SNAPSHOT.pom
[JENKINS] Archiving <https://buildhive.cloudbees.com/job/jclouds/job/jclouds-labs/ws/docker/target/docker-2.0.0-SNAPSHOT.jar> to org.apache.jclouds.labs/docker/2.0.0-SNAPSHOT/docker-2.0.0-SNAPSHOT.jar
[JENKINS] Archiving <https://buildhive.cloudbees.com/job/jclouds/job/jclouds-labs/ws/docker/target/docker-2.0.0-SNAPSHOT-tests.jar> to org.apache.jclouds.labs/docker/2.0.0-SNAPSHOT/docker-2.0.0-SNAPSHOT-tests.jar
[JENKINS] Archiving <https://buildhive.cloudbees.com/job/jclouds/job/jclouds-labs/ws/pom.xml> to org.apache.jclouds.labs/jclouds-labs/2.0.0-SNAPSHOT/jclouds-labs-2.0.0-SNAPSHOT.pom
[JENKINS] Archiving <https://buildhive.cloudbees.com/job/jclouds/job/jclouds-labs/ws/target/jclouds-labs-2.0.0-SNAPSHOT-tests.jar> to org.apache.jclouds.labs/jclouds-labs/2.0.0-SNAPSHOT/jclouds-labs-2.0.0-SNAPSHOT-tests.jar
[JENKINS] Archiving <https://buildhive.cloudbees.com/job/jclouds/job/jclouds-labs/ws/vcloud-director/pom.xml> to org.apache.jclouds.labs/vcloud-director/2.0.0-SNAPSHOT/vcloud-director-2.0.0-SNAPSHOT.pom
[JENKINS] Archiving <https://buildhive.cloudbees.com/job/jclouds/job/jclouds-labs/ws/vcloud-director/target/vcloud-director-2.0.0-SNAPSHOT.jar> to org.apache.jclouds.labs/vcloud-director/2.0.0-SNAPSHOT/vcloud-director-2.0.0-SNAPSHOT.jar
[JENKINS] Archiving <https://buildhive.cloudbees.com/job/jclouds/job/jclouds-labs/ws/vcloud-director/target/vcloud-director-2.0.0-SNAPSHOT-tests.jar> to org.apache.jclouds.labs/vcloud-director/2.0.0-SNAPSHOT/vcloud-director-2.0.0-SNAPSHOT-tests.jar
[JENKINS] Archiving <https://buildhive.cloudbees.com/job/jclouds/job/jclouds-labs/ws/profitbricks-c2/pom.xml> to org.apache.jclouds.labs/profitbricks-c2/2.0.0-SNAPSHOT/profitbricks-c2-2.0.0-SNAPSHOT.pom
[JENKINS] Archiving <https://buildhive.cloudbees.com/job/jclouds/job/jclouds-labs/ws/profitbricks-c2/target/profitbricks-c2-2.0.0-SNAPSHOT.jar> to org.apache.jclouds.labs/profitbricks-c2/2.0.0-SNAPSHOT/profitbricks-c2-2.0.0-SNAPSHOT.jar
[JENKINS] Archiving <https://buildhive.cloudbees.com/job/jclouds/job/jclouds-labs/ws/jclouds-representations/pom.xml> to org.apache.jclouds.labs/jclouds-representations/2.0.0-SNAPSHOT/jclouds-representations-2.0.0-SNAPSHOT.pom
[JENKINS] Archiving <https://buildhive.cloudbees.com/job/jclouds/job/jclouds-labs/ws/jclouds-representations/target/jclouds-representations-2.0.0-SNAPSHOT-tests.jar> to org.apache.jclouds.labs/jclouds-representations/2.0.0-SNAPSHOT/jclouds-representations-2.0.0-SNAPSHOT-tests.jar
[JENKINS] Archiving <https://buildhive.cloudbees.com/job/jclouds/job/jclouds-labs/ws/virtualbox/pom.xml> to org.apache.jclouds.labs/virtualbox/2.0.0-SNAPSHOT/virtualbox-2.0.0-SNAPSHOT.pom
[JENKINS] Archiving <https://buildhive.cloudbees.com/job/jclouds/job/jclouds-labs/ws/virtualbox/target/virtualbox-2.0.0-SNAPSHOT.jar> to org.apache.jclouds.labs/virtualbox/2.0.0-SNAPSHOT/virtualbox-2.0.0-SNAPSHOT.jar
[JENKINS] Archiving <https://buildhive.cloudbees.com/job/jclouds/job/jclouds-labs/ws/virtualbox/target/virtualbox-2.0.0-SNAPSHOT-tests.jar> to org.apache.jclouds.labs/virtualbox/2.0.0-SNAPSHOT/virtualbox-2.0.0-SNAPSHOT-tests.jar
[JENKINS] Archiving <https://buildhive.cloudbees.com/job/jclouds/job/jclouds-labs/ws/dmtf/pom.xml> to org.apache.jclouds.labs/dmtf/2.0.0-SNAPSHOT/dmtf-2.0.0-SNAPSHOT.pom
[JENKINS] Archiving <https://buildhive.cloudbees.com/job/jclouds/job/jclouds-labs/ws/dmtf/target/dmtf-2.0.0-SNAPSHOT.jar> to org.apache.jclouds.labs/dmtf/2.0.0-SNAPSHOT/dmtf-2.0.0-SNAPSHOT.jar
[JENKINS] Archiving <https://buildhive.cloudbees.com/job/jclouds/job/jclouds-labs/ws/dmtf/target/dmtf-2.0.0-SNAPSHOT-tests.jar> to org.apache.jclouds.labs/dmtf/2.0.0-SNAPSHOT/dmtf-2.0.0-SNAPSHOT-tests.jar
[JENKINS] Archiving <https://buildhive.cloudbees.com/job/jclouds/job/jclouds-labs/ws/joyentcloud/pom.xml> to org.apache.jclouds.labs/joyentcloud/2.0.0-SNAPSHOT/joyentcloud-2.0.0-SNAPSHOT.pom
[JENKINS] Archiving <https://buildhive.cloudbees.com/job/jclouds/job/jclouds-labs/ws/joyentcloud/target/joyentcloud-2.0.0-SNAPSHOT.jar> to org.apache.jclouds.labs/joyentcloud/2.0.0-SNAPSHOT/joyentcloud-2.0.0-SNAPSHOT.jar
[JENKINS] Archiving <https://buildhive.cloudbees.com/job/jclouds/job/jclouds-labs/ws/joyentcloud/target/joyentcloud-2.0.0-SNAPSHOT-tests.jar> to org.apache.jclouds.labs/joyentcloud/2.0.0-SNAPSHOT/joyentcloud-2.0.0-SNAPSHOT-tests.jar
[JENKINS] Archiving <https://buildhive.cloudbees.com/job/jclouds/job/jclouds-labs/ws/cloudsigma2-lvs/pom.xml> to org.apache.jclouds.labs/cloudsigma2-lvs/2.0.0-SNAPSHOT/cloudsigma2-lvs-2.0.0-SNAPSHOT.pom
[JENKINS] Archiving <https://buildhive.cloudbees.com/job/jclouds/job/jclouds-labs/ws/cloudsigma2-lvs/target/cloudsigma2-lvs-2.0.0-SNAPSHOT.jar> to org.apache.jclouds.labs/cloudsigma2-lvs/2.0.0-SNAPSHOT/cloudsigma2-lvs-2.0.0-SNAPSHOT.jar
[JENKINS] Archiving <https://buildhive.cloudbees.com/job/jclouds/job/jclouds-labs/ws/cloudsigma2-lvs/target/cloudsigma2-lvs-2.0.0-SNAPSHOT-tests.jar> to org.apache.jclouds.labs/cloudsigma2-lvs/2.0.0-SNAPSHOT/cloudsigma2-lvs-2.0.0-SNAPSHOT-tests.jar
[JENKINS] Archiving <https://buildhive.cloudbees.com/job/jclouds/job/jclouds-labs/ws/jclouds-management/management-blobstore/pom.xml> to org.apache.jclouds.labs.management/management-blobstore/2.0.0-SNAPSHOT/management-blobstore-2.0.0-SNAPSHOT.pom
[JENKINS] Archiving <https://buildhive.cloudbees.com/job/jclouds/job/jclouds-labs/ws/jclouds-management/management-blobstore/target/management-blobstore-2.0.0-SNAPSHOT.jar> to org.apache.jclouds.labs.management/management-blobstore/2.0.0-SNAPSHOT/management-blobstore-2.0.0-SNAPSHOT.jar
[JENKINS] Archiving <https://buildhive.cloudbees.com/job/jclouds/job/jclouds-labs/ws/jclouds-management/management-blobstore/target/management-blobstore-2.0.0-SNAPSHOT-tests.jar> to org.apache.jclouds.labs.management/management-blobstore/2.0.0-SNAPSHOT/management-blobstore-2.0.0-SNAPSHOT-tests.jar
[JENKINS] Archiving <https://buildhive.cloudbees.com/job/jclouds/job/jclouds-labs/ws/jclouds-management/management-core/pom.xml> to org.apache.jclouds.labs.management/management-core/2.0.0-SNAPSHOT/management-core-2.0.0-SNAPSHOT.pom
[JENKINS] Archiving <https://buildhive.cloudbees.com/job/jclouds/job/jclouds-labs/ws/jclouds-management/management-core/target/management-core-2.0.0-SNAPSHOT.jar> to org.apache.jclouds.labs.management/management-core/2.0.0-SNAPSHOT/management-core-2.0.0-SNAPSHOT.jar
[JENKINS] Archiving <https://buildhive.cloudbees.com/job/jclouds/job/jclouds-labs/ws/jclouds-management/management-core/target/management-core-2.0.0-SNAPSHOT-tests.jar> to org.apache.jclouds.labs.management/management-core/2.0.0-SNAPSHOT/management-core-2.0.0-SNAPSHOT-tests.jar
[JENKINS] Archiving <https://buildhive.cloudbees.com/job/jclouds/job/jclouds-labs/ws/cdmi/pom.xml> to org.apache.jclouds.labs/cdmi/2.0.0-SNAPSHOT/cdmi-2.0.0-SNAPSHOT.pom
[JENKINS] Archiving <https://buildhive.cloudbees.com/job/jclouds/job/jclouds-labs/ws/cdmi/target/cdmi-2.0.0-SNAPSHOT.jar> to org.apache.jclouds.labs/cdmi/2.0.0-SNAPSHOT/cdmi-2.0.0-SNAPSHOT.jar
[JENKINS] Archiving <https://buildhive.cloudbees.com/job/jclouds/job/jclouds-labs/ws/cdmi/target/cdmi-2.0.0-SNAPSHOT-tests.jar> to org.apache.jclouds.labs/cdmi/2.0.0-SNAPSHOT/cdmi-2.0.0-SNAPSHOT-tests.jar
[JENKINS] Archiving <https://buildhive.cloudbees.com/job/jclouds/job/jclouds-labs/ws/jclouds-representations/representations-core/pom.xml> to org.apache.jclouds.labs.representations/representations-core/2.0.0-SNAPSHOT/representations-core-2.0.0-SNAPSHOT.pom
[JENKINS] Archiving <https://buildhive.cloudbees.com/job/jclouds/job/jclouds-labs/ws/jclouds-representations/representations-core/target/representations-core-2.0.0-SNAPSHOT.jar> to org.apache.jclouds.labs.representations/representations-core/2.0.0-SNAPSHOT/representations-core-2.0.0-SNAPSHOT.jar
[JENKINS] Archiving <https://buildhive.cloudbees.com/job/jclouds/job/jclouds-labs/ws/jclouds-representations/representations-core/target/representations-core-2.0.0-SNAPSHOT-tests.jar> to org.apache.jclouds.labs.representations/representations-core/2.0.0-SNAPSHOT/representations-core-2.0.0-SNAPSHOT-tests.jar
[JENKINS] Archiving <https://buildhive.cloudbees.com/job/jclouds/job/jclouds-labs/ws/fgcp-au/pom.xml> to org.apache.jclouds.labs/fgcp-au/2.0.0-SNAPSHOT/fgcp-au-2.0.0-SNAPSHOT.pom
[JENKINS] Archiving <https://buildhive.cloudbees.com/job/jclouds/job/jclouds-labs/ws/fgcp-au/target/fgcp-au-2.0.0-SNAPSHOT.jar> to org.apache.jclouds.labs/fgcp-au/2.0.0-SNAPSHOT/fgcp-au-2.0.0-SNAPSHOT.jar
[JENKINS] Archiving <https://buildhive.cloudbees.com/job/jclouds/job/jclouds-labs/ws/fgcp-au/target/fgcp-au-2.0.0-SNAPSHOT-tests.jar> to org.apache.jclouds.labs/fgcp-au/2.0.0-SNAPSHOT/fgcp-au-2.0.0-SNAPSHOT-tests.jar
[JENKINS] Archiving <https://buildhive.cloudbees.com/job/jclouds/job/jclouds-labs/ws/cloudsigma2-wdc/pom.xml> to org.apache.jclouds.labs/cloudsigma2-wdc/2.0.0-SNAPSHOT/cloudsigma2-wdc-2.0.0-SNAPSHOT.pom
[JENKINS] Archiving <https://buildhive.cloudbees.com/job/jclouds/job/jclouds-labs/ws/cloudsigma2-wdc/target/cloudsigma2-wdc-2.0.0-SNAPSHOT.jar> to org.apache.jclouds.labs/cloudsigma2-wdc/2.0.0-SNAPSHOT/cloudsigma2-wdc-2.0.0-SNAPSHOT.jar
[JENKINS] Archiving <https://buildhive.cloudbees.com/job/jclouds/job/jclouds-labs/ws/cloudsigma2-wdc/target/cloudsigma2-wdc-2.0.0-SNAPSHOT-tests.jar> to org.apache.jclouds.labs/cloudsigma2-wdc/2.0.0-SNAPSHOT/cloudsigma2-wdc-2.0.0-SNAPSHOT-tests.jar
[JENKINS] Archiving <https://buildhive.cloudbees.com/job/jclouds/job/jclouds-labs/ws/jclouds-management/pom.xml> to org.apache.jclouds.labs/jclouds-management/2.0.0-SNAPSHOT/jclouds-management-2.0.0-SNAPSHOT.pom
[JENKINS] Archiving <https://buildhive.cloudbees.com/job/jclouds/job/jclouds-labs/ws/jclouds-management/target/jclouds-management-2.0.0-SNAPSHOT-tests.jar> to org.apache.jclouds.labs/jclouds-management/2.0.0-SNAPSHOT/jclouds-management-2.0.0-SNAPSHOT-tests.jar
[JENKINS] Archiving <https://buildhive.cloudbees.com/job/jclouds/job/jclouds-labs/ws/fgcp-de/pom.xml> to org.apache.jclouds.labs/fgcp-de/2.0.0-SNAPSHOT/fgcp-de-2.0.0-SNAPSHOT.pom
[JENKINS] Archiving <https://buildhive.cloudbees.com/job/jclouds/job/jclouds-labs/ws/fgcp-de/target/fgcp-de-2.0.0-SNAPSHOT.jar> to org.apache.jclouds.labs/fgcp-de/2.0.0-SNAPSHOT/fgcp-de-2.0.0-SNAPSHOT.jar
[JENKINS] Archiving <https://buildhive.cloudbees.com/job/jclouds/job/jclouds-labs/ws/fgcp-de/target/fgcp-de-2.0.0-SNAPSHOT-tests.jar> to org.apache.jclouds.labs/fgcp-de/2.0.0-SNAPSHOT/fgcp-de-2.0.0-SNAPSHOT-tests.jar
[JENKINS] Archiving <https://buildhive.cloudbees.com/job/jclouds/job/jclouds-labs/ws/jclouds-representations/representations-codec/pom.xml> to org.apache.jclouds.labs.representations/representations-codec/2.0.0-SNAPSHOT/representations-codec-2.0.0-SNAPSHOT.pom
[JENKINS] Archiving <https://buildhive.cloudbees.com/job/jclouds/job/jclouds-labs/ws/jclouds-representations/representations-codec/target/representations-codec-2.0.0-SNAPSHOT.jar> to org.apache.jclouds.labs.representations/representations-codec/2.0.0-SNAPSHOT/representations-codec-2.0.0-SNAPSHOT.jar
[JENKINS] Archiving <https://buildhive.cloudbees.com/job/jclouds/job/jclouds-labs/ws/jclouds-representations/representations-codec/target/representations-codec-2.0.0-SNAPSHOT-tests.jar> to org.apache.jclouds.labs.representations/representations-codec/2.0.0-SNAPSHOT/representations-codec-2.0.0-SNAPSHOT-tests.jar
[JENKINS] Archiving <https://buildhive.cloudbees.com/job/jclouds/job/jclouds-labs/ws/jclouds-management/management-compute/pom.xml> to org.apache.jclouds.labs.management/management-compute/2.0.0-SNAPSHOT/management-compute-2.0.0-SNAPSHOT.pom
[JENKINS] Archiving <https://buildhive.cloudbees.com/job/jclouds/job/jclouds-labs/ws/jclouds-management/management-compute/target/management-compute-2.0.0-SNAPSHOT.jar> to org.apache.jclouds.labs.management/management-compute/2.0.0-SNAPSHOT/management-compute-2.0.0-SNAPSHOT.jar
[JENKINS] Archiving <https://buildhive.cloudbees.com/job/jclouds/job/jclouds-labs/ws/jclouds-management/management-compute/target/management-compute-2.0.0-SNAPSHOT-tests.jar> to org.apache.jclouds.labs.management/management-compute/2.0.0-SNAPSHOT/management-compute-2.0.0-SNAPSHOT-tests.jar
[JENKINS] Archiving <https://buildhive.cloudbees.com/job/jclouds/job/jclouds-labs/ws/digitalocean/pom.xml> to org.apache.jclouds.labs/digitalocean/2.0.0-SNAPSHOT/digitalocean-2.0.0-SNAPSHOT.pom
[JENKINS] Archiving <https://buildhive.cloudbees.com/job/jclouds/job/jclouds-labs/ws/digitalocean/target/digitalocean-2.0.0-SNAPSHOT.jar> to org.apache.jclouds.labs/digitalocean/2.0.0-SNAPSHOT/digitalocean-2.0.0-SNAPSHOT.jar
[JENKINS] Archiving <https://buildhive.cloudbees.com/job/jclouds/job/jclouds-labs/ws/digitalocean/target/digitalocean-2.0.0-SNAPSHOT-tests.jar> to org.apache.jclouds.labs/digitalocean/2.0.0-SNAPSHOT/digitalocean-2.0.0-SNAPSHOT-tests.jar
[JENKINS] Archiving <https://buildhive.cloudbees.com/job/jclouds/job/jclouds-labs/ws/fgcp/pom.xml> to org.apache.jclouds.labs/fgcp/2.0.0-SNAPSHOT/fgcp-2.0.0-SNAPSHOT.pom
[JENKINS] Archiving <https://buildhive.cloudbees.com/job/jclouds/job/jclouds-labs/ws/fgcp/target/fgcp-2.0.0-SNAPSHOT.jar> to org.apache.jclouds.labs/fgcp/2.0.0-SNAPSHOT/fgcp-2.0.0-SNAPSHOT.jar
[JENKINS] Archiving <https://buildhive.cloudbees.com/job/jclouds/job/jclouds-labs/ws/fgcp/target/fgcp-2.0.0-SNAPSHOT-tests.jar> to org.apache.jclouds.labs/fgcp/2.0.0-SNAPSHOT/fgcp-2.0.0-SNAPSHOT-tests.jar
[JENKINS] Archiving <https://buildhive.cloudbees.com/job/jclouds/job/jclouds-labs/ws/abiquo/pom.xml> to org.apache.jclouds.labs/abiquo/2.0.0-SNAPSHOT/abiquo-2.0.0-SNAPSHOT.pom
[JENKINS] Archiving <https://buildhive.cloudbees.com/job/jclouds/job/jclouds-labs/ws/abiquo/target/abiquo-2.0.0-SNAPSHOT.jar> to org.apache.jclouds.labs/abiquo/2.0.0-SNAPSHOT/abiquo-2.0.0-SNAPSHOT.jar
[JENKINS] Archiving <https://buildhive.cloudbees.com/job/jclouds/job/jclouds-labs/ws/abiquo/target/abiquo-2.0.0-SNAPSHOT-tests.jar> to org.apache.jclouds.labs/abiquo/2.0.0-SNAPSHOT/abiquo-2.0.0-SNAPSHOT-tests.jar
channel stopped