You are viewing a plain text version of this content. The canonical link for it is here.
Posted to builds@beam.apache.org by Apache Jenkins Server <je...@builds.apache.org> on 2019/07/13 18:57:53 UTC
Build failed in Jenkins: beam_PostCommit_Python3_Verify #1351
See <https://builds.apache.org/job/beam_PostCommit_Python3_Verify/1351/display/redirect>
------------------------------------------
[...truncated 692.13 KB...]
| 'Checksums' >> beam.Map(compute_hash))
<https://builds.apache.org/job/beam_PostCommit_Python3_Verify/ws/src/sdks/python/apache_beam/io/fileio_test.py>:243: FutureWarning: ReadMatches is experimental.
| 'Checksums' >> beam.Map(compute_hash))
Found: https://console.cloud.google.com/dataflow/jobsDetail/locations/us-central1/jobs/2019-07-13_11_03_23-18225810083225597449?project=apache-beam-testing.
<https://builds.apache.org/job/beam_PostCommit_Python3_Verify/ws/src/sdks/python/apache_beam/runners/dataflow/dataflow_runner.py>:686: BeamDeprecationWarning: BigQuerySink is deprecated since 2.11.0. Use WriteToBigQuery instead.
kms_key=transform.kms_key))
Found: https://console.cloud.google.com/dataflow/jobsDetail/locations/us-central1/jobs/2019-07-13_11_23_39-17396563703286629986?project=apache-beam-testing.
Found: https://console.cloud.google.com/dataflow/jobsDetail/locations/us-central1/jobs/2019-07-13_11_32_20-9415352332738845200?project=apache-beam-testing.
Found: https://console.cloud.google.com/dataflow/jobsDetail/locations/us-central1/jobs/2019-07-13_11_41_27-2180455066863813074?project=apache-beam-testing.
Found: https://console.cloud.google.com/dataflow/jobsDetail/locations/us-central1/jobs/2019-07-13_11_03_25-15945724083662915225?project=apache-beam-testing.
Found: https://console.cloud.google.com/dataflow/jobsDetail/locations/us-central1/jobs/2019-07-13_11_12_30-8604487009670994523?project=apache-beam-testing.
Found: https://console.cloud.google.com/dataflow/jobsDetail/locations/us-central1/jobs/2019-07-13_11_20_30-3360176434925491567?project=apache-beam-testing.
Found: https://console.cloud.google.com/dataflow/jobsDetail/locations/us-central1/jobs/2019-07-13_11_29_56-18434087195180124418?project=apache-beam-testing.
Found: https://console.cloud.google.com/dataflow/jobsDetail/locations/us-central1/jobs/2019-07-13_11_39_21-16219114147919301206?project=apache-beam-testing.
Found: https://console.cloud.google.com/dataflow/jobsDetail/locations/us-central1/jobs/2019-07-13_11_47_57-6435214494097383106?project=apache-beam-testing.
Found: https://console.cloud.google.com/dataflow/jobsDetail/locations/us-central1/jobs/2019-07-13_11_03_23-18316967206385672180?project=apache-beam-testing.
<https://builds.apache.org/job/beam_PostCommit_Python3_Verify/ws/src/sdks/python/apache_beam/runners/dataflow/dataflow_runner.py>:686: BeamDeprecationWarning: BigQuerySink is deprecated since 2.11.0. Use WriteToBigQuery instead.
kms_key=transform.kms_key))
Found: https://console.cloud.google.com/dataflow/jobsDetail/locations/us-central1/jobs/2019-07-13_11_11_35-9883476280265410609?project=apache-beam-testing.
<https://builds.apache.org/job/beam_PostCommit_Python3_Verify/ws/src/sdks/python/apache_beam/io/gcp/bigquery.py>:1140: BeamDeprecationWarning: options is deprecated since First stable release. References to <pipeline>.options will not be supported
method_to_use = self._compute_method(p, p.options)
Found: https://console.cloud.google.com/dataflow/jobsDetail/locations/us-central1/jobs/2019-07-13_11_22_21-18434374620371625748?project=apache-beam-testing.
<https://builds.apache.org/job/beam_PostCommit_Python3_Verify/ws/src/sdks/python/apache_beam/io/gcp/bigquery_file_loads.py>:557: BeamDeprecationWarning: options is deprecated since First stable release. References to <pipeline>.options will not be supported
temp_location = p.options.view_as(GoogleCloudOptions).temp_location
Found: https://console.cloud.google.com/dataflow/jobsDetail/locations/us-central1/jobs/2019-07-13_11_31_20-16558416644245644677?project=apache-beam-testing.
Found: https://console.cloud.google.com/dataflow/jobsDetail/locations/us-central1/jobs/2019-07-13_11_03_26-16061456776737444102?project=apache-beam-testing.
Found: https://console.cloud.google.com/dataflow/jobsDetail/locations/us-central1/jobs/2019-07-13_11_15_54-18326873967192579645?project=apache-beam-testing.
<https://builds.apache.org/job/beam_PostCommit_Python3_Verify/ws/src/sdks/python/apache_beam/io/gcp/bigquery.py>:1140: BeamDeprecationWarning: options is deprecated since First stable release. References to <pipeline>.options will not be supported
method_to_use = self._compute_method(p, p.options)
Found: https://console.cloud.google.com/dataflow/jobsDetail/locations/us-central1/jobs/2019-07-13_11_26_39-17081895598630477248?project=apache-beam-testing.
Found: https://console.cloud.google.com/dataflow/jobsDetail/locations/us-central1/jobs/2019-07-13_11_35_31-214940862338320850?project=apache-beam-testing.
Found: https://console.cloud.google.com/dataflow/jobsDetail/locations/us-central1/jobs/2019-07-13_11_44_27-2252325096355963392?project=apache-beam-testing.
<https://builds.apache.org/job/beam_PostCommit_Python3_Verify/ws/src/sdks/python/apache_beam/io/gcp/bigquery_file_loads.py>:557: BeamDeprecationWarning: options is deprecated since First stable release. References to <pipeline>.options will not be supported
temp_location = p.options.view_as(GoogleCloudOptions).temp_location
Found: https://console.cloud.google.com/dataflow/jobsDetail/locations/us-central1/jobs/2019-07-13_11_03_25-16342384804610633236?project=apache-beam-testing.
Found: https://console.cloud.google.com/dataflow/jobsDetail/locations/us-central1/jobs/2019-07-13_11_13_01-5452533719167548705?project=apache-beam-testing.
Found: https://console.cloud.google.com/dataflow/jobsDetail/locations/us-central1/jobs/2019-07-13_11_22_03-1318131992164694165?project=apache-beam-testing.
Found: https://console.cloud.google.com/dataflow/jobsDetail/locations/us-central1/jobs/2019-07-13_11_30_19-18038131301215903974?project=apache-beam-testing.
<https://builds.apache.org/job/beam_PostCommit_Python3_Verify/ws/src/sdks/python/apache_beam/runners/dataflow/dataflow_runner.py>:686: BeamDeprecationWarning: BigQuerySink is deprecated since 2.11.0. Use WriteToBigQuery instead.
kms_key=transform.kms_key))
<https://builds.apache.org/job/beam_PostCommit_Python3_Verify/ws/src/sdks/python/apache_beam/io/gcp/big_query_query_to_table_pipeline.py>:73: BeamDeprecationWarning: BigQuerySink is deprecated since 2.11.0. Use WriteToBigQuery instead.
kms_key=kms_key))
Found: https://console.cloud.google.com/dataflow/jobsDetail/locations/us-central1/jobs/2019-07-13_11_39_55-18062826314499747826?project=apache-beam-testing.
test_datastore_wordcount_it (apache_beam.examples.cookbook.datastore_wordcount_it_test.DatastoreWordCountIT) ... SKIP: This test still needs to be fixed on Python 3TODO: BEAM-4543
test_avro_it (apache_beam.examples.fastavro_it_test.FastavroIT) ... SKIP: Due to a known issue in avro-python3 package, thistest is skipped until BEAM-6522 is addressed.
test_bigquery_tornadoes_it (apache_beam.examples.cookbook.bigquery_tornadoes_it_test.BigqueryTornadoesIT) ... ok
test_autocomplete_it (apache_beam.examples.complete.autocomplete_test.AutocompleteTest) ... ok
test_wordcount_fnapi_it (apache_beam.examples.wordcount_it_test.WordCountIT) ... ok
test_streaming_wordcount_it (apache_beam.examples.streaming_wordcount_it_test.StreamingWordCountIT) ... ok
test_leader_board_it (apache_beam.examples.complete.game.leader_board_it_test.LeaderBoardIT) ... ok
test_game_stats_it (apache_beam.examples.complete.game.game_stats_it_test.GameStatsIT) ... ok
test_wordcount_it (apache_beam.examples.wordcount_it_test.WordCountIT) ... ok
test_user_score_it (apache_beam.examples.complete.game.user_score_it_test.UserScoreIT) ... ok
test_hourly_team_score_it (apache_beam.examples.complete.game.hourly_team_score_it_test.HourlyTeamScoreIT) ... ok
test_datastore_write_limit (apache_beam.io.gcp.datastore_write_it_test.DatastoreWriteIT) ... SKIP: This test still needs to be fixed on Python 3TODO: BEAM-4543
test_copy (apache_beam.io.gcp.gcsio_integration_test.GcsIOIntegrationTest) ... ok
test_copy_batch (apache_beam.io.gcp.gcsio_integration_test.GcsIOIntegrationTest) ... ok
test_copy_batch_kms (apache_beam.io.gcp.gcsio_integration_test.GcsIOIntegrationTest) ... ok
test_copy_batch_rewrite_token (apache_beam.io.gcp.gcsio_integration_test.GcsIOIntegrationTest) ... ok
test_copy_kms (apache_beam.io.gcp.gcsio_integration_test.GcsIOIntegrationTest) ... ok
test_copy_rewrite_token (apache_beam.io.gcp.gcsio_integration_test.GcsIOIntegrationTest) ... ok
test_bigquery_read_1M_python (apache_beam.io.gcp.bigquery_io_read_it_test.BigqueryIOReadIT) ... ok
test_transform_on_gcs (apache_beam.io.fileio_test.MatchIntegrationTest) ... ok
test_multiple_destinations_transform (apache_beam.io.gcp.bigquery_file_loads_test.BigQueryFileLoadsIT) ... ok
test_one_job_fails_all_jobs_fail (apache_beam.io.gcp.bigquery_file_loads_test.BigQueryFileLoadsIT) ... ok
test_big_query_read (apache_beam.io.gcp.bigquery_read_it_test.BigQueryReadIntegrationTests) ... ok
test_big_query_read_new_types (apache_beam.io.gcp.bigquery_read_it_test.BigQueryReadIntegrationTests) ... ok
test_multiple_destinations_transform (apache_beam.io.gcp.bigquery_test.BigQueryStreamingInsertTransformIntegrationTests) ... ok
test_multiple_destinations_transform_streaming (apache_beam.io.gcp.bigquery_test.BigQueryStreamingInsertTransformIntegrationTests) ... SKIP: TestStream is not supported on TestDataflowRunner
test_value_provider_transform (apache_beam.io.gcp.bigquery_test.BigQueryStreamingInsertTransformIntegrationTests) ... ok
test_parquetio_it (apache_beam.io.parquetio_it_test.TestParquetIT) ... ok
test_streaming_data_only (apache_beam.io.gcp.pubsub_integration_test.PubSubIntegrationTest) ... ok
test_streaming_with_attributes (apache_beam.io.gcp.pubsub_integration_test.PubSubIntegrationTest) ... ok
test_job_python_from_python_it (apache_beam.transforms.external_test_it.ExternalTransformIT) ... ok
test_big_query_legacy_sql (apache_beam.io.gcp.big_query_query_to_table_it_test.BigQueryQueryToTableIT) ... ok
test_big_query_new_types (apache_beam.io.gcp.big_query_query_to_table_it_test.BigQueryQueryToTableIT) ... ok
test_big_query_standard_sql (apache_beam.io.gcp.big_query_query_to_table_it_test.BigQueryQueryToTableIT) ... ok
test_big_query_standard_sql_kms_key_native (apache_beam.io.gcp.big_query_query_to_table_it_test.BigQueryQueryToTableIT) ... ok
test_big_query_write (apache_beam.io.gcp.bigquery_write_it_test.BigQueryWriteIntegrationTests) ... ok
test_big_query_write_new_types (apache_beam.io.gcp.bigquery_write_it_test.BigQueryWriteIntegrationTests) ... ok
test_big_query_write_schema_autodetect (apache_beam.io.gcp.bigquery_write_it_test.BigQueryWriteIntegrationTests) ... SKIP: DataflowRunner does not support schema autodetection
test_big_query_write_without_schema (apache_beam.io.gcp.bigquery_write_it_test.BigQueryWriteIntegrationTests) ... ok
test_metrics_fnapi_it (apache_beam.runners.dataflow.dataflow_exercise_metrics_pipeline_test.ExerciseMetricsPipelineTest) ... ok
test_metrics_it (apache_beam.runners.dataflow.dataflow_exercise_metrics_pipeline_test.ExerciseMetricsPipelineTest) ... ok
test_datastore_write_limit (apache_beam.io.gcp.datastore.v1new.datastore_write_it_test.DatastoreWriteIT) ... ok
----------------------------------------------------------------------
XML: <https://builds.apache.org/job/beam_PostCommit_Python3_Verify/ws/src/sdks/python/nosetests.xml>
----------------------------------------------------------------------
Ran 42 tests in 3232.758s
OK (SKIP=5)
> Task :sdks:python:test-suites:dataflow:py37:postCommitIT
<https://builds.apache.org/job/beam_PostCommit_Python3_Verify/ws/src/sdks/python/apache_beam/io/gcp/bigquery.py>:1140: BeamDeprecationWarning: options is deprecated since First stable release. References to <pipeline>.options will not be supported
Found: https://console.cloud.google.com/dataflow/jobsDetail/locations/us-central1/jobs/2019-07-13_11_03_27-2994884156965938514?project=apache-beam-testing.
method_to_use = self._compute_method(p, p.options)
Found: https://console.cloud.google.com/dataflow/jobsDetail/locations/us-central1/jobs/2019-07-13_11_18_19-2564543794777623564?project=apache-beam-testing.
Found: https://console.cloud.google.com/dataflow/jobsDetail/locations/us-central1/jobs/2019-07-13_11_28_05-911515728433077878?project=apache-beam-testing.
Found: https://console.cloud.google.com/dataflow/jobsDetail/locations/us-central1/jobs/2019-07-13_11_36_55-7460079763966116822?project=apache-beam-testing.
Found: https://console.cloud.google.com/dataflow/jobsDetail/locations/us-central1/jobs/2019-07-13_11_03_23-4084342030167247443?project=apache-beam-testing.
Found: https://console.cloud.google.com/dataflow/jobsDetail/locations/us-central1/jobs/2019-07-13_11_26_16-11955014460872249210?project=apache-beam-testing.
Found: https://console.cloud.google.com/dataflow/jobsDetail/locations/us-central1/jobs/2019-07-13_11_35_09-5017500226311064555?project=apache-beam-testing.
<https://builds.apache.org/job/beam_PostCommit_Python3_Verify/ws/src/sdks/python/apache_beam/runners/dataflow/dataflow_runner.py>:686: BeamDeprecationWarning: BigQuerySink is deprecated since 2.11.0. Use WriteToBigQuery instead.
kms_key=transform.kms_key))
Found: https://console.cloud.google.com/dataflow/jobsDetail/locations/us-central1/jobs/2019-07-13_11_03_27-17578295358181011589?project=apache-beam-testing.
Found: https://console.cloud.google.com/dataflow/jobsDetail/locations/us-central1/jobs/2019-07-13_11_17_14-11717813863931427098?project=apache-beam-testing.
<https://builds.apache.org/job/beam_PostCommit_Python3_Verify/ws/src/sdks/python/apache_beam/io/gcp/bigquery.py>:1140: BeamDeprecationWarning: options is deprecated since First stable release. References to <pipeline>.options will not be supported
method_to_use = self._compute_method(p, p.options)
<https://builds.apache.org/job/beam_PostCommit_Python3_Verify/ws/src/sdks/python/apache_beam/io/fileio_test.py>:232: FutureWarning: MatchAll is experimental.
| 'GetPath' >> beam.Map(lambda metadata: metadata.path))
Found: https://console.cloud.google.com/dataflow/jobsDetail/locations/us-central1/jobs/2019-07-13_11_26_24-4274585176445941658?project=apache-beam-testing.
Found: https://console.cloud.google.com/dataflow/jobsDetail/locations/us-central1/jobs/2019-07-13_11_34_59-8571051743722319195?project=apache-beam-testing.
<https://builds.apache.org/job/beam_PostCommit_Python3_Verify/ws/src/sdks/python/apache_beam/io/fileio_test.py>:243: FutureWarning: MatchAll is experimental.
| 'Checksums' >> beam.Map(compute_hash))
Found: https://console.cloud.google.com/dataflow/jobsDetail/locations/us-central1/jobs/2019-07-13_11_44_49-14660079428481968226?project=apache-beam-testing.
<https://builds.apache.org/job/beam_PostCommit_Python3_Verify/ws/src/sdks/python/apache_beam/io/fileio_test.py>:243: FutureWarning: ReadMatches is experimental.
| 'Checksums' >> beam.Map(compute_hash))
Found: https://console.cloud.google.com/dataflow/jobsDetail/locations/us-central1/jobs/2019-07-13_11_03_24-11493799341873932956?project=apache-beam-testing.
Found: https://console.cloud.google.com/dataflow/jobsDetail/locations/us-central1/jobs/2019-07-13_11_25_50-6847686743701061637?project=apache-beam-testing.
<https://builds.apache.org/job/beam_PostCommit_Python3_Verify/ws/src/sdks/python/apache_beam/runners/dataflow/dataflow_runner.py>:686: BeamDeprecationWarning: BigQuerySink is deprecated since 2.11.0. Use WriteToBigQuery instead.
Found: https://console.cloud.google.com/dataflow/jobsDetail/locations/us-central1/jobs/2019-07-13_11_34_31-2020084126861284139?project=apache-beam-testing.
kms_key=transform.kms_key))
Found: https://console.cloud.google.com/dataflow/jobsDetail/locations/us-central1/jobs/2019-07-13_11_43_53-11314846464490951415?project=apache-beam-testing.
<https://builds.apache.org/job/beam_PostCommit_Python3_Verify/ws/src/sdks/python/apache_beam/runners/dataflow/dataflow_runner.py>:686: BeamDeprecationWarning: BigQuerySink is deprecated since 2.11.0. Use WriteToBigQuery instead.
kms_key=transform.kms_key))
<https://builds.apache.org/job/beam_PostCommit_Python3_Verify/ws/src/sdks/python/apache_beam/io/gcp/big_query_query_to_table_pipeline.py>:73: BeamDeprecationWarning: BigQuerySink is deprecated since 2.11.0. Use WriteToBigQuery instead.
Found: https://console.cloud.google.com/dataflow/jobsDetail/locations/us-central1/jobs/2019-07-13_11_03_24-1038402941269045458?project=apache-beam-testing.
kms_key=kms_key))
Found: https://console.cloud.google.com/dataflow/jobsDetail/locations/us-central1/jobs/2019-07-13_11_13_49-1110839761348547966?project=apache-beam-testing.
Found: https://console.cloud.google.com/dataflow/jobsDetail/locations/us-central1/jobs/2019-07-13_11_22_05-1103776410271746770?project=apache-beam-testing.
Found: https://console.cloud.google.com/dataflow/jobsDetail/locations/us-central1/jobs/2019-07-13_11_30_51-12566993199501307652?project=apache-beam-testing.
Found: https://console.cloud.google.com/dataflow/jobsDetail/locations/us-central1/jobs/2019-07-13_11_39_17-14219100297715787693?project=apache-beam-testing.
Found: https://console.cloud.google.com/dataflow/jobsDetail/locations/us-central1/jobs/2019-07-13_11_03_23-15025770496862842658?project=apache-beam-testing.
<https://builds.apache.org/job/beam_PostCommit_Python3_Verify/ws/src/sdks/python/apache_beam/runners/dataflow/dataflow_runner.py>:686: BeamDeprecationWarning: BigQuerySink is deprecated since 2.11.0. Use WriteToBigQuery instead.
kms_key=transform.kms_key))
<https://builds.apache.org/job/beam_PostCommit_Python3_Verify/ws/src/sdks/python/apache_beam/io/gcp/bigquery.py>:1140: BeamDeprecationWarning: options is deprecated since First stable release. References to <pipeline>.options will not be supported
Found: https://console.cloud.google.com/dataflow/jobsDetail/locations/us-central1/jobs/2019-07-13_11_12_20-17844419209838872926?project=apache-beam-testing.
Found: https://console.cloud.google.com/dataflow/jobsDetail/locations/us-central1/jobs/2019-07-13_11_22_25-7863736748683336689?project=apache-beam-testing.
Found: https://console.cloud.google.com/dataflow/jobsDetail/locations/us-central1/jobs/2019-07-13_11_31_24-5666934582259579212?project=apache-beam-testing.
method_to_use = self._compute_method(p, p.options)
<https://builds.apache.org/job/beam_PostCommit_Python3_Verify/ws/src/sdks/python/apache_beam/io/gcp/bigquery_file_loads.py>:557: BeamDeprecationWarning: options is deprecated since First stable release. References to <pipeline>.options will not be supported
temp_location = p.options.view_as(GoogleCloudOptions).temp_location
Found: https://console.cloud.google.com/dataflow/jobsDetail/locations/us-central1/jobs/2019-07-13_11_03_26-11501680925266374582?project=apache-beam-testing.
Found: https://console.cloud.google.com/dataflow/jobsDetail/locations/us-central1/jobs/2019-07-13_11_13_53-3742865357407635021?project=apache-beam-testing.
<https://builds.apache.org/job/beam_PostCommit_Python3_Verify/ws/src/sdks/python/apache_beam/io/gcp/bigquery.py>:1140: BeamDeprecationWarning: options is deprecated since First stable release. References to <pipeline>.options will not be supported
method_to_use = self._compute_method(p, p.options)
<https://builds.apache.org/job/beam_PostCommit_Python3_Verify/ws/src/sdks/python/apache_beam/io/gcp/bigquery_file_loads.py>:557: BeamDeprecationWarning: options is deprecated since First stable release. References to <pipeline>.options will not be supported
Found: https://console.cloud.google.com/dataflow/jobsDetail/locations/us-central1/jobs/2019-07-13_11_25_24-7067109360828330474?project=apache-beam-testing.
Found: https://console.cloud.google.com/dataflow/jobsDetail/locations/us-central1/jobs/2019-07-13_11_34_07-6614711847267013127?project=apache-beam-testing.
temp_location = p.options.view_as(GoogleCloudOptions).temp_location
Found: https://console.cloud.google.com/dataflow/jobsDetail/locations/us-central1/jobs/2019-07-13_11_03_25-17239664876385297067?project=apache-beam-testing.
Found: https://console.cloud.google.com/dataflow/jobsDetail/locations/us-central1/jobs/2019-07-13_11_12_51-15891151910275394029?project=apache-beam-testing.
Found: https://console.cloud.google.com/dataflow/jobsDetail/locations/us-central1/jobs/2019-07-13_11_21_52-1459083725095712815?project=apache-beam-testing.
Found: https://console.cloud.google.com/dataflow/jobsDetail/locations/us-central1/jobs/2019-07-13_11_30_17-17463766131385004047?project=apache-beam-testing.
Found: https://console.cloud.google.com/dataflow/jobsDetail/locations/us-central1/jobs/2019-07-13_11_40_12-6403915414330397198?project=apache-beam-testing.
Found: https://console.cloud.google.com/dataflow/jobsDetail/locations/us-central1/jobs/2019-07-13_11_49_23-8272356986952096219?project=apache-beam-testing.
test_datastore_wordcount_it (apache_beam.examples.cookbook.datastore_wordcount_it_test.DatastoreWordCountIT) ... SKIP: This test still needs to be fixed on Python 3TODO: BEAM-4543
test_avro_it (apache_beam.examples.fastavro_it_test.FastavroIT) ... SKIP: Due to a known issue in avro-python3 package, thistest is skipped until BEAM-6522 is addressed.
test_bigquery_tornadoes_it (apache_beam.examples.cookbook.bigquery_tornadoes_it_test.BigqueryTornadoesIT) ... ok
test_wordcount_fnapi_it (apache_beam.examples.wordcount_it_test.WordCountIT) ... ok
test_autocomplete_it (apache_beam.examples.complete.autocomplete_test.AutocompleteTest) ... ok
test_streaming_wordcount_it (apache_beam.examples.streaming_wordcount_it_test.StreamingWordCountIT) ... ok
test_leader_board_it (apache_beam.examples.complete.game.leader_board_it_test.LeaderBoardIT) ... ok
test_game_stats_it (apache_beam.examples.complete.game.game_stats_it_test.GameStatsIT) ... ok
test_wordcount_it (apache_beam.examples.wordcount_it_test.WordCountIT) ... ok
test_user_score_it (apache_beam.examples.complete.game.user_score_it_test.UserScoreIT) ... ok
test_hourly_team_score_it (apache_beam.examples.complete.game.hourly_team_score_it_test.HourlyTeamScoreIT) ... ok
test_datastore_write_limit (apache_beam.io.gcp.datastore_write_it_test.DatastoreWriteIT) ... SKIP: This test still needs to be fixed on Python 3TODO: BEAM-4543
test_copy (apache_beam.io.gcp.gcsio_integration_test.GcsIOIntegrationTest) ... ok
test_copy_batch (apache_beam.io.gcp.gcsio_integration_test.GcsIOIntegrationTest) ... ok
test_copy_batch_kms (apache_beam.io.gcp.gcsio_integration_test.GcsIOIntegrationTest) ... ok
test_copy_batch_rewrite_token (apache_beam.io.gcp.gcsio_integration_test.GcsIOIntegrationTest) ... ok
test_copy_kms (apache_beam.io.gcp.gcsio_integration_test.GcsIOIntegrationTest) ... ok
test_copy_rewrite_token (apache_beam.io.gcp.gcsio_integration_test.GcsIOIntegrationTest) ... ok
test_bigquery_read_1M_python (apache_beam.io.gcp.bigquery_io_read_it_test.BigqueryIOReadIT) ... ok
test_multiple_destinations_transform (apache_beam.io.gcp.bigquery_file_loads_test.BigQueryFileLoadsIT) ... ok
test_one_job_fails_all_jobs_fail (apache_beam.io.gcp.bigquery_file_loads_test.BigQueryFileLoadsIT) ... ok
test_transform_on_gcs (apache_beam.io.fileio_test.MatchIntegrationTest) ... ok
test_big_query_read (apache_beam.io.gcp.bigquery_read_it_test.BigQueryReadIntegrationTests) ... ok
test_big_query_read_new_types (apache_beam.io.gcp.bigquery_read_it_test.BigQueryReadIntegrationTests) ... ok
test_multiple_destinations_transform (apache_beam.io.gcp.bigquery_test.BigQueryStreamingInsertTransformIntegrationTests) ... ok
test_multiple_destinations_transform_streaming (apache_beam.io.gcp.bigquery_test.BigQueryStreamingInsertTransformIntegrationTests) ... SKIP: TestStream is not supported on TestDataflowRunner
test_value_provider_transform (apache_beam.io.gcp.bigquery_test.BigQueryStreamingInsertTransformIntegrationTests) ... ok
test_streaming_data_only (apache_beam.io.gcp.pubsub_integration_test.PubSubIntegrationTest) ... ok
test_streaming_with_attributes (apache_beam.io.gcp.pubsub_integration_test.PubSubIntegrationTest) ... ok
test_parquetio_it (apache_beam.io.parquetio_it_test.TestParquetIT) ... ok
test_job_python_from_python_it (apache_beam.transforms.external_test_it.ExternalTransformIT) ... ok
test_big_query_legacy_sql (apache_beam.io.gcp.big_query_query_to_table_it_test.BigQueryQueryToTableIT) ... ok
test_big_query_new_types (apache_beam.io.gcp.big_query_query_to_table_it_test.BigQueryQueryToTableIT) ... ok
test_big_query_standard_sql (apache_beam.io.gcp.big_query_query_to_table_it_test.BigQueryQueryToTableIT) ... ok
test_big_query_standard_sql_kms_key_native (apache_beam.io.gcp.big_query_query_to_table_it_test.BigQueryQueryToTableIT) ... ok
test_big_query_write (apache_beam.io.gcp.bigquery_write_it_test.BigQueryWriteIntegrationTests) ... ok
test_big_query_write_new_types (apache_beam.io.gcp.bigquery_write_it_test.BigQueryWriteIntegrationTests) ... ok
test_big_query_write_schema_autodetect (apache_beam.io.gcp.bigquery_write_it_test.BigQueryWriteIntegrationTests) ... SKIP: DataflowRunner does not support schema autodetection
test_big_query_write_without_schema (apache_beam.io.gcp.bigquery_write_it_test.BigQueryWriteIntegrationTests) ... ok
test_metrics_fnapi_it (apache_beam.runners.dataflow.dataflow_exercise_metrics_pipeline_test.ExerciseMetricsPipelineTest) ... ok
test_metrics_it (apache_beam.runners.dataflow.dataflow_exercise_metrics_pipeline_test.ExerciseMetricsPipelineTest) ... ok
test_datastore_write_limit (apache_beam.io.gcp.datastore.v1new.datastore_write_it_test.DatastoreWriteIT) ... ok
----------------------------------------------------------------------
XML: <https://builds.apache.org/job/beam_PostCommit_Python3_Verify/ws/src/sdks/python/nosetests.xml>
----------------------------------------------------------------------
Ran 42 tests in 3283.941s
OK (SKIP=5)
FAILURE: Build completed with 2 failures.
1: Task failed with an exception.
-----------
* Where:
Build file '<https://builds.apache.org/job/beam_PostCommit_Python3_Verify/ws/src/sdks/python/test-suites/direct/py37/build.gradle'> line: 48
* What went wrong:
Execution failed for task ':sdks:python:test-suites:direct:py37:postCommitIT'.
> Process 'command 'sh'' finished with non-zero exit value 1
* Try:
Run with --stacktrace option to get the stack trace. Run with --info or --debug option to get more log output. Run with --scan to get full insights.
==============================================================================
2: Task failed with an exception.
-----------
* Where:
Build file '<https://builds.apache.org/job/beam_PostCommit_Python3_Verify/ws/src/sdks/python/test-suites/dataflow/py35/build.gradle'> line: 48
* What went wrong:
Execution failed for task ':sdks:python:test-suites:dataflow:py35:postCommitIT'.
> Process 'command 'sh'' finished with non-zero exit value 1
* Try:
Run with --stacktrace option to get the stack trace. Run with --info or --debug option to get more log output. Run with --scan to get full insights.
==============================================================================
* Get more help at https://help.gradle.org
Deprecated Gradle features were used in this build, making it incompatible with Gradle 6.0.
Use '--warning-mode all' to show the individual deprecation warnings.
See https://docs.gradle.org/5.2.1/userguide/command_line_interface.html#sec:command_line_warnings
BUILD FAILED in 55m 40s
77 actionable tasks: 60 executed, 17 from cache
Publishing build scan...
https://gradle.com/s/tj5l73hlcafjk
Build step 'Invoke Gradle script' changed build result to FAILURE
Build step 'Invoke Gradle script' marked build as failure
---------------------------------------------------------------------
To unsubscribe, e-mail: builds-unsubscribe@beam.apache.org
For additional commands, e-mail: builds-help@beam.apache.org
Jenkins build is back to normal : beam_PostCommit_Python3_Verify
#1353
Posted by Apache Jenkins Server <je...@builds.apache.org>.
See <https://builds.apache.org/job/beam_PostCommit_Python3_Verify/1353/display/redirect>
---------------------------------------------------------------------
To unsubscribe, e-mail: builds-unsubscribe@beam.apache.org
For additional commands, e-mail: builds-help@beam.apache.org
Build failed in Jenkins: beam_PostCommit_Python3_Verify #1352
Posted by Apache Jenkins Server <je...@builds.apache.org>.
See <https://builds.apache.org/job/beam_PostCommit_Python3_Verify/1352/display/redirect>
------------------------------------------
[...truncated 744.60 KB...]
self.run()
File "/usr/lib/python3.6/threading.py", line 864, in run
self._target(*self._args, **self._kwargs)
File "<https://builds.apache.org/job/beam_PostCommit_Python3_Verify/ws/src/sdks/python/apache_beam/runners/dataflow/dataflow_runner.py",> line 190, in poll_for_job_completion
job_id, page_token=page_token, start_time=last_message_time)
File "<https://builds.apache.org/job/beam_PostCommit_Python3_Verify/ws/src/sdks/python/apache_beam/utils/retry.py",> line 197, in wrapper
return fun(*args, **kwargs)
File "<https://builds.apache.org/job/beam_PostCommit_Python3_Verify/ws/src/sdks/python/apache_beam/runners/dataflow/internal/apiclient.py",> line 748, in list_messages
response = self._client.projects_locations_jobs_messages.List(request)
File "<https://builds.apache.org/job/beam_PostCommit_Python3_Verify/ws/src/sdks/python/apache_beam/runners/dataflow/internal/clients/dataflow/dataflow_v1b3_client.py",> line 553, in List
config, request, global_params=global_params)
File "<https://builds.apache.org/job/beam_PostCommit_Python3_Verify/ws/src/build/gradleenv/-1734967053/lib/python3.6/site-packages/apitools/base/py/base_api.py",> line 731, in _RunMethod
return self.ProcessHttpResponse(method_config, http_response, request)
File "<https://builds.apache.org/job/beam_PostCommit_Python3_Verify/ws/src/build/gradleenv/-1734967053/lib/python3.6/site-packages/apitools/base/py/base_api.py",> line 737, in ProcessHttpResponse
self.__ProcessHttpResponse(method_config, http_response, request))
File "<https://builds.apache.org/job/beam_PostCommit_Python3_Verify/ws/src/build/gradleenv/-1734967053/lib/python3.6/site-packages/apitools/base/py/base_api.py",> line 604, in __ProcessHttpResponse
http_response, method_config=method_config, request=request)
apitools.base.py.exceptions.HttpNotFoundError: HttpError accessing <https://dataflow.googleapis.com/v1b3/projects/apache-beam-testing/locations/us-central1/jobs/2019-07-13_17_10_23-10495031733663760511/messages?alt=json&startTime=2019-07-14T00%3A10%3A29.249Z>: response: <{'vary': 'Origin, X-Origin, Referer', 'content-type': 'application/json; charset=UTF-8', 'date': 'Sun, 14 Jul 2019 00:12:16 GMT', 'server': 'ESF', 'cache-control': 'private', 'x-xss-protection': '0', 'x-frame-options': 'SAMEORIGIN', 'x-content-type-options': 'nosniff', 'transfer-encoding': 'chunked', 'status': '404', 'content-length': '280', '-content-encoding': 'gzip'}>, content <{
"error": {
"code": 404,
"message": "(cf337a8f5e615b2d): Information about job 2019-07-13_17_10_23-10495031733663760511 could not be found in our system. Please double check the id is correct. If it is please contact customer support.",
"status": "NOT_FOUND"
}
}
>
<https://builds.apache.org/job/beam_PostCommit_Python3_Verify/ws/src/sdks/python/apache_beam/io/gcp/bigquery.py>:1140: BeamDeprecationWarning: options is deprecated since First stable release. References to <pipeline>.options will not be supported
method_to_use = self._compute_method(p, p.options)
<https://builds.apache.org/job/beam_PostCommit_Python3_Verify/ws/src/sdks/python/apache_beam/io/gcp/bigquery_file_loads.py>:557: BeamDeprecationWarning: options is deprecated since First stable release. References to <pipeline>.options will not be supported
temp_location = p.options.view_as(GoogleCloudOptions).temp_location
Found: https://console.cloud.google.com/dataflow/jobsDetail/locations/us-central1/jobs/2019-07-13_17_01_32-2419711400889391345?project=apache-beam-testing.
<https://builds.apache.org/job/beam_PostCommit_Python3_Verify/ws/src/sdks/python/apache_beam/runners/dataflow/dataflow_runner.py>:686: BeamDeprecationWarning: BigQuerySink is deprecated since 2.11.0. Use WriteToBigQuery instead.
kms_key=transform.kms_key))
Exception in thread Thread-2:
Found: https://console.cloud.google.com/dataflow/jobsDetail/locations/us-central1/jobs/2019-07-13_17_10_03-3497255652436947207?project=apache-beam-testing.
Traceback (most recent call last):
File "/usr/lib/python3.6/threading.py", line 916, in _bootstrap_inner
self.run()
File "/usr/lib/python3.6/threading.py", line 864, in run
self._target(*self._args, **self._kwargs)
Found: https://console.cloud.google.com/dataflow/jobsDetail/locations/us-central1/jobs/2019-07-13_17_14_33-3215515801386361020?project=apache-beam-testing.
File "<https://builds.apache.org/job/beam_PostCommit_Python3_Verify/ws/src/sdks/python/apache_beam/runners/dataflow/dataflow_runner.py",> line 157, in poll_for_job_completion
Found: https://console.cloud.google.com/dataflow/jobsDetail/locations/us-central1/jobs/2019-07-13_17_22_53-470482470703407802?project=apache-beam-testing.
response = runner.dataflow_client.get_job(job_id)
Found: https://console.cloud.google.com/dataflow/jobsDetail/locations/us-central1/jobs/2019-07-13_17_30_49-16770228354274346473?project=apache-beam-testing.
Found: https://console.cloud.google.com/dataflow/jobsDetail/locations/us-central1/jobs/2019-07-13_17_38_43-16086295632052874193?project=apache-beam-testing.
File "<https://builds.apache.org/job/beam_PostCommit_Python3_Verify/ws/src/sdks/python/apache_beam/utils/retry.py",> line 197, in wrapper
return fun(*args, **kwargs)
File "<https://builds.apache.org/job/beam_PostCommit_Python3_Verify/ws/src/sdks/python/apache_beam/runners/dataflow/internal/apiclient.py",> line 663, in get_job
response = self._client.projects_locations_jobs.Get(request)
File "<https://builds.apache.org/job/beam_PostCommit_Python3_Verify/ws/src/sdks/python/apache_beam/runners/dataflow/internal/clients/dataflow/dataflow_v1b3_client.py",> line 689, in Get
config, request, global_params=global_params)
File "<https://builds.apache.org/job/beam_PostCommit_Python3_Verify/ws/src/build/gradleenv/-1734967053/lib/python3.6/site-packages/apitools/base/py/base_api.py",> line 731, in _RunMethod
return self.ProcessHttpResponse(method_config, http_response, request)
File "<https://builds.apache.org/job/beam_PostCommit_Python3_Verify/ws/src/build/gradleenv/-1734967053/lib/python3.6/site-packages/apitools/base/py/base_api.py",> line 737, in ProcessHttpResponse
self.__ProcessHttpResponse(method_config, http_response, request))
File "<https://builds.apache.org/job/beam_PostCommit_Python3_Verify/ws/src/build/gradleenv/-1734967053/lib/python3.6/site-packages/apitools/base/py/base_api.py",> line 604, in __ProcessHttpResponse
http_response, method_config=method_config, request=request)
apitools.base.py.exceptions.HttpNotFoundError: HttpError accessing <https://dataflow.googleapis.com/v1b3/projects/apache-beam-testing/locations/us-central1/jobs/2019-07-13_17_10_03-3497255652436947207?alt=json>: response: <{'vary': 'Origin, X-Origin, Referer', 'content-type': 'application/json; charset=UTF-8', 'date': 'Sun, 14 Jul 2019 00:12:24 GMT', 'server': 'ESF', 'cache-control': 'private', 'x-xss-protection': '0', 'x-frame-options': 'SAMEORIGIN', 'x-content-type-options': 'nosniff', 'transfer-encoding': 'chunked', 'status': '404', 'content-length': '278', '-content-encoding': 'gzip'}>, content <{
"error": {
"code": 404,
"message": "(8ef934a1c1c0db5): Information about job 2019-07-13_17_10_03-3497255652436947207 could not be found in our system. Please double check the id is correct. If it is please contact customer support.",
"status": "NOT_FOUND"
}
}
>
Found: https://console.cloud.google.com/dataflow/jobsDetail/locations/us-central1/jobs/2019-07-13_17_01_34-2134383202111117715?project=apache-beam-testing.
Found: https://console.cloud.google.com/dataflow/jobsDetail/locations/us-central1/jobs/2019-07-13_17_10_29-1667933328788752191?project=apache-beam-testing.
Found: https://console.cloud.google.com/dataflow/jobsDetail/locations/us-central1/jobs/2019-07-13_17_19_25-13155627538803194245?project=apache-beam-testing.
Found: https://console.cloud.google.com/dataflow/jobsDetail/locations/us-central1/jobs/2019-07-13_17_27_52-6414614883194179761?project=apache-beam-testing.
Found: https://console.cloud.google.com/dataflow/jobsDetail/locations/us-central1/jobs/2019-07-13_17_35_28-11258388637687828255?project=apache-beam-testing.
<https://builds.apache.org/job/beam_PostCommit_Python3_Verify/ws/src/sdks/python/apache_beam/runners/dataflow/dataflow_runner.py>:686: BeamDeprecationWarning: BigQuerySink is deprecated since 2.11.0. Use WriteToBigQuery instead.
kms_key=transform.kms_key))
<https://builds.apache.org/job/beam_PostCommit_Python3_Verify/ws/src/sdks/python/apache_beam/io/gcp/big_query_query_to_table_pipeline.py>:73: BeamDeprecationWarning: BigQuerySink is deprecated since 2.11.0. Use WriteToBigQuery instead.
kms_key=kms_key))
Found: https://console.cloud.google.com/dataflow/jobsDetail/locations/us-central1/jobs/2019-07-13_17_01_34-9711626019172437859?project=apache-beam-testing.
Found: https://console.cloud.google.com/dataflow/jobsDetail/locations/us-central1/jobs/2019-07-13_17_10_57-9682410303651176420?project=apache-beam-testing.
Found: https://console.cloud.google.com/dataflow/jobsDetail/locations/us-central1/jobs/2019-07-13_17_22_07-7184521210551731755?project=apache-beam-testing.
<https://builds.apache.org/job/beam_PostCommit_Python3_Verify/ws/src/sdks/python/apache_beam/io/gcp/bigquery.py>:1140: BeamDeprecationWarning: options is deprecated since First stable release. References to <pipeline>.options will not be supported
method_to_use = self._compute_method(p, p.options)
<https://builds.apache.org/job/beam_PostCommit_Python3_Verify/ws/src/sdks/python/apache_beam/io/gcp/bigquery_file_loads.py>:557: BeamDeprecationWarning: options is deprecated since First stable release. References to <pipeline>.options will not be supported
temp_location = p.options.view_as(GoogleCloudOptions).temp_location
----------------------------------------------------------------------
XML: <https://builds.apache.org/job/beam_PostCommit_Python3_Verify/ws/src/sdks/python/nosetests.xml>
----------------------------------------------------------------------
Ran 42 tests in 2790.590s
FAILED (SKIP=5, failures=2)
> Task :sdks:python:test-suites:dataflow:py36:postCommitIT FAILED
> Task :sdks:python:test-suites:dataflow:py37:postCommitIT
<https://builds.apache.org/job/beam_PostCommit_Python3_Verify/ws/src/sdks/python/apache_beam/io/gcp/bigquery.py>:1140: BeamDeprecationWarning: options is deprecated since First stable release. References to <pipeline>.options will not be supported
Found: https://console.cloud.google.com/dataflow/jobsDetail/locations/us-central1/jobs/2019-07-13_17_01_36-7101881821343535586?project=apache-beam-testing.
method_to_use = self._compute_method(p, p.options)
Found: https://console.cloud.google.com/dataflow/jobsDetail/locations/us-central1/jobs/2019-07-13_17_16_25-591430006831572238?project=apache-beam-testing.
Found: https://console.cloud.google.com/dataflow/jobsDetail/locations/us-central1/jobs/2019-07-13_17_25_52-14341662754301916432?project=apache-beam-testing.
Found: https://console.cloud.google.com/dataflow/jobsDetail/locations/us-central1/jobs/2019-07-13_17_33_46-4208142965060280877?project=apache-beam-testing.
Found: https://console.cloud.google.com/dataflow/jobsDetail/locations/us-central1/jobs/2019-07-13_17_42_16-12174465727824431142?project=apache-beam-testing.
Found: https://console.cloud.google.com/dataflow/jobsDetail/locations/us-central1/jobs/2019-07-13_17_01_37-1450706842456310806?project=apache-beam-testing.
<https://builds.apache.org/job/beam_PostCommit_Python3_Verify/ws/src/sdks/python/apache_beam/runners/dataflow/dataflow_runner.py>:686: BeamDeprecationWarning: BigQuerySink is deprecated since 2.11.0. Use WriteToBigQuery instead.
kms_key=transform.kms_key))
<https://builds.apache.org/job/beam_PostCommit_Python3_Verify/ws/src/sdks/python/apache_beam/io/fileio_test.py>:232: FutureWarning: MatchAll is experimental.
| 'GetPath' >> beam.Map(lambda metadata: metadata.path))
<https://builds.apache.org/job/beam_PostCommit_Python3_Verify/ws/src/sdks/python/apache_beam/io/fileio_test.py>:243: FutureWarning: MatchAll is experimental.
| 'Checksums' >> beam.Map(compute_hash))
<https://builds.apache.org/job/beam_PostCommit_Python3_Verify/ws/src/sdks/python/apache_beam/io/fileio_test.py>:243: FutureWarning: ReadMatches is experimental.
| 'Checksums' >> beam.Map(compute_hash))
Found: https://console.cloud.google.com/dataflow/jobsDetail/locations/us-central1/jobs/2019-07-13_17_22_50-7619826903375408801?project=apache-beam-testing.
Found: https://console.cloud.google.com/dataflow/jobsDetail/locations/us-central1/jobs/2019-07-13_17_31_06-8149909056282620878?project=apache-beam-testing.
Found: https://console.cloud.google.com/dataflow/jobsDetail/locations/us-central1/jobs/2019-07-13_17_01_35-4180283698433593541?project=apache-beam-testing.
Found: https://console.cloud.google.com/dataflow/jobsDetail/locations/us-central1/jobs/2019-07-13_17_13_49-9612935370179602819?project=apache-beam-testing.
<https://builds.apache.org/job/beam_PostCommit_Python3_Verify/ws/src/sdks/python/apache_beam/io/gcp/bigquery.py>:1140: BeamDeprecationWarning: options is deprecated since First stable release. References to <pipeline>.options will not be supported
method_to_use = self._compute_method(p, p.options)
<https://builds.apache.org/job/beam_PostCommit_Python3_Verify/ws/src/sdks/python/apache_beam/runners/dataflow/dataflow_runner.py>:686: BeamDeprecationWarning: BigQuerySink is deprecated since 2.11.0. Use WriteToBigQuery instead.
kms_key=transform.kms_key))
Found: https://console.cloud.google.com/dataflow/jobsDetail/locations/us-central1/jobs/2019-07-13_17_21_54-14479302789834378935?project=apache-beam-testing.
Found: https://console.cloud.google.com/dataflow/jobsDetail/locations/us-central1/jobs/2019-07-13_17_30_45-399894533287428819?project=apache-beam-testing.
Found: https://console.cloud.google.com/dataflow/jobsDetail/locations/us-central1/jobs/2019-07-13_17_38_35-4679020361669981085?project=apache-beam-testing.
Found: https://console.cloud.google.com/dataflow/jobsDetail/locations/us-central1/jobs/2019-07-13_17_01_33-55077369153197876?project=apache-beam-testing.
Found: https://console.cloud.google.com/dataflow/jobsDetail/locations/us-central1/jobs/2019-07-13_17_22_41-7026245787001028563?project=apache-beam-testing.
Found: https://console.cloud.google.com/dataflow/jobsDetail/locations/us-central1/jobs/2019-07-13_17_30_42-1372722737154226655?project=apache-beam-testing.
Found: https://console.cloud.google.com/dataflow/jobsDetail/locations/us-central1/jobs/2019-07-13_17_01_33-9477967122347118011?project=apache-beam-testing.
Found: https://console.cloud.google.com/dataflow/jobsDetail/locations/us-central1/jobs/2019-07-13_17_10_03-5634508983848276953?project=apache-beam-testing.
Found: https://console.cloud.google.com/dataflow/jobsDetail/locations/us-central1/jobs/2019-07-13_17_17_41-10551196898499386065?project=apache-beam-testing.
Found: https://console.cloud.google.com/dataflow/jobsDetail/locations/us-central1/jobs/2019-07-13_17_26_16-423052384360918682?project=apache-beam-testing.
Found: https://console.cloud.google.com/dataflow/jobsDetail/locations/us-central1/jobs/2019-07-13_17_34_21-3257993710317803075?project=apache-beam-testing.
Found: https://console.cloud.google.com/dataflow/jobsDetail/locations/us-central1/jobs/2019-07-13_17_42_21-12727437567670946883?project=apache-beam-testing.
Found: https://console.cloud.google.com/dataflow/jobsDetail/locations/us-central1/jobs/2019-07-13_17_01_31-1718160569173526635?project=apache-beam-testing.
<https://builds.apache.org/job/beam_PostCommit_Python3_Verify/ws/src/sdks/python/apache_beam/runners/dataflow/dataflow_runner.py>:686: BeamDeprecationWarning: BigQuerySink is deprecated since 2.11.0. Use WriteToBigQuery instead.
kms_key=transform.kms_key))
<https://builds.apache.org/job/beam_PostCommit_Python3_Verify/ws/src/sdks/python/apache_beam/io/gcp/bigquery.py>:1140: BeamDeprecationWarning: options is deprecated since First stable release. References to <pipeline>.options will not be supported
method_to_use = self._compute_method(p, p.options)
<https://builds.apache.org/job/beam_PostCommit_Python3_Verify/ws/src/sdks/python/apache_beam/io/gcp/bigquery_file_loads.py>:557: BeamDeprecationWarning: options is deprecated since First stable release. References to <pipeline>.options will not be supported
temp_location = p.options.view_as(GoogleCloudOptions).temp_location
Found: https://console.cloud.google.com/dataflow/jobsDetail/locations/us-central1/jobs/2019-07-13_17_09_18-15422410044790871753?project=apache-beam-testing.
Found: https://console.cloud.google.com/dataflow/jobsDetail/locations/us-central1/jobs/2019-07-13_17_17_59-2059738930323812776?project=apache-beam-testing.
Found: https://console.cloud.google.com/dataflow/jobsDetail/locations/us-central1/jobs/2019-07-13_17_26_48-221738053592807904?project=apache-beam-testing.
Found: https://console.cloud.google.com/dataflow/jobsDetail/locations/us-central1/jobs/2019-07-13_17_01_35-1114261783191682529?project=apache-beam-testing.
Found: https://console.cloud.google.com/dataflow/jobsDetail/locations/us-central1/jobs/2019-07-13_17_11_29-15179341249660241887?project=apache-beam-testing.
<https://builds.apache.org/job/beam_PostCommit_Python3_Verify/ws/src/sdks/python/apache_beam/io/gcp/bigquery.py>:1140: BeamDeprecationWarning: options is deprecated since First stable release. References to <pipeline>.options will not be supported
method_to_use = self._compute_method(p, p.options)
<https://builds.apache.org/job/beam_PostCommit_Python3_Verify/ws/src/sdks/python/apache_beam/io/gcp/bigquery_file_loads.py>:557: BeamDeprecationWarning: options is deprecated since First stable release. References to <pipeline>.options will not be supported
temp_location = p.options.view_as(GoogleCloudOptions).temp_location
Found: https://console.cloud.google.com/dataflow/jobsDetail/locations/us-central1/jobs/2019-07-13_17_25_55-13748866981174704338?project=apache-beam-testing.
Found: https://console.cloud.google.com/dataflow/jobsDetail/locations/us-central1/jobs/2019-07-13_17_34_16-15739111993389303947?project=apache-beam-testing.
Found: https://console.cloud.google.com/dataflow/jobsDetail/locations/us-central1/jobs/2019-07-13_17_01_34-8680652586282018298?project=apache-beam-testing.
Found: https://console.cloud.google.com/dataflow/jobsDetail/locations/us-central1/jobs/2019-07-13_17_10_45-11793248973339737691?project=apache-beam-testing.
Found: https://console.cloud.google.com/dataflow/jobsDetail/locations/us-central1/jobs/2019-07-13_17_19_53-3724504824265006583?project=apache-beam-testing.
Found: https://console.cloud.google.com/dataflow/jobsDetail/locations/us-central1/jobs/2019-07-13_17_28_34-1464896450792312276?project=apache-beam-testing.
<https://builds.apache.org/job/beam_PostCommit_Python3_Verify/ws/src/sdks/python/apache_beam/runners/dataflow/dataflow_runner.py>:686: BeamDeprecationWarning: BigQuerySink is deprecated since 2.11.0. Use WriteToBigQuery instead.
kms_key=transform.kms_key))
<https://builds.apache.org/job/beam_PostCommit_Python3_Verify/ws/src/sdks/python/apache_beam/io/gcp/big_query_query_to_table_pipeline.py>:73: BeamDeprecationWarning: BigQuerySink is deprecated since 2.11.0. Use WriteToBigQuery instead.
kms_key=kms_key))
Found: https://console.cloud.google.com/dataflow/jobsDetail/locations/us-central1/jobs/2019-07-13_17_36_29-5885554928357885637?project=apache-beam-testing.
test_datastore_wordcount_it (apache_beam.examples.cookbook.datastore_wordcount_it_test.DatastoreWordCountIT) ... SKIP: This test still needs to be fixed on Python 3TODO: BEAM-4543
test_avro_it (apache_beam.examples.fastavro_it_test.FastavroIT) ... SKIP: Due to a known issue in avro-python3 package, thistest is skipped until BEAM-6522 is addressed.
test_bigquery_tornadoes_it (apache_beam.examples.cookbook.bigquery_tornadoes_it_test.BigqueryTornadoesIT) ... ok
test_autocomplete_it (apache_beam.examples.complete.autocomplete_test.AutocompleteTest) ... ok
test_wordcount_fnapi_it (apache_beam.examples.wordcount_it_test.WordCountIT) ... ok
test_streaming_wordcount_it (apache_beam.examples.streaming_wordcount_it_test.StreamingWordCountIT) ... ok
test_leader_board_it (apache_beam.examples.complete.game.leader_board_it_test.LeaderBoardIT) ... ok
test_game_stats_it (apache_beam.examples.complete.game.game_stats_it_test.GameStatsIT) ... ok
test_wordcount_it (apache_beam.examples.wordcount_it_test.WordCountIT) ... ok
test_bigquery_read_1M_python (apache_beam.io.gcp.bigquery_io_read_it_test.BigqueryIOReadIT) ... ok
test_hourly_team_score_it (apache_beam.examples.complete.game.hourly_team_score_it_test.HourlyTeamScoreIT) ... ok
test_datastore_write_limit (apache_beam.io.gcp.datastore_write_it_test.DatastoreWriteIT) ... SKIP: This test still needs to be fixed on Python 3TODO: BEAM-4543
test_user_score_it (apache_beam.examples.complete.game.user_score_it_test.UserScoreIT) ... ok
test_copy (apache_beam.io.gcp.gcsio_integration_test.GcsIOIntegrationTest) ... ok
test_copy_batch (apache_beam.io.gcp.gcsio_integration_test.GcsIOIntegrationTest) ... ok
test_copy_batch_kms (apache_beam.io.gcp.gcsio_integration_test.GcsIOIntegrationTest) ... ok
test_copy_batch_rewrite_token (apache_beam.io.gcp.gcsio_integration_test.GcsIOIntegrationTest) ... ok
test_copy_kms (apache_beam.io.gcp.gcsio_integration_test.GcsIOIntegrationTest) ... ok
test_copy_rewrite_token (apache_beam.io.gcp.gcsio_integration_test.GcsIOIntegrationTest) ... ok
test_transform_on_gcs (apache_beam.io.fileio_test.MatchIntegrationTest) ... ok
test_big_query_read (apache_beam.io.gcp.bigquery_read_it_test.BigQueryReadIntegrationTests) ... ok
test_big_query_read_new_types (apache_beam.io.gcp.bigquery_read_it_test.BigQueryReadIntegrationTests) ... ok
test_multiple_destinations_transform (apache_beam.io.gcp.bigquery_file_loads_test.BigQueryFileLoadsIT) ... ok
test_one_job_fails_all_jobs_fail (apache_beam.io.gcp.bigquery_file_loads_test.BigQueryFileLoadsIT) ... ok
test_multiple_destinations_transform (apache_beam.io.gcp.bigquery_test.BigQueryStreamingInsertTransformIntegrationTests) ... ok
test_multiple_destinations_transform_streaming (apache_beam.io.gcp.bigquery_test.BigQueryStreamingInsertTransformIntegrationTests) ... SKIP: TestStream is not supported on TestDataflowRunner
test_value_provider_transform (apache_beam.io.gcp.bigquery_test.BigQueryStreamingInsertTransformIntegrationTests) ... ok
test_streaming_data_only (apache_beam.io.gcp.pubsub_integration_test.PubSubIntegrationTest) ... ok
test_streaming_with_attributes (apache_beam.io.gcp.pubsub_integration_test.PubSubIntegrationTest) ... ok
test_parquetio_it (apache_beam.io.parquetio_it_test.TestParquetIT) ... ok
test_job_python_from_python_it (apache_beam.transforms.external_test_it.ExternalTransformIT) ... ok
test_big_query_legacy_sql (apache_beam.io.gcp.big_query_query_to_table_it_test.BigQueryQueryToTableIT) ... ok
test_big_query_new_types (apache_beam.io.gcp.big_query_query_to_table_it_test.BigQueryQueryToTableIT) ... ok
test_big_query_standard_sql (apache_beam.io.gcp.big_query_query_to_table_it_test.BigQueryQueryToTableIT) ... ok
test_big_query_standard_sql_kms_key_native (apache_beam.io.gcp.big_query_query_to_table_it_test.BigQueryQueryToTableIT) ... ok
test_big_query_write (apache_beam.io.gcp.bigquery_write_it_test.BigQueryWriteIntegrationTests) ... ok
test_big_query_write_new_types (apache_beam.io.gcp.bigquery_write_it_test.BigQueryWriteIntegrationTests) ... ok
test_big_query_write_schema_autodetect (apache_beam.io.gcp.bigquery_write_it_test.BigQueryWriteIntegrationTests) ... SKIP: DataflowRunner does not support schema autodetection
test_big_query_write_without_schema (apache_beam.io.gcp.bigquery_write_it_test.BigQueryWriteIntegrationTests) ... ok
test_datastore_write_limit (apache_beam.io.gcp.datastore.v1new.datastore_write_it_test.DatastoreWriteIT) ... ok
test_metrics_fnapi_it (apache_beam.runners.dataflow.dataflow_exercise_metrics_pipeline_test.ExerciseMetricsPipelineTest) ... ok
test_metrics_it (apache_beam.runners.dataflow.dataflow_exercise_metrics_pipeline_test.ExerciseMetricsPipelineTest) ... ok
----------------------------------------------------------------------
XML: <https://builds.apache.org/job/beam_PostCommit_Python3_Verify/ws/src/sdks/python/nosetests.xml>
----------------------------------------------------------------------
Ran 42 tests in 3032.939s
OK (SKIP=5)
FAILURE: Build completed with 2 failures.
1: Task failed with an exception.
-----------
* Where:
Build file '<https://builds.apache.org/job/beam_PostCommit_Python3_Verify/ws/src/sdks/python/test-suites/dataflow/py35/build.gradle'> line: 48
* What went wrong:
Execution failed for task ':sdks:python:test-suites:dataflow:py35:postCommitIT'.
> Process 'command 'sh'' finished with non-zero exit value 1
* Try:
Run with --stacktrace option to get the stack trace. Run with --info or --debug option to get more log output. Run with --scan to get full insights.
==============================================================================
2: Task failed with an exception.
-----------
* Where:
Build file '<https://builds.apache.org/job/beam_PostCommit_Python3_Verify/ws/src/sdks/python/test-suites/dataflow/py36/build.gradle'> line: 48
* What went wrong:
Execution failed for task ':sdks:python:test-suites:dataflow:py36:postCommitIT'.
> Process 'command 'sh'' finished with non-zero exit value 1
* Try:
Run with --stacktrace option to get the stack trace. Run with --info or --debug option to get more log output. Run with --scan to get full insights.
==============================================================================
* Get more help at https://help.gradle.org
Deprecated Gradle features were used in this build, making it incompatible with Gradle 6.0.
Use '--warning-mode all' to show the individual deprecation warnings.
See https://docs.gradle.org/5.2.1/userguide/command_line_interface.html#sec:command_line_warnings
BUILD FAILED in 51m 38s
77 actionable tasks: 60 executed, 17 from cache
Publishing build scan...
https://gradle.com/s/ym4xqer67vqcw
Build step 'Invoke Gradle script' changed build result to FAILURE
Build step 'Invoke Gradle script' marked build as failure
---------------------------------------------------------------------
To unsubscribe, e-mail: builds-unsubscribe@beam.apache.org
For additional commands, e-mail: builds-help@beam.apache.org