You are viewing a plain text version of this content. The canonical link for it is here.
Posted to builds@mesos.apache.org by Apache Jenkins Server <je...@builds.apache.org> on 2017/03/10 02:03:14 UTC
Build failed in Jenkins: Mesos-Buildbot » autotools,gcc,--verbose --enable-libevent --enable-ssl,GLOG_v=1 MESOS_VERBOSE=1,centos:7,(docker||Hadoop)&&(!ubuntu-us1)&&(!ubuntu-eu2) #3356
See <https://builds.apache.org/job/Mesos-Buildbot/BUILDTOOL=autotools,COMPILER=gcc,CONFIGURATION=--verbose%20--enable-libevent%20--enable-ssl,ENVIRONMENT=GLOG_v=1%20MESOS_VERBOSE=1,OS=centos%3A7,label_exp=(docker%7C%7CHadoop)&&(!ubuntu-us1)&&(!ubuntu-eu2)/3356/display/redirect?page=changes>
Changes:
[vinodkone] Clarified a comment for 'Principal' in libprocess.
[adam] Update website for Mesos 1.2.0 release.
------------------------------------------
[...truncated 26.11 MB...]
[ RUN ] Endpoint/SlaveEndpointTest.AuthorizedRequest/2
I0310 02:02:51.949317 995 containerizer.cpp:221] Using isolation: posix/cpu,posix/mem,filesystem/posix,network/cni
W0310 02:02:51.949908 995 backend.cpp:76] Failed to create 'aufs' backend: AufsBackend requires root privileges
W0310 02:02:51.950034 995 backend.cpp:76] Failed to create 'bind' backend: BindBackend requires root privileges
I0310 02:02:51.950080 995 provisioner.cpp:249] Using default backend 'copy'
I0310 02:02:51.953662 16173 slave.cpp:215] Mesos agent started on (708)@172.17.0.2:49519
I0310 02:02:51.953694 16173 slave.cpp:216] Flags at startup: --acls="" --appc_simple_discovery_uri_prefix="http://" --appc_store_dir="/tmp/mesos/store/appc" --authenticate_http_readonly="true" --authenticate_http_readwrite="true" --authenticatee="crammd5" --authentication_backoff_factor="1secs" --authorizer="local" --cgroups_cpu_enable_pids_and_tids_count="false" --cgroups_enable_cfs="false" --cgroups_hierarchy="/sys/fs/cgroup" --cgroups_limit_swap="false" --cgroups_root="mesos" --container_disk_watch_interval="15secs" --containerizers="mesos" --credential="/tmp/Endpoint_SlaveEndpointTest_AuthorizedRequest_2_VieVlQ/credential" --default_role="*" --disk_watch_interval="1mins" --docker="docker" --docker_kill_orphans="true" --docker_registry="https://registry-1.docker.io" --docker_remove_delay="6hrs" --docker_socket="/var/run/docker.sock" --docker_stop_timeout="0ns" --docker_store_dir="/tmp/mesos/store/docker" --docker_volume_checkpoint_dir="/var/run/mesos/isolators/docker/volume" --enforce_container_disk_quota="false" --executor_registration_timeout="1mins" --executor_shutdown_grace_period="5secs" --fetcher_cache_dir="/tmp/Endpoint_SlaveEndpointTest_AuthorizedRequest_2_VieVlQ/fetch" --fetcher_cache_size="2GB" --frameworks_home="" --gc_delay="1weeks" --gc_disk_headroom="0.1" --hadoop_home="" --help="false" --hostname_lookup="true" --http_authenticators="basic" --http_command_executor="false" --http_credentials="/tmp/Endpoint_SlaveEndpointTest_AuthorizedRequest_2_VieVlQ/http_credentials" --http_heartbeat_interval="30secs" --initialize_driver_logging="true" --isolation="posix/cpu,posix/mem" --launcher="posix" --launcher_dir="/mesos/mesos-1.3.0/_build/src" --logbufsecs="0" --logging_level="INFO" --max_completed_executors_per_framework="150" --oversubscribed_resources_interval="15secs" --perf_duration="10secs" --perf_interval="1mins" --qos_correction_interval_min="0ns" --quiet="false" --recover="reconnect" --recovery_timeout="15mins" --registration_backoff_factor="10ms" --resources="cpus:2;gpus:0;mem:1024;disk:1024;ports:[31000-32000]" --revocable_cpu_low_priority="true" --runtime_dir="/tmp/Endpoint_SlaveEndpointTest_AuthorizedRequest_2_VieVlQ" --sandbox_directory="/mnt/mesos/sandbox" --strict="true" --switch_user="true" --systemd_enable_support="true" --systemd_runtime_directory="/run/systemd/system" --version="false" --work_dir="/tmp/Endpoint_SlaveEndpointTest_AuthorizedRequest_2_u7UiFM"
I0310 02:02:51.954447 16173 credentials.hpp:86] Loading credential for authentication from '/tmp/Endpoint_SlaveEndpointTest_AuthorizedRequest_2_VieVlQ/credential'
I0310 02:02:51.954641 16173 slave.cpp:358] Agent using credential for: test-principal
I0310 02:02:51.954677 16173 credentials.hpp:37] Loading credentials for authentication from '/tmp/Endpoint_SlaveEndpointTest_AuthorizedRequest_2_VieVlQ/http_credentials'
I0310 02:02:51.955086 16173 http.cpp:964] Using default 'basic' HTTP authenticator for realm 'mesos-agent-readonly'
I0310 02:02:51.955269 16173 http.cpp:964] Using default 'basic' HTTP authenticator for realm 'mesos-agent-readwrite'
I0310 02:02:51.956492 16173 slave.cpp:545] Agent resources: cpus(*):2; mem(*):1024; disk(*):1024; ports(*):[31000-32000]
I0310 02:02:51.956568 16173 slave.cpp:553] Agent attributes: [ ]
I0310 02:02:51.956580 16173 slave.cpp:558] Agent hostname: 797716d131b7
I0310 02:02:51.956676 16168 status_update_manager.cpp:177] Pausing sending status updates
I0310 02:02:51.958169 16168 state.cpp:62] Recovering state from '/tmp/Endpoint_SlaveEndpointTest_AuthorizedRequest_2_u7UiFM/meta'
I0310 02:02:51.958525 16163 status_update_manager.cpp:203] Recovering status update manager
I0310 02:02:51.958853 16167 containerizer.cpp:600] Recovering containerizer
I0310 02:02:51.960181 16166 provisioner.cpp:410] Provisioner recovery complete
I0310 02:02:51.960610 16172 slave.cpp:5564] Finished recovery
I0310 02:02:51.961004 16172 slave.cpp:5746] Querying resource estimator for oversubscribable resources
I0310 02:02:51.961310 16164 slave.cpp:5760] Received oversubscribable resources {} from the resource estimator
I0310 02:02:51.962998 16166 process.cpp:3705] Handling HTTP event for process 'slave(708)' with path: '/slave(708)/containers'
I0310 02:02:51.964135 16176 http.cpp:916] Authorizing principal 'test-principal' to GET the '/containers' endpoint
I0310 02:02:51.966958 16174 slave.cpp:808] Agent terminating
[ OK ] Endpoint/SlaveEndpointTest.AuthorizedRequest/2 (28 ms)
[ RUN ] Endpoint/SlaveEndpointTest.UnauthorizedRequest/0
I0310 02:02:51.978493 995 containerizer.cpp:221] Using isolation: posix/cpu,posix/mem,filesystem/posix,network/cni
W0310 02:02:51.979121 995 backend.cpp:76] Failed to create 'aufs' backend: AufsBackend requires root privileges
W0310 02:02:51.979238 995 backend.cpp:76] Failed to create 'bind' backend: BindBackend requires root privileges
I0310 02:02:51.979276 995 provisioner.cpp:249] Using default backend 'copy'
I0310 02:02:51.982790 16167 slave.cpp:215] Mesos agent started on (709)@172.17.0.2:49519
I0310 02:02:51.982827 16167 slave.cpp:216] Flags at startup: --acls="" --appc_simple_discovery_uri_prefix="http://" --appc_store_dir="/tmp/mesos/store/appc" --authenticate_http_readonly="true" --authenticate_http_readwrite="true" --authenticatee="crammd5" --authentication_backoff_factor="1secs" --authorizer="local" --cgroups_cpu_enable_pids_and_tids_count="false" --cgroups_enable_cfs="false" --cgroups_hierarchy="/sys/fs/cgroup" --cgroups_limit_swap="false" --cgroups_root="mesos" --container_disk_watch_interval="15secs" --containerizers="mesos" --credential="/tmp/Endpoint_SlaveEndpointTest_UnauthorizedRequest_0_Bfrtm5/credential" --default_role="*" --disk_watch_interval="1mins" --docker="docker" --docker_kill_orphans="true" --docker_registry="https://registry-1.docker.io" --docker_remove_delay="6hrs" --docker_socket="/var/run/docker.sock" --docker_stop_timeout="0ns" --docker_store_dir="/tmp/mesos/store/docker" --docker_volume_checkpoint_dir="/var/run/mesos/isolators/docker/volume" --enforce_container_disk_quota="false" --executor_registration_timeout="1mins" --executor_shutdown_grace_period="5secs" --fetcher_cache_dir="/tmp/Endpoint_SlaveEndpointTest_UnauthorizedRequest_0_Bfrtm5/fetch" --fetcher_cache_size="2GB" --frameworks_home="" --gc_delay="1weeks" --gc_disk_headroom="0.1" --hadoop_home="" --help="false" --hostname_lookup="true" --http_authenticators="basic" --http_command_executor="false" --http_credentials="/tmp/Endpoint_SlaveEndpointTest_UnauthorizedRequest_0_Bfrtm5/http_credentials" --http_heartbeat_interval="30secs" --initialize_driver_logging="true" --isolation="posix/cpu,posix/mem" --launcher="posix" --launcher_dir="/mesos/mesos-1.3.0/_build/src" --logbufsecs="0" --logging_level="INFO" --max_completed_executors_per_framework="150" --oversubscribed_resources_interval="15secs" --perf_duration="10secs" --perf_interval="1mins" --qos_correction_interval_min="0ns" --quiet="false" --recover="reconnect" --recovery_timeout="15mins" --registration_backoff_factor="10ms" --resources="cpus:2;gpus:0;mem:1024;disk:1024;ports:[31000-32000]" --revocable_cpu_low_priority="true" --runtime_dir="/tmp/Endpoint_SlaveEndpointTest_UnauthorizedRequest_0_Bfrtm5" --sandbox_directory="/mnt/mesos/sandbox" --strict="true" --switch_user="true" --systemd_enable_support="true" --systemd_runtime_directory="/run/systemd/system" --version="false" --work_dir="/tmp/Endpoint_SlaveEndpointTest_UnauthorizedRequest_0_C218A1"
I0310 02:02:51.983664 16167 credentials.hpp:86] Loading credential for authentication from '/tmp/Endpoint_SlaveEndpointTest_UnauthorizedRequest_0_Bfrtm5/credential'
I0310 02:02:51.983917 16167 slave.cpp:358] Agent using credential for: test-principal
I0310 02:02:51.983945 16167 credentials.hpp:37] Loading credentials for authentication from '/tmp/Endpoint_SlaveEndpointTest_UnauthorizedRequest_0_Bfrtm5/http_credentials'
I0310 02:02:51.984251 16167 http.cpp:964] Using default 'basic' HTTP authenticator for realm 'mesos-agent-readonly'
I0310 02:02:51.984419 16167 http.cpp:964] Using default 'basic' HTTP authenticator for realm 'mesos-agent-readwrite'
I0310 02:02:51.986423 16167 slave.cpp:545] Agent resources: cpus(*):2; mem(*):1024; disk(*):1024; ports(*):[31000-32000]
I0310 02:02:51.986537 16167 slave.cpp:553] Agent attributes: [ ]
I0310 02:02:51.986553 16167 slave.cpp:558] Agent hostname: 797716d131b7
I0310 02:02:51.986752 16176 status_update_manager.cpp:177] Pausing sending status updates
I0310 02:02:51.988546 16163 state.cpp:62] Recovering state from '/tmp/Endpoint_SlaveEndpointTest_UnauthorizedRequest_0_C218A1/meta'
I0310 02:02:51.988855 16171 status_update_manager.cpp:203] Recovering status update manager
I0310 02:02:51.989210 16171 containerizer.cpp:600] Recovering containerizer
I0310 02:02:51.990911 16173 provisioner.cpp:410] Provisioner recovery complete
I0310 02:02:51.991503 16166 slave.cpp:5564] Finished recovery
I0310 02:02:51.992167 16166 slave.cpp:5746] Querying resource estimator for oversubscribable resources
I0310 02:02:51.992550 16164 slave.cpp:5760] Received oversubscribable resources {} from the resource estimator
I0310 02:02:51.995241 16176 process.cpp:3705] Handling HTTP event for process 'slave(709)' with path: '/slave(709)/monitor/statistics'
I0310 02:02:51.997159 16169 http.cpp:916] Authorizing principal 'test-principal' to GET the '/monitor/statistics' endpoint
I0310 02:02:52.000550 16170 slave.cpp:808] Agent terminating
[ OK ] Endpoint/SlaveEndpointTest.UnauthorizedRequest/0 (33 ms)
[ RUN ] Endpoint/SlaveEndpointTest.UnauthorizedRequest/1
I0310 02:02:52.012339 995 containerizer.cpp:221] Using isolation: posix/cpu,posix/mem,filesystem/posix,network/cni
W0310 02:02:52.012943 995 backend.cpp:76] Failed to create 'aufs' backend: AufsBackend requires root privileges
W0310 02:02:52.013082 995 backend.cpp:76] Failed to create 'bind' backend: BindBackend requires root privileges
I0310 02:02:52.013136 995 provisioner.cpp:249] Using default backend 'copy'
I0310 02:02:52.016800 16174 slave.cpp:215] Mesos agent started on (710)@172.17.0.2:49519
I0310 02:02:52.016829 16174 slave.cpp:216] Flags at startup: --acls="" --appc_simple_discovery_uri_prefix="http://" --appc_store_dir="/tmp/mesos/store/appc" --authenticate_http_readonly="true" --authenticate_http_readwrite="true" --authenticatee="crammd5" --authentication_backoff_factor="1secs" --authorizer="local" --cgroups_cpu_enable_pids_and_tids_count="false" --cgroups_enable_cfs="false" --cgroups_hierarchy="/sys/fs/cgroup" --cgroups_limit_swap="false" --cgroups_root="mesos" --container_disk_watch_interval="15secs" --containerizers="mesos" --credential="/tmp/Endpoint_SlaveEndpointTest_UnauthorizedRequest_1_FuAxIk/credential" --default_role="*" --disk_watch_interval="1mins" --docker="docker" --docker_kill_orphans="true" --docker_registry="https://registry-1.docker.io" --docker_remove_delay="6hrs" --docker_socket="/var/run/docker.sock" --docker_stop_timeout="0ns" --docker_store_dir="/tmp/mesos/store/docker" --docker_volume_checkpoint_dir="/var/run/mesos/isolators/docker/volume" --enforce_container_disk_quota="false" --executor_registration_timeout="1mins" --executor_shutdown_grace_period="5secs" --fetcher_cache_dir="/tmp/Endpoint_SlaveEndpointTest_UnauthorizedRequest_1_FuAxIk/fetch" --fetcher_cache_size="2GB" --frameworks_home="" --gc_delay="1weeks" --gc_disk_headroom="0.1" --hadoop_home="" --help="false" --hostname_lookup="true" --http_authenticators="basic" --http_command_executor="false" --http_credentials="/tmp/Endpoint_SlaveEndpointTest_UnauthorizedRequest_1_FuAxIk/http_credentials" --http_heartbeat_interval="30secs" --initialize_driver_logging="true" --isolation="posix/cpu,posix/mem" --launcher="posix" --launcher_dir="/mesos/mesos-1.3.0/_build/src" --logbufsecs="0" --logging_level="INFO" --max_completed_executors_per_framework="150" --oversubscribed_resources_interval="15secs" --perf_duration="10secs" --perf_interval="1mins" --qos_correction_interval_min="0ns" --quiet="false" --recover="reconnect" --recovery_timeout="15mins" --registration_backoff_factor="10ms" --resources="cpus:2;gpus:0;mem:1024;disk:1024;ports:[31000-32000]" --revocable_cpu_low_priority="true" --runtime_dir="/tmp/Endpoint_SlaveEndpointTest_UnauthorizedRequest_1_FuAxIk" --sandbox_directory="/mnt/mesos/sandbox" --strict="true" --switch_user="true" --systemd_enable_support="true" --systemd_runtime_directory="/run/systemd/system" --version="false" --work_dir="/tmp/Endpoint_SlaveEndpointTest_UnauthorizedRequest_1_yN7HRg"
I0310 02:02:52.017560 16174 credentials.hpp:86] Loading credential for authentication from '/tmp/Endpoint_SlaveEndpointTest_UnauthorizedRequest_1_FuAxIk/credential'
I0310 02:02:52.017796 16174 slave.cpp:358] Agent using credential for: test-principal
I0310 02:02:52.017827 16174 credentials.hpp:37] Loading credentials for authentication from '/tmp/Endpoint_SlaveEndpointTest_UnauthorizedRequest_1_FuAxIk/http_credentials'
I0310 02:02:52.018134 16174 http.cpp:964] Using default 'basic' HTTP authenticator for realm 'mesos-agent-readonly'
I0310 02:02:52.018309 16174 http.cpp:964] Using default 'basic' HTTP authenticator for realm 'mesos-agent-readwrite'
I0310 02:02:52.019908 16174 slave.cpp:545] Agent resources: cpus(*):2; mem(*):1024; disk(*):1024; ports(*):[31000-32000]
I0310 02:02:52.020022 16174 slave.cpp:553] Agent attributes: [ ]
I0310 02:02:52.020048 16174 slave.cpp:558] Agent hostname: 797716d131b7
I0310 02:02:52.020231 16163 status_update_manager.cpp:177] Pausing sending status updates
I0310 02:02:52.021847 16165 state.cpp:62] Recovering state from '/tmp/Endpoint_SlaveEndpointTest_UnauthorizedRequest_1_yN7HRg/meta'
I0310 02:02:52.022235 16172 status_update_manager.cpp:203] Recovering status update manager
I0310 02:02:52.022676 16168 containerizer.cpp:600] Recovering containerizer
I0310 02:02:52.024269 16176 provisioner.cpp:410] Provisioner recovery complete
I0310 02:02:52.024811 16173 slave.cpp:5564] Finished recovery
I0310 02:02:52.025343 16173 slave.cpp:5746] Querying resource estimator for oversubscribable resources
I0310 02:02:52.025646 16165 slave.cpp:5760] Received oversubscribable resources {} from the resource estimator
I0310 02:02:52.027768 16170 process.cpp:3705] Handling HTTP event for process 'slave(710)' with path: '/slave(710)/monitor/statistics.json'
I0310 02:02:52.029186 16164 http.cpp:916] Authorizing principal 'test-principal' to GET the '/monitor/statistics.json' endpoint
I0310 02:02:52.031623 16171 slave.cpp:808] Agent terminating
[ OK ] Endpoint/SlaveEndpointTest.UnauthorizedRequest/1 (30 ms)
[ RUN ] Endpoint/SlaveEndpointTest.UnauthorizedRequest/2
I0310 02:02:52.042598 995 containerizer.cpp:221] Using isolation: posix/cpu,posix/mem,filesystem/posix,network/cni
W0310 02:02:52.043156 995 backend.cpp:76] Failed to create 'aufs' backend: AufsBackend requires root privileges
W0310 02:02:52.043273 995 backend.cpp:76] Failed to create 'bind' backend: BindBackend requires root privileges
I0310 02:02:52.043323 995 provisioner.cpp:249] Using default backend 'copy'
I0310 02:02:52.046820 16171 slave.cpp:215] Mesos agent started on (711)@172.17.0.2:49519
I0310 02:02:52.046854 16171 slave.cpp:216] Flags at startup: --acls="" --appc_simple_discovery_uri_prefix="http://" --appc_store_dir="/tmp/mesos/store/appc" --authenticate_http_readonly="true" --authenticate_http_readwrite="true" --authenticatee="crammd5" --authentication_backoff_factor="1secs" --authorizer="local" --cgroups_cpu_enable_pids_and_tids_count="false" --cgroups_enable_cfs="false" --cgroups_hierarchy="/sys/fs/cgroup" --cgroups_limit_swap="false" --cgroups_root="mesos" --container_disk_watch_interval="15secs" --containerizers="mesos" --credential="/tmp/Endpoint_SlaveEndpointTest_UnauthorizedRequest_2_3j6QoA/credential" --default_role="*" --disk_watch_interval="1mins" --docker="docker" --docker_kill_orphans="true" --docker_registry="https://registry-1.docker.io" --docker_remove_delay="6hrs" --docker_socket="/var/run/docker.sock" --docker_stop_timeout="0ns" --docker_store_dir="/tmp/mesos/store/docker" --docker_volume_checkpoint_dir="/var/run/mesos/isolators/docker/volume" --enforce_container_disk_quota="false" --executor_registration_timeout="1mins" --executor_shutdown_grace_period="5secs" --fetcher_cache_dir="/tmp/Endpoint_SlaveEndpointTest_UnauthorizedRequest_2_3j6QoA/fetch" --fetcher_cache_size="2GB" --frameworks_home="" --gc_delay="1weeks" --gc_disk_headroom="0.1" --hadoop_home="" --help="false" --hostname_lookup="true" --http_authenticators="basic" --http_command_executor="false" --http_credentials="/tmp/Endpoint_SlaveEndpointTest_UnauthorizedRequest_2_3j6QoA/http_credentials" --http_heartbeat_interval="30secs" --initialize_driver_logging="true" --isolation="posix/cpu,posix/mem" --launcher="posix" --launcher_dir="/mesos/mesos-1.3.0/_build/src" --logbufsecs="0" --logging_level="INFO" --max_completed_executors_per_framework="150" --oversubscribed_resources_interval="15secs" --perf_duration="10secs" --perf_interval="1mins" --qos_correction_interval_min="0ns" --quiet="false" --recover="reconnect" --recovery_timeout="15mins" --registration_backoff_factor="10ms" --resources="cpus:2;gpus:0;mem:1024;disk:1024;ports:[31000-32000]" --revocable_cpu_low_priority="true" --runtime_dir="/tmp/Endpoint_SlaveEndpointTest_UnauthorizedRequest_2_3j6QoA" --sandbox_directory="/mnt/mesos/sandbox" --strict="true" --switch_user="true" --systemd_enable_support="true" --systemd_runtime_directory="/run/systemd/system" --version="false" --work_dir="/tmp/Endpoint_SlaveEndpointTest_UnauthorizedRequest_2_uZn5sw"
I0310 02:02:52.047839 16171 credentials.hpp:86] Loading credential for authentication from '/tmp/Endpoint_SlaveEndpointTest_UnauthorizedRequest_2_3j6QoA/credential'
I0310 02:02:52.048063 16171 slave.cpp:358] Agent using credential for: test-principal
I0310 02:02:52.048097 16171 credentials.hpp:37] Loading credentials for authentication from '/tmp/Endpoint_SlaveEndpointTest_UnauthorizedRequest_2_3j6QoA/http_credentials'
I0310 02:02:52.048497 16171 http.cpp:964] Using default 'basic' HTTP authenticator for realm 'mesos-agent-readonly'
I0310 02:02:52.048795 16171 http.cpp:964] Using default 'basic' HTTP authenticator for realm 'mesos-agent-readwrite'
I0310 02:02:52.050236 16171 slave.cpp:545] Agent resources: cpus(*):2; mem(*):1024; disk(*):1024; ports(*):[31000-32000]
I0310 02:02:52.050312 16171 slave.cpp:553] Agent attributes: [ ]
I0310 02:02:52.050326 16171 slave.cpp:558] Agent hostname: 797716d131b7
I0310 02:02:52.050434 16173 status_update_manager.cpp:177] Pausing sending status updates
I0310 02:02:52.051589 16170 state.cpp:62] Recovering state from '/tmp/Endpoint_SlaveEndpointTest_UnauthorizedRequest_2_uZn5sw/meta'
I0310 02:02:52.051803 16176 status_update_manager.cpp:203] Recovering status update manager
I0310 02:02:52.051985 16167 containerizer.cpp:600] Recovering containerizer
I0310 02:02:52.053272 16171 provisioner.cpp:410] Provisioner recovery complete
I0310 02:02:52.053727 16169 slave.cpp:5564] Finished recovery
I0310 02:02:52.054250 16169 slave.cpp:5746] Querying resource estimator for oversubscribable resources
I0310 02:02:52.054556 16174 slave.cpp:5760] Received oversubscribable resources {} from the resource estimator
I0310 02:02:52.056146 16175 process.cpp:3705] Handling HTTP event for process 'slave(711)' with path: '/slave(711)/containers'
I0310 02:02:52.057304 16177 http.cpp:916] Authorizing principal 'test-principal' to GET the '/containers' endpoint
I0310 02:02:52.059243 16170 slave.cpp:808] Agent terminating
[ OK ] Endpoint/SlaveEndpointTest.UnauthorizedRequest/2 (25 ms)
[ RUN ] Endpoint/SlaveEndpointTest.NoAuthorizer/0
I0310 02:02:52.068670 995 containerizer.cpp:221] Using isolation: posix/cpu,posix/mem,filesystem/posix,network/cni
W0310 02:02:52.069231 995 backend.cpp:76] Failed to create 'aufs' backend: AufsBackend requires root privileges
W0310 02:02:52.069344 995 backend.cpp:76] Failed to create 'bind' backend: BindBackend requires root privileges
I0310 02:02:52.069393 995 provisioner.cpp:249] Using default backend 'copy'
I0310 02:02:52.071128 995 cluster.cpp:446] Creating default 'local' authorizer
I0310 02:02:52.072777 16172 slave.cpp:215] Mesos agent started on (712)@172.17.0.2:49519
I0310 02:02:52.072799 16172 slave.cpp:216] Flags at startup: --acls="" --appc_simple_discovery_uri_prefix="http://" --appc_store_dir="/tmp/mesos/store/appc" --authenticate_http_readonly="true" --authenticate_http_readwrite="true" --authenticatee="crammd5" --authentication_backoff_factor="1secs" --authorizer="local" --cgroups_cpu_enable_pids_and_tids_count="false" --cgroups_enable_cfs="false" --cgroups_hierarchy="/sys/fs/cgroup" --cgroups_limit_swap="false" --cgroups_root="mesos" --container_disk_watch_interval="15secs" --containerizers="mesos" --credential="/tmp/Endpoint_SlaveEndpointTest_NoAuthorizer_0_upksmQ/credential" --default_role="*" --disk_watch_interval="1mins" --docker="docker" --docker_kill_orphans="true" --docker_registry="https://registry-1.docker.io" --docker_remove_delay="6hrs" --docker_socket="/var/run/docker.sock" --docker_stop_timeout="0ns" --docker_store_dir="/tmp/mesos/store/docker" --docker_volume_checkpoint_dir="/var/run/mesos/isolators/docker/volume" --enforce_container_disk_quota="false" --executor_registration_timeout="1mins" --executor_shutdown_grace_period="5secs" --fetcher_cache_dir="/tmp/Endpoint_SlaveEndpointTest_NoAuthorizer_0_upksmQ/fetch" --fetcher_cache_size="2GB" --frameworks_home="" --gc_delay="1weeks" --gc_disk_headroom="0.1" --hadoop_home="" --help="false" --hostname_lookup="true" --http_authenticators="basic" --http_command_executor="false" --http_credentials="/tmp/Endpoint_SlaveEndpointTest_NoAuthorizer_0_upksmQ/http_credentials" --http_heartbeat_interval="30secs" --initialize_driver_logging="true" --isolation="posix/cpu,posix/mem" --launcher="posix" --launcher_dir="/mesos/mesos-1.3.0/_build/src" --logbufsecs="0" --logging_level="INFO" --max_completed_executors_per_framework="150" --oversubscribed_resources_interval="15secs" --perf_duration="10secs" --perf_interval="1mins" --qos_correction_interval_min="0ns" --quiet="false" --recover="reconnect" --recovery_timeout="15mins" --registration_backoff_factor="10ms" --resources="cpus:2;gpus:0;mem:1024;disk:1024;ports:[31000-32000]" --revocable_cpu_low_priority="true" --runtime_dir="/tmp/Endpoint_SlaveEndpointTest_NoAuthorizer_0_upksmQ" --sandbox_directory="/mnt/mesos/sandbox" --strict="true" --switch_user="true" --systemd_enable_support="true" --systemd_runtime_directory="/run/systemd/system" --version="false" --work_dir="/tmp/Endpoint_SlaveEndpointTest_NoAuthorizer_0_pFbvmM"
I0310 02:02:52.073258 16172 credentials.hpp:86] Loading credential for authentication from '/tmp/Endpoint_SlaveEndpointTest_NoAuthorizer_0_upksmQ/credential'
I0310 02:02:52.073380 16172 slave.cpp:358] Agent using credential for: test-principal
I0310 02:02:52.073400 16172 credentials.hpp:37] Loading credentials for authentication from '/tmp/Endpoint_SlaveEndpointTest_NoAuthorizer_0_upksmQ/http_credentials'
I0310 02:02:52.073595 16172 http.cpp:964] Using default 'basic' HTTP authenticator for realm 'mesos-agent-readonly'
I0310 02:02:52.073729 16172 http.cpp:964] Using default 'basic' HTTP authenticator for realm 'mesos-agent-readwrite'
I0310 02:02:52.075289 16172 slave.cpp:545] Agent resources: cpus(*):2; mem(*):1024; disk(*):1024; ports(*):[31000-32000]
I0310 02:02:52.075400 16172 slave.cpp:553] Agent attributes: [ ]
I0310 02:02:52.075426 16172 slave.cpp:558] Agent hostname: 797716d131b7
I0310 02:02:52.075604 16171 status_update_manager.cpp:177] Pausing sending status updates
I0310 02:02:52.077198 16176 state.cpp:62] Recovering state from '/tmp/Endpoint_SlaveEndpointTest_NoAuthorizer_0_pFbvmM/meta'
I0310 02:02:52.077491 16165 status_update_manager.cpp:203] Recovering status update manager
I0310 02:02:52.077720 16169 containerizer.cpp:600] Recovering containerizer
I0310 02:02:52.079274 16172 provisioner.cpp:410] Provisioner recovery complete
I0310 02:02:52.079752 16175 slave.cpp:5564] Finished recovery
I0310 02:02:52.080309 16175 slave.cpp:5746] Querying resource estimator for oversubscribable resources
I0310 02:02:52.080658 16172 slave.cpp:5760] Received oversubscribable resources {} from the resource estimator
I0310 02:02:52.082723 16173 process.cpp:3705] Handling HTTP event for process 'slave(712)' with path: '/slave(712)/monitor/statistics'
I0310 02:02:52.084187 16175 http.cpp:916] Authorizing principal 'test-principal' to GET the '/monitor/statistics' endpoint
I0310 02:02:52.087661 995 slave.cpp:808] Agent terminating
[ OK ] Endpoint/SlaveEndpointTest.NoAuthorizer/0 (30 ms)
[ RUN ] Endpoint/SlaveEndpointTest.NoAuthorizer/1
I0310 02:02:52.099530 995 containerizer.cpp:221] Using isolation: posix/cpu,posix/mem,filesystem/posix,network/cni
W0310 02:02:52.100177 995 backend.cpp:76] Failed to create 'aufs' backend: AufsBackend requires root privileges
W0310 02:02:52.100291 995 backend.cpp:76] Failed to create 'bind' backend: BindBackend requires root privileges
I0310 02:02:52.100337 995 provisioner.cpp:249] Using default backend 'copy'
I0310 02:02:52.102109 995 cluster.cpp:446] Creating default 'local' authorizer
I0310 02:02:52.103662 16166 slave.cpp:215] Mesos agent started on (713)@172.17.0.2:49519
I0310 02:02:52.103690 16166 slave.cpp:216] Flags at startup: --acls="" --appc_simple_discovery_uri_prefix="http://" --appc_store_dir="/tmp/mesos/store/appc" --authenticate_http_readonly="true" --authenticate_http_readwrite="true" --authenticatee="crammd5" --authentication_backoff_factor="1secs" --authorizer="local" --cgroups_cpu_enable_pids_and_tids_count="false" --cgroups_enable_cfs="false" --cgroups_hierarchy="/sys/fs/cgroup" --cgroups_limit_swap="false" --cgroups_root="mesos" --container_disk_watch_interval="15secs" --containerizers="mesos" --credential="/tmp/Endpoint_SlaveEndpointTest_NoAuthorizer_1_6ipdD6/credential" --default_role="*" --disk_watch_interval="1mins" --docker="docker" --docker_kill_orphans="true" --docker_registry="https://registry-1.docker.io" --docker_remove_delay="6hrs" --docker_socket="/var/run/docker.sock" --docker_stop_timeout="0ns" --docker_store_dir="/tmp/mesos/store/docker" --docker_volume_checkpoint_dir="/var/run/mesos/isolators/docker/volume" --enforce_container_disk_quota="false" --executor_registration_timeout="1mins" --executor_shutdown_grace_period="5secs" --fetcher_cache_dir="/tmp/Endpoint_SlaveEndpointTest_NoAuthorizer_1_6ipdD6/fetch" --fetcher_cache_size="2GB" --frameworks_home="" --gc_delay="1weeks" --gc_disk_headroom="0.1" --hadoop_home="" --help="false" --hostname_lookup="true" --http_authenticators="basic" --http_command_executor="false" --http_credentials="/tmp/Endpoint_SlaveEndpointTest_NoAuthorizer_1_6ipdD6/http_credentials" --http_heartbeat_interval="30secs" --initialize_driver_logging="true" --isolation="posix/cpu,posix/mem" --launcher="posix" --launcher_dir="/mesos/mesos-1.3.0/_build/src" --logbufsecs="0" --logging_level="INFO" --max_completed_executors_per_framework="150" --oversubscribed_resources_interval="15secs" --perf_duration="10secs" --perf_interval="1mins" --qos_correction_interval_min="0ns" --quiet="false" --recover="reconnect" --recovery_timeout="15mins" --registration_backoff_factor="10ms" --resources="cpus:2;gpus:0;mem:1024;disk:1024;ports:[31000-32000]" --revocable_cpu_low_priority="true" --runtime_dir="/tmp/Endpoint_SlaveEndpointTest_NoAuthorizer_1_6ipdD6" --sandbox_directory="/mnt/mesos/sandbox" --strict="true" --switch_user="true" --systemd_enable_support="true" --systemd_runtime_directory="/run/systemd/system" --version="false" --work_dir="/tmp/Endpoint_SlaveEndpointTest_NoAuthorizer_1_5QWgy2"
I0310 02:02:52.104226 16166 credentials.hpp:86] Loading credential for authentication from '/tmp/Endpoint_SlaveEndpointTest_NoAuthorizer_1_6ipdD6/credential'
I0310 02:02:52.104367 16166 slave.cpp:358] Agent using credential for: test-principal
I0310 02:02:52.104389 16166 credentials.hpp:37] Loading credentials for authentication from '/tmp/Endpoint_SlaveEndpointTest_NoAuthorizer_1_6ipdD6/http_credentials'
I0310 02:02:52.104619 16166 http.cpp:964] Using default 'basic' HTTP authenticator for realm 'mesos-agent-readonly'
I0310 02:02:52.104760 16166 http.cpp:964] Using default 'basic' HTTP authenticator for realm 'mesos-agent-readwrite'
I0310 02:02:52.106014 16166 slave.cpp:545] Agent resources: cpus(*):2; mem(*):1024; disk(*):1024; ports(*):[31000-32000]
I0310 02:02:52.106101 16166 slave.cpp:553] Agent attributes: [ ]
I0310 02:02:52.106115 16166 slave.cpp:558] Agent hostname: 797716d131b7
I0310 02:02:52.106326 16173 status_update_manager.cpp:177] Pausing sending status updates
I0310 02:02:52.107750 16163 state.cpp:62] Recovering state from '/tmp/Endpoint_SlaveEndpointTest_NoAuthorizer_1_5QWgy2/meta'
I0310 02:02:52.108125 16170 status_update_manager.cpp:203] Recovering status update manager
I0310 02:02:52.108325 16165 containerizer.cpp:600] Recovering containerizer
I0310 02:02:52.109591 16169 provisioner.cpp:410] Provisioner recovery complete
I0310 02:02:52.110113 16177 slave.cpp:5564] Finished recovery
I0310 02:02:52.110679 16177 slave.cpp:5746] Querying resource estimator for oversubscribable resources
I0310 02:02:52.111028 16164 slave.cpp:5760] Received oversubscribable resources {} from the resource estimator
I0310 02:02:52.113147 16173 process.cpp:3705] Handling HTTP event for process 'slave(713)' with path: '/slave(713)/monitor/statistics.json'
I0310 02:02:52.114727 16172 http.cpp:916] Authorizing principal 'test-principal' to GET the '/monitor/statistics.json' endpoint
I0310 02:02:52.118801 16171 slave.cpp:808] Agent terminating
[ OK ] Endpoint/SlaveEndpointTest.NoAuthorizer/1 (31 ms)
[ RUN ] Endpoint/SlaveEndpointTest.NoAuthorizer/2
I0310 02:02:52.130947 995 containerizer.cpp:221] Using isolation: posix/cpu,posix/mem,filesystem/posix,network/cni
W0310 02:02:52.131513 995 backend.cpp:76] Failed to create 'aufs' backend: AufsBackend requires root privileges
W0310 02:02:52.131628 995 backend.cpp:76] Failed to create 'bind' backend: BindBackend requires root privileges
I0310 02:02:52.131669 995 provisioner.cpp:249] Using default backend 'copy'
I0310 02:02:52.133579 995 cluster.cpp:446] Creating default 'local' authorizer
I0310 02:02:52.135504 16169 slave.cpp:215] Mesos agent started on (714)@172.17.0.2:49519
I0310 02:02:52.135530 16169 slave.cpp:216] Flags at startup: --acls="" --appc_simple_discovery_uri_prefix="http://" --appc_store_dir="/tmp/mesos/store/appc" --authenticate_http_readonly="true" --authenticate_http_readwrite="true" --authenticatee="crammd5" --authentication_backoff_factor="1secs" --authorizer="local" --cgroups_cpu_enable_pids_and_tids_count="false" --cgroups_enable_cfs="false" --cgroups_hierarchy="/sys/fs/cgroup" --cgroups_limit_swap="false" --cgroups_root="mesos" --container_disk_watch_interval="15secs" --containerizers="mesos" --credential="/tmp/Endpoint_SlaveEndpointTest_NoAuthorizer_2_e9Ygen/credential" --default_role="*" --disk_watch_interval="1mins" --docker="docker" --docker_kill_orphans="true" --docker_registry="https://registry-1.docker.io" --docker_remove_delay="6hrs" --docker_socket="/var/run/docker.sock" --docker_stop_timeout="0ns" --docker_store_dir="/tmp/mesos/store/docker" --docker_volume_checkpoint_dir="/var/run/mesos/isolators/docker/volume" --enforce_container_disk_quota="false" --executor_registration_timeout="1mins" --executor_shutdown_grace_period="5secs" --fetcher_cache_dir="/tmp/Endpoint_SlaveEndpointTest_NoAuthorizer_2_e9Ygen/fetch" --fetcher_cache_size="2GB" --frameworks_home="" --gc_delay="1weeks" --gc_disk_headroom="0.1" --hadoop_home="" --help="false" --hostname_lookup="true" --http_authenticators="basic" --http_command_executor="false" --http_credentials="/tmp/Endpoint_SlaveEndpointTest_NoAuthorizer_2_e9Ygen/http_credentials" --http_heartbeat_interval="30secs" --initialize_driver_logging="true" --isolation="posix/cpu,posix/mem" --launcher="posix" --launcher_dir="/mesos/mesos-1.3.0/_build/src" --logbufsecs="0" --logging_level="INFO" --max_completed_executors_per_framework="150" --oversubscribed_resources_interval="15secs" --perf_duration="10secs" --perf_interval="1mins" --qos_correction_interval_min="0ns" --quiet="false" --recover="reconnect" --recovery_timeout="15mins" --registration_backoff_factor="10ms" --resources="cpus:2;gpus:0;mem:1024;disk:1024;ports:[31000-32000]" --revocable_cpu_low_priority="true" --runtime_dir="/tmp/Endpoint_SlaveEndpointTest_NoAuthorizer_2_e9Ygen" --sandbox_directory="/mnt/mesos/sandbox" --strict="true" --switch_user="true" --systemd_enable_support="true" --systemd_runtime_directory="/run/systemd/system" --version="false" --work_dir="/tmp/Endpoint_SlaveEndpointTest_NoAuthorizer_2_pOcd4i"
I0310 02:02:52.136085 16169 credentials.hpp:86] Loading credential for authentication from '/tmp/Endpoint_SlaveEndpointTest_NoAuthorizer_2_e9Ygen/credential'
I0310 02:02:52.136212 16169 slave.cpp:358] Agent using credential for: test-principal
I0310 02:02:52.136234 16169 credentials.hpp:37] Loading credentials for authentication from '/tmp/Endpoint_SlaveEndpointTest_NoAuthorizer_2_e9Ygen/http_credentials'
I0310 02:02:52.136437 16169 http.cpp:964] Using default 'basic' HTTP authenticator for realm 'mesos-agent-readonly'
I0310 02:02:52.136611 16169 http.cpp:964] Using default 'basic' HTTP authenticator for realm 'mesos-agent-readwrite'
I0310 02:02:52.138253 16169 slave.cpp:545] Agent resources: cpus(*):2; mem(*):1024; disk(*):1024; ports(*):[31000-32000]
I0310 02:02:52.138366 16169 slave.cpp:553] Agent attributes: [ ]
I0310 02:02:52.138393 16169 slave.cpp:558] Agent hostname: 797716d131b7
I0310 02:02:52.138630 16166 status_update_manager.cpp:177] Pausing sending status updates
I0310 02:02:52.140115 16171 state.cpp:62] Recovering state from '/tmp/Endpoint_SlaveEndpointTest_NoAuthorizer_2_pOcd4i/meta'
I0310 02:02:52.140532 16177 status_update_manager.cpp:203] Recovering status update manager
I0310 02:02:52.140758 16169 containerizer.cpp:600] Recovering containerizer
I0310 02:02:52.142293 16176 provisioner.cpp:410] Provisioner recovery complete
I0310 02:02:52.142624 16167 slave.cpp:5564] Finished recovery
I0310 02:02:52.143033 16167 slave.cpp:5746] Querying resource estimator for oversubscribable resources
I0310 02:02:52.143424 16168 slave.cpp:5760] Received oversubscribable resources {} from the resource estimator
I0310 02:02:52.146569 16176 process.cpp:3705] Handling HTTP event for process 'slave(714)' with path: '/slave(714)/containers'
I0310 02:02:52.148283 16176 http.cpp:916] Authorizing principal 'test-principal' to GET the '/containers' endpoint
I0310 02:02:52.152014 16163 slave.cpp:808] Agent terminating
[ OK ] Endpoint/SlaveEndpointTest.NoAuthorizer/2 (31 ms)
[----------] 9 tests from Endpoint/SlaveEndpointTest (274 ms total)
[----------] Global test environment tear-down
../../src/tests/environment.cpp:836: Failure
Failed
Tests completed with child processes remaining:
-+- 995 /mesos/mesos-1.3.0/_build/src/.libs/lt-mesos-tests
\-+- 9750 /mesos/mesos-1.3.0/_build/src/.libs/lt-mesos-containerizer launch
\-+- 9764 /mesos/mesos-1.3.0/_build/src/.libs/lt-mesos-executor --launcher_dir=/mesos/mesos-1.3.0/_build/src
\--- 9795 sleep 1000
[==========] 1511 tests from 168 test cases ran. (517734 ms total)
[ PASSED ] 1508 tests.
[ FAILED ] 3 tests, listed below:
[ FAILED ] MasterTest.FailoverAgentReregisterFirst
[ FAILED ] PersistentVolumeEndpointsTest.ReserveAndSlaveRemoval
[ FAILED ] SlaveRecoveryTest/0.RecoverStatusUpdateManager, where TypeParam = mesos::internal::slave::MesosContainerizer
3 FAILED TESTS
YOU HAVE 12 DISABLED TESTS
make[4]: *** [check-local] Error 1
make[4]: Leaving directory `/mesos/mesos-1.3.0/_build/src'
make[3]: *** [check-am] Error 2
make[3]: Leaving directory `/mesos/mesos-1.3.0/_build/src'
make[2]: *** [check] Error 2
make[2]: Leaving directory `/mesos/mesos-1.3.0/_build/src'
make[1]: *** [check-recursive] Error 1
make[1]: Leaving directory `/mesos/mesos-1.3.0/_build'
make: *** [distcheck] Error 1
+ docker rmi mesos-1489108949-30063
Untagged: mesos-1489108949-30063:latest
Deleted: sha256:ee44a7066a6bcbf7a4de0ed3f613dc44394485cf07eb3af68f206e2b15f10189
Deleted: sha256:654dd01897cff2cb5d298ff544173b63a469a2ca2fdf3db9cf5eb4d92044caf6
Deleted: sha256:7ef75cc4aa03a0f7b3a6ddc16517f54e45a67dec965fd82ca040a9954995a3c8
Deleted: sha256:caf1de4ef06eed0eaa1cc880010420ce90b1f609141e181b6d94ecefaf78f95f
Deleted: sha256:b4e42431ee824634e98637a6d282691f805bad2cfba6e07e6ecb12fc3b5afb17
Deleted: sha256:0f11551c503998e917fecfea1d857c06a139053bcb1abe337f07b4ea9c9dd455
Deleted: sha256:1d0cf0e82d24d58a1b8926c7c5118b4f657c83be06a3e6afb9b4959d42f967f5
Deleted: sha256:ea6425a4befc26ce88dfd6ea074c72eecab43ebeca754b7f29c6462ba196208c
Deleted: sha256:2a218023334803313582221cb672c1dbfa094f84371c7c26c19228c0b593f035
Deleted: sha256:3f8fbfb5fa3838afbdc4f1e9bdf7653a38d406da548a2c9089c1c733fadb5ade
Deleted: sha256:c9dbab2dfa91eddc7a238c85cc83c7c6f25137b3e95ecd9bed90d7b06bb2a077
Deleted: sha256:850145e5a4369a00afa75f80261f27bfc9fd6a4d345f3f1f2520513bd6eefa09
Deleted: sha256:b544c9c30c1b9b7630a8a8f9935f0018d1805fea2785d48688be2f61abb3cd58
Deleted: sha256:dd1448a7f5a2445a4ba2ae7ec5d49f0635f43d857707c04a0dc403ca0939180e
Deleted: sha256:eeef3026011564fc1aa0b7623601e3cecb16d8982bb7c9d4d5390678e1a1318f
Deleted: sha256:889bf706e1f9eb3b3a41fa054502860005ceea9f882c3902635452ce9a76e065
Deleted: sha256:2fd0ea704cbec9938e21561915feff06ccdf81edb4a1adbd5e420afeae35fd8f
Deleted: sha256:e189a40fb31c6d7dc5327ee416c8d109193b22f8c09d2b28a184e8cb617d1612
Deleted: sha256:0a38ce97ec2fc9bdf8c0b319de2340ecb148e1dbab058dd1e47e8f8d6b84b3dd
Deleted: sha256:737793b5b8ff0ce16da0e27aaf2425296e9aa68687f2526dd865737c5058a1f1
Deleted: sha256:8a7d1d0241e75e89fc84efece51d85fe4a4d745d4494d6d2896863b31b017e6b
Deleted: sha256:950ff1202eb4532819a963074308f7028fc90c60b7945a7e5e0a1d405f5c8fe1
Deleted: sha256:184f012b9649e213491da43a78fdafdacccef0acf05d143ac28c81c28dfc5cf4
Deleted: sha256:12601dde4b9c229f0bba795ca667bfba3462cb3b3d0895e4005c14a6c48c82b2
Deleted: sha256:027ee8b422103553593c6b1f5c2c7d43fb30a14d295b4ddde827215a81ca490c
Build step 'Execute shell' marked build as failure
Jenkins build is back to normal : Mesos-Buildbot » autotools,gcc,--verbose --enable-libevent --enable-ssl,GLOG_v=1 MESOS_VERBOSE=1,centos:7,(docker||Hadoop)&&(!ubuntu-us1)&&(!ubuntu-eu2) #3358
Posted by Apache Jenkins Server <je...@builds.apache.org>.
See <https://builds.apache.org/job/Mesos-Buildbot/BUILDTOOL=autotools,COMPILER=gcc,CONFIGURATION=--verbose%20--enable-libevent%20--enable-ssl,ENVIRONMENT=GLOG_v=1%20MESOS_VERBOSE=1,OS=centos%3A7,label_exp=(docker%7C%7CHadoop)&&(!ubuntu-us1)&&(!ubuntu-eu2)/3358/display/redirect?page=changes>
Build failed in Jenkins: Mesos-Buildbot » autotools,gcc,--verbose --enable-libevent --enable-ssl,GLOG_v=1 MESOS_VERBOSE=1,centos:7,(docker||Hadoop)&&(!ubuntu-us1)&&(!ubuntu-eu2) #3357
Posted by Apache Jenkins Server <je...@builds.apache.org>.
See <https://builds.apache.org/job/Mesos-Buildbot/BUILDTOOL=autotools,COMPILER=gcc,CONFIGURATION=--verbose%20--enable-libevent%20--enable-ssl,ENVIRONMENT=GLOG_v=1%20MESOS_VERBOSE=1,OS=centos%3A7,label_exp=(docker%7C%7CHadoop)&&(!ubuntu-us1)&&(!ubuntu-eu2)/3357/display/redirect>
------------------------------------------
[...truncated 26.04 MB...]
I0310 03:13:36.911260 16162 containerizer.cpp:600] Recovering containerizer
I0310 03:13:36.912760 16168 provisioner.cpp:410] Provisioner recovery complete
I0310 03:13:36.913138 16168 slave.cpp:5564] Finished recovery
I0310 03:13:36.913616 16168 slave.cpp:5746] Querying resource estimator for oversubscribable resources
I0310 03:13:36.913940 16164 slave.cpp:5760] Received oversubscribable resources {} from the resource estimator
I0310 03:13:36.916177 16164 process.cpp:3705] Handling HTTP event for process 'slave(706)' with path: '/slave(706)/monitor/statistics.json'
I0310 03:13:36.917806 16163 http.cpp:916] Authorizing principal 'test-principal' to GET the '/monitor/statistics.json' endpoint
I0310 03:13:36.921156 16164 slave.cpp:808] Agent terminating
[ OK ] Endpoint/SlaveEndpointTest.AuthorizedRequest/1 (33 ms)
[ RUN ] Endpoint/SlaveEndpointTest.AuthorizedRequest/2
I0310 03:13:36.938601 1004 containerizer.cpp:221] Using isolation: posix/cpu,posix/mem,filesystem/posix,network/cni
W0310 03:13:36.939291 1004 backend.cpp:76] Failed to create 'aufs' backend: AufsBackend requires root privileges
W0310 03:13:36.939419 1004 backend.cpp:76] Failed to create 'bind' backend: BindBackend requires root privileges
I0310 03:13:36.939469 1004 provisioner.cpp:249] Using default backend 'copy'
I0310 03:13:36.943801 16165 slave.cpp:215] Mesos agent started on (707)@172.17.0.3:56313
I0310 03:13:36.943823 16165 slave.cpp:216] Flags at startup: --acls="" --appc_simple_discovery_uri_prefix="http://" --appc_store_dir="/tmp/mesos/store/appc" --authenticate_http_readonly="true" --authenticate_http_readwrite="true" --authenticatee="crammd5" --authentication_backoff_factor="1secs" --authorizer="local" --cgroups_cpu_enable_pids_and_tids_count="false" --cgroups_enable_cfs="false" --cgroups_hierarchy="/sys/fs/cgroup" --cgroups_limit_swap="false" --cgroups_root="mesos" --container_disk_watch_interval="15secs" --containerizers="mesos" --credential="/tmp/Endpoint_SlaveEndpointTest_AuthorizedRequest_2_Vn3jFu/credential" --default_role="*" --disk_watch_interval="1mins" --docker="docker" --docker_kill_orphans="true" --docker_registry="https://registry-1.docker.io" --docker_remove_delay="6hrs" --docker_socket="/var/run/docker.sock" --docker_stop_timeout="0ns" --docker_store_dir="/tmp/mesos/store/docker" --docker_volume_checkpoint_dir="/var/run/mesos/isolators/docker/volume" --enforce_container_disk_quota="false" --executor_registration_timeout="1mins" --executor_shutdown_grace_period="5secs" --fetcher_cache_dir="/tmp/Endpoint_SlaveEndpointTest_AuthorizedRequest_2_Vn3jFu/fetch" --fetcher_cache_size="2GB" --frameworks_home="" --gc_delay="1weeks" --gc_disk_headroom="0.1" --hadoop_home="" --help="false" --hostname_lookup="true" --http_authenticators="basic" --http_command_executor="false" --http_credentials="/tmp/Endpoint_SlaveEndpointTest_AuthorizedRequest_2_Vn3jFu/http_credentials" --http_heartbeat_interval="30secs" --initialize_driver_logging="true" --isolation="posix/cpu,posix/mem" --launcher="posix" --launcher_dir="/mesos/mesos-1.3.0/_build/src" --logbufsecs="0" --logging_level="INFO" --max_completed_executors_per_framework="150" --oversubscribed_resources_interval="15secs" --perf_duration="10secs" --perf_interval="1mins" --qos_correction_interval_min="0ns" --quiet="false" --recover="reconnect" --recovery_timeout="15mins" --registration_backoff_factor="10ms" --resources="cpus:2;gpus:0;mem:1024;disk:1024;ports:[31000-32000]" --revocable_cpu_low_priority="true" --runtime_dir="/tmp/Endpoint_SlaveEndpointTest_AuthorizedRequest_2_Vn3jFu" --sandbox_directory="/mnt/mesos/sandbox" --strict="true" --switch_user="true" --systemd_enable_support="true" --systemd_runtime_directory="/run/systemd/system" --version="false" --work_dir="/tmp/Endpoint_SlaveEndpointTest_AuthorizedRequest_2_djUc33"
I0310 03:13:36.944350 16165 credentials.hpp:86] Loading credential for authentication from '/tmp/Endpoint_SlaveEndpointTest_AuthorizedRequest_2_Vn3jFu/credential'
I0310 03:13:36.944533 16165 slave.cpp:358] Agent using credential for: test-principal
I0310 03:13:36.944555 16165 credentials.hpp:37] Loading credentials for authentication from '/tmp/Endpoint_SlaveEndpointTest_AuthorizedRequest_2_Vn3jFu/http_credentials'
I0310 03:13:36.944797 16165 http.cpp:964] Using default 'basic' HTTP authenticator for realm 'mesos-agent-readonly'
I0310 03:13:36.944963 16165 http.cpp:964] Using default 'basic' HTTP authenticator for realm 'mesos-agent-readwrite'
I0310 03:13:36.946218 16165 slave.cpp:545] Agent resources: cpus(*):2; mem(*):1024; disk(*):1024; ports(*):[31000-32000]
I0310 03:13:36.946300 16165 slave.cpp:553] Agent attributes: [ ]
I0310 03:13:36.946321 16165 slave.cpp:558] Agent hostname: 09917613becd
I0310 03:13:36.946475 16158 status_update_manager.cpp:177] Pausing sending status updates
I0310 03:13:36.947830 16160 state.cpp:62] Recovering state from '/tmp/Endpoint_SlaveEndpointTest_AuthorizedRequest_2_djUc33/meta'
I0310 03:13:36.948166 16158 status_update_manager.cpp:203] Recovering status update manager
I0310 03:13:36.948390 16157 containerizer.cpp:600] Recovering containerizer
I0310 03:13:36.949821 16167 provisioner.cpp:410] Provisioner recovery complete
I0310 03:13:36.950312 16165 slave.cpp:5564] Finished recovery
I0310 03:13:36.950861 16165 slave.cpp:5746] Querying resource estimator for oversubscribable resources
I0310 03:13:36.951283 16162 slave.cpp:5760] Received oversubscribable resources {} from the resource estimator
I0310 03:13:36.953567 16159 process.cpp:3705] Handling HTTP event for process 'slave(707)' with path: '/slave(707)/containers'
I0310 03:13:36.955039 16165 http.cpp:916] Authorizing principal 'test-principal' to GET the '/containers' endpoint
I0310 03:13:36.958248 16155 slave.cpp:808] Agent terminating
[ OK ] Endpoint/SlaveEndpointTest.AuthorizedRequest/2 (31 ms)
[ RUN ] Endpoint/SlaveEndpointTest.UnauthorizedRequest/0
I0310 03:13:36.970306 1004 containerizer.cpp:221] Using isolation: posix/cpu,posix/mem,filesystem/posix,network/cni
W0310 03:13:36.971009 1004 backend.cpp:76] Failed to create 'aufs' backend: AufsBackend requires root privileges
W0310 03:13:36.971135 1004 backend.cpp:76] Failed to create 'bind' backend: BindBackend requires root privileges
I0310 03:13:36.971341 1004 provisioner.cpp:249] Using default backend 'copy'
I0310 03:13:36.974671 16154 slave.cpp:215] Mesos agent started on (708)@172.17.0.3:56313
I0310 03:13:36.974696 16154 slave.cpp:216] Flags at startup: --acls="" --appc_simple_discovery_uri_prefix="http://" --appc_store_dir="/tmp/mesos/store/appc" --authenticate_http_readonly="true" --authenticate_http_readwrite="true" --authenticatee="crammd5" --authentication_backoff_factor="1secs" --authorizer="local" --cgroups_cpu_enable_pids_and_tids_count="false" --cgroups_enable_cfs="false" --cgroups_hierarchy="/sys/fs/cgroup" --cgroups_limit_swap="false" --cgroups_root="mesos" --container_disk_watch_interval="15secs" --containerizers="mesos" --credential="/tmp/Endpoint_SlaveEndpointTest_UnauthorizedRequest_0_5Idepd/credential" --default_role="*" --disk_watch_interval="1mins" --docker="docker" --docker_kill_orphans="true" --docker_registry="https://registry-1.docker.io" --docker_remove_delay="6hrs" --docker_socket="/var/run/docker.sock" --docker_stop_timeout="0ns" --docker_store_dir="/tmp/mesos/store/docker" --docker_volume_checkpoint_dir="/var/run/mesos/isolators/docker/volume" --enforce_container_disk_quota="false" --executor_registration_timeout="1mins" --executor_shutdown_grace_period="5secs" --fetcher_cache_dir="/tmp/Endpoint_SlaveEndpointTest_UnauthorizedRequest_0_5Idepd/fetch" --fetcher_cache_size="2GB" --frameworks_home="" --gc_delay="1weeks" --gc_disk_headroom="0.1" --hadoop_home="" --help="false" --hostname_lookup="true" --http_authenticators="basic" --http_command_executor="false" --http_credentials="/tmp/Endpoint_SlaveEndpointTest_UnauthorizedRequest_0_5Idepd/http_credentials" --http_heartbeat_interval="30secs" --initialize_driver_logging="true" --isolation="posix/cpu,posix/mem" --launcher="posix" --launcher_dir="/mesos/mesos-1.3.0/_build/src" --logbufsecs="0" --logging_level="INFO" --max_completed_executors_per_framework="150" --oversubscribed_resources_interval="15secs" --perf_duration="10secs" --perf_interval="1mins" --qos_correction_interval_min="0ns" --quiet="false" --recover="reconnect" --recovery_timeout="15mins" --registration_backoff_factor="10ms" --resources="cpus:2;gpus:0;mem:1024;disk:1024;ports:[31000-32000]" --revocable_cpu_low_priority="true" --runtime_dir="/tmp/Endpoint_SlaveEndpointTest_UnauthorizedRequest_0_5Idepd" --sandbox_directory="/mnt/mesos/sandbox" --strict="true" --switch_user="true" --systemd_enable_support="true" --systemd_runtime_directory="/run/systemd/system" --version="false" --work_dir="/tmp/Endpoint_SlaveEndpointTest_UnauthorizedRequest_0_H8FXHM"
I0310 03:13:36.975502 16154 credentials.hpp:86] Loading credential for authentication from '/tmp/Endpoint_SlaveEndpointTest_UnauthorizedRequest_0_5Idepd/credential'
I0310 03:13:36.975837 16154 slave.cpp:358] Agent using credential for: test-principal
I0310 03:13:36.975865 16154 credentials.hpp:37] Loading credentials for authentication from '/tmp/Endpoint_SlaveEndpointTest_UnauthorizedRequest_0_5Idepd/http_credentials'
I0310 03:13:36.976169 16154 http.cpp:964] Using default 'basic' HTTP authenticator for realm 'mesos-agent-readonly'
I0310 03:13:36.976346 16154 http.cpp:964] Using default 'basic' HTTP authenticator for realm 'mesos-agent-readwrite'
I0310 03:13:36.977524 16154 slave.cpp:545] Agent resources: cpus(*):2; mem(*):1024; disk(*):1024; ports(*):[31000-32000]
I0310 03:13:36.977603 16154 slave.cpp:553] Agent attributes: [ ]
I0310 03:13:36.977617 16154 slave.cpp:558] Agent hostname: 09917613becd
I0310 03:13:36.977782 16159 status_update_manager.cpp:177] Pausing sending status updates
I0310 03:13:36.979147 16168 state.cpp:62] Recovering state from '/tmp/Endpoint_SlaveEndpointTest_UnauthorizedRequest_0_H8FXHM/meta'
I0310 03:13:36.979496 16155 status_update_manager.cpp:203] Recovering status update manager
I0310 03:13:36.979746 16155 containerizer.cpp:600] Recovering containerizer
I0310 03:13:36.981446 16155 provisioner.cpp:410] Provisioner recovery complete
I0310 03:13:36.981961 16166 slave.cpp:5564] Finished recovery
I0310 03:13:36.982523 16166 slave.cpp:5746] Querying resource estimator for oversubscribable resources
I0310 03:13:36.982839 16157 slave.cpp:5760] Received oversubscribable resources {} from the resource estimator
I0310 03:13:36.985141 16164 process.cpp:3705] Handling HTTP event for process 'slave(708)' with path: '/slave(708)/monitor/statistics'
I0310 03:13:36.986649 16165 http.cpp:916] Authorizing principal 'test-principal' to GET the '/monitor/statistics' endpoint
I0310 03:13:36.988548 16157 slave.cpp:808] Agent terminating
[ OK ] Endpoint/SlaveEndpointTest.UnauthorizedRequest/0 (32 ms)
[ RUN ] Endpoint/SlaveEndpointTest.UnauthorizedRequest/1
I0310 03:13:36.999719 1004 containerizer.cpp:221] Using isolation: posix/cpu,posix/mem,filesystem/posix,network/cni
W0310 03:13:37.000226 1004 backend.cpp:76] Failed to create 'aufs' backend: AufsBackend requires root privileges
W0310 03:13:37.000321 1004 backend.cpp:76] Failed to create 'bind' backend: BindBackend requires root privileges
I0310 03:13:37.000361 1004 provisioner.cpp:249] Using default backend 'copy'
I0310 03:13:37.003128 16153 slave.cpp:215] Mesos agent started on (709)@172.17.0.3:56313
I0310 03:13:37.003154 16153 slave.cpp:216] Flags at startup: --acls="" --appc_simple_discovery_uri_prefix="http://" --appc_store_dir="/tmp/mesos/store/appc" --authenticate_http_readonly="true" --authenticate_http_readwrite="true" --authenticatee="crammd5" --authentication_backoff_factor="1secs" --authorizer="local" --cgroups_cpu_enable_pids_and_tids_count="false" --cgroups_enable_cfs="false" --cgroups_hierarchy="/sys/fs/cgroup" --cgroups_limit_swap="false" --cgroups_root="mesos" --container_disk_watch_interval="15secs" --containerizers="mesos" --credential="/tmp/Endpoint_SlaveEndpointTest_UnauthorizedRequest_1_DkyltW/credential" --default_role="*" --disk_watch_interval="1mins" --docker="docker" --docker_kill_orphans="true" --docker_registry="https://registry-1.docker.io" --docker_remove_delay="6hrs" --docker_socket="/var/run/docker.sock" --docker_stop_timeout="0ns" --docker_store_dir="/tmp/mesos/store/docker" --docker_volume_checkpoint_dir="/var/run/mesos/isolators/docker/volume" --enforce_container_disk_quota="false" --executor_registration_timeout="1mins" --executor_shutdown_grace_period="5secs" --fetcher_cache_dir="/tmp/Endpoint_SlaveEndpointTest_UnauthorizedRequest_1_DkyltW/fetch" --fetcher_cache_size="2GB" --frameworks_home="" --gc_delay="1weeks" --gc_disk_headroom="0.1" --hadoop_home="" --help="false" --hostname_lookup="true" --http_authenticators="basic" --http_command_executor="false" --http_credentials="/tmp/Endpoint_SlaveEndpointTest_UnauthorizedRequest_1_DkyltW/http_credentials" --http_heartbeat_interval="30secs" --initialize_driver_logging="true" --isolation="posix/cpu,posix/mem" --launcher="posix" --launcher_dir="/mesos/mesos-1.3.0/_build/src" --logbufsecs="0" --logging_level="INFO" --max_completed_executors_per_framework="150" --oversubscribed_resources_interval="15secs" --perf_duration="10secs" --perf_interval="1mins" --qos_correction_interval_min="0ns" --quiet="false" --recover="reconnect" --recovery_timeout="15mins" --registration_backoff_factor="10ms" --resources="cpus:2;gpus:0;mem:1024;disk:1024;ports:[31000-32000]" --revocable_cpu_low_priority="true" --runtime_dir="/tmp/Endpoint_SlaveEndpointTest_UnauthorizedRequest_1_DkyltW" --sandbox_directory="/mnt/mesos/sandbox" --strict="true" --switch_user="true" --systemd_enable_support="true" --systemd_runtime_directory="/run/systemd/system" --version="false" --work_dir="/tmp/Endpoint_SlaveEndpointTest_UnauthorizedRequest_1_ntj7Gv"
I0310 03:13:37.003872 16153 credentials.hpp:86] Loading credential for authentication from '/tmp/Endpoint_SlaveEndpointTest_UnauthorizedRequest_1_DkyltW/credential'
I0310 03:13:37.004060 16153 slave.cpp:358] Agent using credential for: test-principal
I0310 03:13:37.004086 16153 credentials.hpp:37] Loading credentials for authentication from '/tmp/Endpoint_SlaveEndpointTest_UnauthorizedRequest_1_DkyltW/http_credentials'
I0310 03:13:37.004393 16153 http.cpp:964] Using default 'basic' HTTP authenticator for realm 'mesos-agent-readonly'
I0310 03:13:37.004559 16153 http.cpp:964] Using default 'basic' HTTP authenticator for realm 'mesos-agent-readwrite'
I0310 03:13:37.006513 16153 slave.cpp:545] Agent resources: cpus(*):2; mem(*):1024; disk(*):1024; ports(*):[31000-32000]
I0310 03:13:37.006636 16153 slave.cpp:553] Agent attributes: [ ]
I0310 03:13:37.006681 16153 slave.cpp:558] Agent hostname: 09917613becd
I0310 03:13:37.006852 16168 status_update_manager.cpp:177] Pausing sending status updates
I0310 03:13:37.008556 16159 state.cpp:62] Recovering state from '/tmp/Endpoint_SlaveEndpointTest_UnauthorizedRequest_1_ntj7Gv/meta'
I0310 03:13:37.008888 16163 status_update_manager.cpp:203] Recovering status update manager
I0310 03:13:37.009192 16154 containerizer.cpp:600] Recovering containerizer
I0310 03:13:37.010694 16156 provisioner.cpp:410] Provisioner recovery complete
I0310 03:13:37.011072 16157 slave.cpp:5564] Finished recovery
I0310 03:13:37.011648 16157 slave.cpp:5746] Querying resource estimator for oversubscribable resources
I0310 03:13:37.011906 16157 slave.cpp:5760] Received oversubscribable resources {} from the resource estimator
I0310 03:13:37.014111 16156 process.cpp:3705] Handling HTTP event for process 'slave(709)' with path: '/slave(709)/monitor/statistics.json'
I0310 03:13:37.015422 16167 http.cpp:916] Authorizing principal 'test-principal' to GET the '/monitor/statistics.json' endpoint
I0310 03:13:37.017426 16154 slave.cpp:808] Agent terminating
[ OK ] Endpoint/SlaveEndpointTest.UnauthorizedRequest/1 (27 ms)
[ RUN ] Endpoint/SlaveEndpointTest.UnauthorizedRequest/2
I0310 03:13:37.028187 1004 containerizer.cpp:221] Using isolation: posix/cpu,posix/mem,filesystem/posix,network/cni
W0310 03:13:37.028645 1004 backend.cpp:76] Failed to create 'aufs' backend: AufsBackend requires root privileges
W0310 03:13:37.028759 1004 backend.cpp:76] Failed to create 'bind' backend: BindBackend requires root privileges
I0310 03:13:37.028800 1004 provisioner.cpp:249] Using default backend 'copy'
I0310 03:13:37.031563 16162 slave.cpp:215] Mesos agent started on (710)@172.17.0.3:56313
I0310 03:13:37.031673 16162 slave.cpp:216] Flags at startup: --acls="" --appc_simple_discovery_uri_prefix="http://" --appc_store_dir="/tmp/mesos/store/appc" --authenticate_http_readonly="true" --authenticate_http_readwrite="true" --authenticatee="crammd5" --authentication_backoff_factor="1secs" --authorizer="local" --cgroups_cpu_enable_pids_and_tids_count="false" --cgroups_enable_cfs="false" --cgroups_hierarchy="/sys/fs/cgroup" --cgroups_limit_swap="false" --cgroups_root="mesos" --container_disk_watch_interval="15secs" --containerizers="mesos" --credential="/tmp/Endpoint_SlaveEndpointTest_UnauthorizedRequest_2_jPr2PF/credential" --default_role="*" --disk_watch_interval="1mins" --docker="docker" --docker_kill_orphans="true" --docker_registry="https://registry-1.docker.io" --docker_remove_delay="6hrs" --docker_socket="/var/run/docker.sock" --docker_stop_timeout="0ns" --docker_store_dir="/tmp/mesos/store/docker" --docker_volume_checkpoint_dir="/var/run/mesos/isolators/docker/volume" --enforce_container_disk_quota="false" --executor_registration_timeout="1mins" --executor_shutdown_grace_period="5secs" --fetcher_cache_dir="/tmp/Endpoint_SlaveEndpointTest_UnauthorizedRequest_2_jPr2PF/fetch" --fetcher_cache_size="2GB" --frameworks_home="" --gc_delay="1weeks" --gc_disk_headroom="0.1" --hadoop_home="" --help="false" --hostname_lookup="true" --http_authenticators="basic" --http_command_executor="false" --http_credentials="/tmp/Endpoint_SlaveEndpointTest_UnauthorizedRequest_2_jPr2PF/http_credentials" --http_heartbeat_interval="30secs" --initialize_driver_logging="true" --isolation="posix/cpu,posix/mem" --launcher="posix" --launcher_dir="/mesos/mesos-1.3.0/_build/src" --logbufsecs="0" --logging_level="INFO" --max_completed_executors_per_framework="150" --oversubscribed_resources_interval="15secs" --perf_duration="10secs" --perf_interval="1mins" --qos_correction_interval_min="0ns" --quiet="false" --recover="reconnect" --recovery_timeout="15mins" --registration_backoff_factor="10ms" --resources="cpus:2;gpus:0;mem:1024;disk:1024;ports:[31000-32000]" --revocable_cpu_low_priority="true" --runtime_dir="/tmp/Endpoint_SlaveEndpointTest_UnauthorizedRequest_2_jPr2PF" --sandbox_directory="/mnt/mesos/sandbox" --strict="true" --switch_user="true" --systemd_enable_support="true" --systemd_runtime_directory="/run/systemd/system" --version="false" --work_dir="/tmp/Endpoint_SlaveEndpointTest_UnauthorizedRequest_2_lSv9Ye"
I0310 03:13:37.032186 16162 credentials.hpp:86] Loading credential for authentication from '/tmp/Endpoint_SlaveEndpointTest_UnauthorizedRequest_2_jPr2PF/credential'
I0310 03:13:37.032344 16162 slave.cpp:358] Agent using credential for: test-principal
I0310 03:13:37.032366 16162 credentials.hpp:37] Loading credentials for authentication from '/tmp/Endpoint_SlaveEndpointTest_UnauthorizedRequest_2_jPr2PF/http_credentials'
I0310 03:13:37.032589 16162 http.cpp:964] Using default 'basic' HTTP authenticator for realm 'mesos-agent-readonly'
I0310 03:13:37.032723 16162 http.cpp:964] Using default 'basic' HTTP authenticator for realm 'mesos-agent-readwrite'
I0310 03:13:37.033903 16162 slave.cpp:545] Agent resources: cpus(*):2; mem(*):1024; disk(*):1024; ports(*):[31000-32000]
I0310 03:13:37.033984 16162 slave.cpp:553] Agent attributes: [ ]
I0310 03:13:37.033995 16162 slave.cpp:558] Agent hostname: 09917613becd
I0310 03:13:37.034126 16159 status_update_manager.cpp:177] Pausing sending status updates
I0310 03:13:37.035377 16166 state.cpp:62] Recovering state from '/tmp/Endpoint_SlaveEndpointTest_UnauthorizedRequest_2_lSv9Ye/meta'
I0310 03:13:37.035640 16161 status_update_manager.cpp:203] Recovering status update manager
I0310 03:13:37.035923 16161 containerizer.cpp:600] Recovering containerizer
I0310 03:13:37.037328 16160 provisioner.cpp:410] Provisioner recovery complete
I0310 03:13:37.037770 16158 slave.cpp:5564] Finished recovery
I0310 03:13:37.038324 16158 slave.cpp:5746] Querying resource estimator for oversubscribable resources
I0310 03:13:37.038625 16160 slave.cpp:5760] Received oversubscribable resources {} from the resource estimator
I0310 03:13:37.040822 16157 process.cpp:3705] Handling HTTP event for process 'slave(710)' with path: '/slave(710)/containers'
I0310 03:13:37.042459 16165 http.cpp:916] Authorizing principal 'test-principal' to GET the '/containers' endpoint
I0310 03:13:37.044780 16158 slave.cpp:808] Agent terminating
[ OK ] Endpoint/SlaveEndpointTest.UnauthorizedRequest/2 (27 ms)
[ RUN ] Endpoint/SlaveEndpointTest.NoAuthorizer/0
I0310 03:13:37.056730 1004 containerizer.cpp:221] Using isolation: posix/cpu,posix/mem,filesystem/posix,network/cni
W0310 03:13:37.057422 1004 backend.cpp:76] Failed to create 'aufs' backend: AufsBackend requires root privileges
W0310 03:13:37.057551 1004 backend.cpp:76] Failed to create 'bind' backend: BindBackend requires root privileges
I0310 03:13:37.057690 1004 provisioner.cpp:249] Using default backend 'copy'
I0310 03:13:37.059412 1004 cluster.cpp:446] Creating default 'local' authorizer
I0310 03:13:37.061501 16167 slave.cpp:215] Mesos agent started on (711)@172.17.0.3:56313
I0310 03:13:37.061525 16167 slave.cpp:216] Flags at startup: --acls="" --appc_simple_discovery_uri_prefix="http://" --appc_store_dir="/tmp/mesos/store/appc" --authenticate_http_readonly="true" --authenticate_http_readwrite="true" --authenticatee="crammd5" --authentication_backoff_factor="1secs" --authorizer="local" --cgroups_cpu_enable_pids_and_tids_count="false" --cgroups_enable_cfs="false" --cgroups_hierarchy="/sys/fs/cgroup" --cgroups_limit_swap="false" --cgroups_root="mesos" --container_disk_watch_interval="15secs" --containerizers="mesos" --credential="/tmp/Endpoint_SlaveEndpointTest_NoAuthorizer_0_ZzCjup/credential" --default_role="*" --disk_watch_interval="1mins" --docker="docker" --docker_kill_orphans="true" --docker_registry="https://registry-1.docker.io" --docker_remove_delay="6hrs" --docker_socket="/var/run/docker.sock" --docker_stop_timeout="0ns" --docker_store_dir="/tmp/mesos/store/docker" --docker_volume_checkpoint_dir="/var/run/mesos/isolators/docker/volume" --enforce_container_disk_quota="false" --executor_registration_timeout="1mins" --executor_shutdown_grace_period="5secs" --fetcher_cache_dir="/tmp/Endpoint_SlaveEndpointTest_NoAuthorizer_0_ZzCjup/fetch" --fetcher_cache_size="2GB" --frameworks_home="" --gc_delay="1weeks" --gc_disk_headroom="0.1" --hadoop_home="" --help="false" --hostname_lookup="true" --http_authenticators="basic" --http_command_executor="false" --http_credentials="/tmp/Endpoint_SlaveEndpointTest_NoAuthorizer_0_ZzCjup/http_credentials" --http_heartbeat_interval="30secs" --initialize_driver_logging="true" --isolation="posix/cpu,posix/mem" --launcher="posix" --launcher_dir="/mesos/mesos-1.3.0/_build/src" --logbufsecs="0" --logging_level="INFO" --max_completed_executors_per_framework="150" --oversubscribed_resources_interval="15secs" --perf_duration="10secs" --perf_interval="1mins" --qos_correction_interval_min="0ns" --quiet="false" --recover="reconnect" --recovery_timeout="15mins" --registration_backoff_factor="10ms" --resources="cpus:2;gpus:0;mem:1024;disk:1024;ports:[31000-32000]" --revocable_cpu_low_priority="true" --runtime_dir="/tmp/Endpoint_SlaveEndpointTest_NoAuthorizer_0_ZzCjup" --sandbox_directory="/mnt/mesos/sandbox" --strict="true" --switch_user="true" --systemd_enable_support="true" --systemd_runtime_directory="/run/systemd/system" --version="false" --work_dir="/tmp/Endpoint_SlaveEndpointTest_NoAuthorizer_0_9cd1yY"
I0310 03:13:37.062201 16167 credentials.hpp:86] Loading credential for authentication from '/tmp/Endpoint_SlaveEndpointTest_NoAuthorizer_0_ZzCjup/credential'
I0310 03:13:37.062391 16167 slave.cpp:358] Agent using credential for: test-principal
I0310 03:13:37.062418 16167 credentials.hpp:37] Loading credentials for authentication from '/tmp/Endpoint_SlaveEndpointTest_NoAuthorizer_0_ZzCjup/http_credentials'
I0310 03:13:37.062672 16167 http.cpp:964] Using default 'basic' HTTP authenticator for realm 'mesos-agent-readonly'
I0310 03:13:37.062819 16167 http.cpp:964] Using default 'basic' HTTP authenticator for realm 'mesos-agent-readwrite'
I0310 03:13:37.063987 16167 slave.cpp:545] Agent resources: cpus(*):2; mem(*):1024; disk(*):1024; ports(*):[31000-32000]
I0310 03:13:37.064070 16167 slave.cpp:553] Agent attributes: [ ]
I0310 03:13:37.064087 16167 slave.cpp:558] Agent hostname: 09917613becd
I0310 03:13:37.064240 16157 status_update_manager.cpp:177] Pausing sending status updates
I0310 03:13:37.065623 16163 state.cpp:62] Recovering state from '/tmp/Endpoint_SlaveEndpointTest_NoAuthorizer_0_9cd1yY/meta'
I0310 03:13:37.065935 16165 status_update_manager.cpp:203] Recovering status update manager
I0310 03:13:37.066217 16164 containerizer.cpp:600] Recovering containerizer
I0310 03:13:37.067538 16154 provisioner.cpp:410] Provisioner recovery complete
I0310 03:13:37.067970 16168 slave.cpp:5564] Finished recovery
I0310 03:13:37.068629 16168 slave.cpp:5746] Querying resource estimator for oversubscribable resources
I0310 03:13:37.068900 16157 slave.cpp:5760] Received oversubscribable resources {} from the resource estimator
I0310 03:13:37.071223 16153 process.cpp:3705] Handling HTTP event for process 'slave(711)' with path: '/slave(711)/monitor/statistics'
I0310 03:13:37.072479 16162 http.cpp:916] Authorizing principal 'test-principal' to GET the '/monitor/statistics' endpoint
I0310 03:13:37.075575 16153 slave.cpp:808] Agent terminating
[ OK ] Endpoint/SlaveEndpointTest.NoAuthorizer/0 (30 ms)
[ RUN ] Endpoint/SlaveEndpointTest.NoAuthorizer/1
I0310 03:13:37.087759 1004 containerizer.cpp:221] Using isolation: posix/cpu,posix/mem,filesystem/posix,network/cni
W0310 03:13:37.088471 1004 backend.cpp:76] Failed to create 'aufs' backend: AufsBackend requires root privileges
W0310 03:13:37.088591 1004 backend.cpp:76] Failed to create 'bind' backend: BindBackend requires root privileges
I0310 03:13:37.088635 1004 provisioner.cpp:249] Using default backend 'copy'
I0310 03:13:37.090509 1004 cluster.cpp:446] Creating default 'local' authorizer
I0310 03:13:37.092555 16165 slave.cpp:215] Mesos agent started on (712)@172.17.0.3:56313
I0310 03:13:37.092593 16165 slave.cpp:216] Flags at startup: --acls="" --appc_simple_discovery_uri_prefix="http://" --appc_store_dir="/tmp/mesos/store/appc" --authenticate_http_readonly="true" --authenticate_http_readwrite="true" --authenticatee="crammd5" --authentication_backoff_factor="1secs" --authorizer="local" --cgroups_cpu_enable_pids_and_tids_count="false" --cgroups_enable_cfs="false" --cgroups_hierarchy="/sys/fs/cgroup" --cgroups_limit_swap="false" --cgroups_root="mesos" --container_disk_watch_interval="15secs" --containerizers="mesos" --credential="/tmp/Endpoint_SlaveEndpointTest_NoAuthorizer_1_R8Lys9/credential" --default_role="*" --disk_watch_interval="1mins" --docker="docker" --docker_kill_orphans="true" --docker_registry="https://registry-1.docker.io" --docker_remove_delay="6hrs" --docker_socket="/var/run/docker.sock" --docker_stop_timeout="0ns" --docker_store_dir="/tmp/mesos/store/docker" --docker_volume_checkpoint_dir="/var/run/mesos/isolators/docker/volume" --enforce_container_disk_quota="false" --executor_registration_timeout="1mins" --executor_shutdown_grace_period="5secs" --fetcher_cache_dir="/tmp/Endpoint_SlaveEndpointTest_NoAuthorizer_1_R8Lys9/fetch" --fetcher_cache_size="2GB" --frameworks_home="" --gc_delay="1weeks" --gc_disk_headroom="0.1" --hadoop_home="" --help="false" --hostname_lookup="true" --http_authenticators="basic" --http_command_executor="false" --http_credentials="/tmp/Endpoint_SlaveEndpointTest_NoAuthorizer_1_R8Lys9/http_credentials" --http_heartbeat_interval="30secs" --initialize_driver_logging="true" --isolation="posix/cpu,posix/mem" --launcher="posix" --launcher_dir="/mesos/mesos-1.3.0/_build/src" --logbufsecs="0" --logging_level="INFO" --max_completed_executors_per_framework="150" --oversubscribed_resources_interval="15secs" --perf_duration="10secs" --perf_interval="1mins" --qos_correction_interval_min="0ns" --quiet="false" --recover="reconnect" --recovery_timeout="15mins" --registration_backoff_factor="10ms" --resources="cpus:2;gpus:0;mem:1024;disk:1024;ports:[31000-32000]" --revocable_cpu_low_priority="true" --runtime_dir="/tmp/Endpoint_SlaveEndpointTest_NoAuthorizer_1_R8Lys9" --sandbox_directory="/mnt/mesos/sandbox" --strict="true" --switch_user="true" --systemd_enable_support="true" --systemd_runtime_directory="/run/systemd/system" --version="false" --work_dir="/tmp/Endpoint_SlaveEndpointTest_NoAuthorizer_1_ZiefsI"
I0310 03:13:37.093175 16165 credentials.hpp:86] Loading credential for authentication from '/tmp/Endpoint_SlaveEndpointTest_NoAuthorizer_1_R8Lys9/credential'
I0310 03:13:37.093349 16165 slave.cpp:358] Agent using credential for: test-principal
I0310 03:13:37.093374 16165 credentials.hpp:37] Loading credentials for authentication from '/tmp/Endpoint_SlaveEndpointTest_NoAuthorizer_1_R8Lys9/http_credentials'
I0310 03:13:37.093629 16165 http.cpp:964] Using default 'basic' HTTP authenticator for realm 'mesos-agent-readonly'
I0310 03:13:37.093806 16165 http.cpp:964] Using default 'basic' HTTP authenticator for realm 'mesos-agent-readwrite'
I0310 03:13:37.094992 16165 slave.cpp:545] Agent resources: cpus(*):2; mem(*):1024; disk(*):1024; ports(*):[31000-32000]
I0310 03:13:37.095077 16165 slave.cpp:553] Agent attributes: [ ]
I0310 03:13:37.095096 16165 slave.cpp:558] Agent hostname: 09917613becd
I0310 03:13:37.095216 16157 status_update_manager.cpp:177] Pausing sending status updates
I0310 03:13:37.096529 16161 state.cpp:62] Recovering state from '/tmp/Endpoint_SlaveEndpointTest_NoAuthorizer_1_ZiefsI/meta'
I0310 03:13:37.096937 16167 status_update_manager.cpp:203] Recovering status update manager
I0310 03:13:37.097206 16158 containerizer.cpp:600] Recovering containerizer
I0310 03:13:37.098600 16164 provisioner.cpp:410] Provisioner recovery complete
I0310 03:13:37.099123 16164 slave.cpp:5564] Finished recovery
I0310 03:13:37.099581 16164 slave.cpp:5746] Querying resource estimator for oversubscribable resources
I0310 03:13:37.100154 16164 slave.cpp:5760] Received oversubscribable resources {} from the resource estimator
I0310 03:13:37.102398 16155 process.cpp:3705] Handling HTTP event for process 'slave(712)' with path: '/slave(712)/monitor/statistics.json'
I0310 03:13:37.103821 16156 http.cpp:916] Authorizing principal 'test-principal' to GET the '/monitor/statistics.json' endpoint
I0310 03:13:37.106688 16164 slave.cpp:808] Agent terminating
[ OK ] Endpoint/SlaveEndpointTest.NoAuthorizer/1 (35 ms)
[ RUN ] Endpoint/SlaveEndpointTest.NoAuthorizer/2
I0310 03:13:37.124403 1004 containerizer.cpp:221] Using isolation: posix/cpu,posix/mem,filesystem/posix,network/cni
W0310 03:13:37.125138 1004 backend.cpp:76] Failed to create 'aufs' backend: AufsBackend requires root privileges
W0310 03:13:37.125267 1004 backend.cpp:76] Failed to create 'bind' backend: BindBackend requires root privileges
I0310 03:13:37.125459 1004 provisioner.cpp:249] Using default backend 'copy'
I0310 03:13:37.127316 1004 cluster.cpp:446] Creating default 'local' authorizer
I0310 03:13:37.129665 16164 slave.cpp:215] Mesos agent started on (713)@172.17.0.3:56313
I0310 03:13:37.129691 16164 slave.cpp:216] Flags at startup: --acls="" --appc_simple_discovery_uri_prefix="http://" --appc_store_dir="/tmp/mesos/store/appc" --authenticate_http_readonly="true" --authenticate_http_readwrite="true" --authenticatee="crammd5" --authentication_backoff_factor="1secs" --authorizer="local" --cgroups_cpu_enable_pids_and_tids_count="false" --cgroups_enable_cfs="false" --cgroups_hierarchy="/sys/fs/cgroup" --cgroups_limit_swap="false" --cgroups_root="mesos" --container_disk_watch_interval="15secs" --containerizers="mesos" --credential="/tmp/Endpoint_SlaveEndpointTest_NoAuthorizer_2_z4awNT/credential" --default_role="*" --disk_watch_interval="1mins" --docker="docker" --docker_kill_orphans="true" --docker_registry="https://registry-1.docker.io" --docker_remove_delay="6hrs" --docker_socket="/var/run/docker.sock" --docker_stop_timeout="0ns" --docker_store_dir="/tmp/mesos/store/docker" --docker_volume_checkpoint_dir="/var/run/mesos/isolators/docker/volume" --enforce_container_disk_quota="false" --executor_registration_timeout="1mins" --executor_shutdown_grace_period="5secs" --fetcher_cache_dir="/tmp/Endpoint_SlaveEndpointTest_NoAuthorizer_2_z4awNT/fetch" --fetcher_cache_size="2GB" --frameworks_home="" --gc_delay="1weeks" --gc_disk_headroom="0.1" --hadoop_home="" --help="false" --hostname_lookup="true" --http_authenticators="basic" --http_command_executor="false" --http_credentials="/tmp/Endpoint_SlaveEndpointTest_NoAuthorizer_2_z4awNT/http_credentials" --http_heartbeat_interval="30secs" --initialize_driver_logging="true" --isolation="posix/cpu,posix/mem" --launcher="posix" --launcher_dir="/mesos/mesos-1.3.0/_build/src" --logbufsecs="0" --logging_level="INFO" --max_completed_executors_per_framework="150" --oversubscribed_resources_interval="15secs" --perf_duration="10secs" --perf_interval="1mins" --qos_correction_interval_min="0ns" --quiet="false" --recover="reconnect" --recovery_timeout="15mins" --registration_backoff_factor="10ms" --resources="cpus:2;gpus:0;mem:1024;disk:1024;ports:[31000-32000]" --revocable_cpu_low_priority="true" --runtime_dir="/tmp/Endpoint_SlaveEndpointTest_NoAuthorizer_2_z4awNT" --sandbox_directory="/mnt/mesos/sandbox" --strict="true" --switch_user="true" --systemd_enable_support="true" --systemd_runtime_directory="/run/systemd/system" --version="false" --work_dir="/tmp/Endpoint_SlaveEndpointTest_NoAuthorizer_2_9xgiHs"
I0310 03:13:37.130306 16164 credentials.hpp:86] Loading credential for authentication from '/tmp/Endpoint_SlaveEndpointTest_NoAuthorizer_2_z4awNT/credential'
I0310 03:13:37.130508 16164 slave.cpp:358] Agent using credential for: test-principal
I0310 03:13:37.130533 16164 credentials.hpp:37] Loading credentials for authentication from '/tmp/Endpoint_SlaveEndpointTest_NoAuthorizer_2_z4awNT/http_credentials'
I0310 03:13:37.130826 16164 http.cpp:964] Using default 'basic' HTTP authenticator for realm 'mesos-agent-readonly'
I0310 03:13:37.130971 16164 http.cpp:964] Using default 'basic' HTTP authenticator for realm 'mesos-agent-readwrite'
I0310 03:13:37.132084 16164 slave.cpp:545] Agent resources: cpus(*):2; mem(*):1024; disk(*):1024; ports(*):[31000-32000]
I0310 03:13:37.132169 16164 slave.cpp:553] Agent attributes: [ ]
I0310 03:13:37.132186 16164 slave.cpp:558] Agent hostname: 09917613becd
I0310 03:13:37.133721 16164 status_update_manager.cpp:177] Pausing sending status updates
I0310 03:13:37.134351 16160 state.cpp:62] Recovering state from '/tmp/Endpoint_SlaveEndpointTest_NoAuthorizer_2_9xgiHs/meta'
I0310 03:13:37.134649 16156 status_update_manager.cpp:203] Recovering status update manager
I0310 03:13:37.134915 16166 containerizer.cpp:600] Recovering containerizer
I0310 03:13:37.136557 16154 provisioner.cpp:410] Provisioner recovery complete
I0310 03:13:37.136916 16164 slave.cpp:5564] Finished recovery
I0310 03:13:37.137555 16164 slave.cpp:5746] Querying resource estimator for oversubscribable resources
I0310 03:13:37.137934 16154 slave.cpp:5760] Received oversubscribable resources {} from the resource estimator
I0310 03:13:37.140087 16162 process.cpp:3705] Handling HTTP event for process 'slave(713)' with path: '/slave(713)/containers'
I0310 03:13:37.141415 16162 http.cpp:916] Authorizing principal 'test-principal' to GET the '/containers' endpoint
I0310 03:13:37.144837 16158 slave.cpp:808] Agent terminating
[ OK ] Endpoint/SlaveEndpointTest.NoAuthorizer/2 (33 ms)
[----------] 9 tests from Endpoint/SlaveEndpointTest (280 ms total)
[----------] Global test environment tear-down
[==========] 1511 tests from 168 test cases ran. (483168 ms total)
[ PASSED ] 1510 tests.
[ FAILED ] 1 test, listed below:
[ FAILED ] SlaveRecoveryTest/0.ReconnectExecutor, where TypeParam = mesos::internal::slave::MesosContainerizer
1 FAILED TEST
YOU HAVE 12 DISABLED TESTS
make[4]: *** [check-local] Error 1
make[4]: Leaving directory `/mesos/mesos-1.3.0/_build/src'
make[3]: *** [check-am] Error 2
make[3]: Leaving directory `/mesos/mesos-1.3.0/_build/src'
make[2]: *** [check] Error 2
make[2]: Leaving directory `/mesos/mesos-1.3.0/_build/src'
make[1]: *** [check-recursive] Error 1
make[1]: Leaving directory `/mesos/mesos-1.3.0/_build'
make: *** [distcheck] Error 1
+ docker rmi mesos-1489113041-28488
Untagged: mesos-1489113041-28488:latest
Deleted: sha256:e84c9da69f22fba246e32e7002e06976c747d7f1aa7524897378753af054e03b
Deleted: sha256:8445f05fa720565ec6ff1290da41c7abdb81c5f38d47152cfbcac8a9f6c6e08f
Deleted: sha256:a04ddc1c0c3f2ef76bc5945a5777dc50e2269613d72ee748b239ca46dfcc3c9e
Deleted: sha256:96e3bd6da10f5b3e52ceacc10d348d846fa48ee6275fa7e234a6bf39a7d5b4a5
Deleted: sha256:22f9f879695755984f3f3707acaee236c9642db58b7ccd34f34ff439d544e221
Deleted: sha256:7d5111b45ef2a95ef2817bdb707dacc9afc472c8c546b4ad8d42c0c6211e0c8a
Deleted: sha256:51c397e52b34c9addedf45ade1c7cdefc4041d74eb6dcdab7bea8608e486508e
Deleted: sha256:184b2b7242f505d4cdc6a1adb0170f2ce1a7b647ee391d1923df2e67ed645c8c
Deleted: sha256:42df5f0c59fe8d64466432b9925a5feb060a6e2094d402cd71502e80ce39f2b6
Deleted: sha256:7bf4c2e494dfd9bd62242e28feadd92051f617326d646daee42dcf34139edecf
Deleted: sha256:b246853a0408fdd1ffce6a245723615d97933cf43d53f0768f48e103444b79d3
Deleted: sha256:792f9cc7937f36e4d874049dfbdb825071454c95ac99520fa53c5430ae871a3d
Deleted: sha256:affe614cfb3f567c2467c254c5f0a6e772967fb9956b3d40cb85639456257c7d
Deleted: sha256:132a5072fd42c629705d57f15571c90bf7e288f1abcb3c9caa6ce5e96121246b
Deleted: sha256:1a93acb6900e284164b5bd0ca5ef04a54162eae6fa087439492518412ea76ee4
Deleted: sha256:f38c69271183eb0006b405daeea3900dcf34a2639c59c36ca71b568114bf1222
Deleted: sha256:9b373558b361c4b7b9a7d120ab8466582246cfa8b8b8944438875e06ee8cb581
Deleted: sha256:2cf8e8bb2ea17fcf7ac226d8dc50c8e597fbd799c2f45d560f46ef5a91e45ffc
Deleted: sha256:13b835833444d0882ddc5c820a891be4568bb6f7a9f4e780b4a78b8e3436cc1a
Deleted: sha256:84420fcba39844a8071ee6628322ee1bcaae4710d5edf00ff4965e5141ef167c
Deleted: sha256:4ff2760c0f09187f9659826df8e9a95b57fb9c70fe5593fddef65e9a494fe816
Deleted: sha256:ef48a5c89dba530ee0818f5427f72306eb082bc97a527c18429ba1ab3c2e57ac
Deleted: sha256:8fa790448f0ef6db4806b339b54da161ad305bfe6e1b84958665455053da313e
Deleted: sha256:4da65ece955f0fcaad72f793b17a164de4e7d39fa60eaba3d3b9119168f70aa5
Deleted: sha256:1e461b2170b4695bba5e8c9db59114302b21bb1f1886a4f46deb12dd629b3670
Build step 'Execute shell' marked build as failure