You are viewing a plain text version of this content. The canonical link for it is here.
Posted to builds@beam.apache.org by Apache Jenkins Server <je...@builds.apache.org> on 2018/12/04 18:03:33 UTC
Build failed in Jenkins: beam_PostCommit_Python_VR_Flink #952
See <https://builds.apache.org/job/beam_PostCommit_Python_VR_Flink/952/display/redirect>
------------------------------------------
[...truncated 244.88 KB...]
Skip updating github.com/pierrec/xxHash#a0006b13c722f7f12368c00a3d3c2ae8a999a0c6 in /home/jenkins/.gradle/go/repo/github.com/pierrec/xxHash/0aff276981c744f632693880472ff35f.
Skip updating github.com/pkg/errors#30136e27e2ac8d167177e8a583aa4c3fea5be833 in /home/jenkins/.gradle/go/repo/github.com/pkg/errors/2e4e7e2f9086007efa2e7bd2b4aac96d.
Skip updating github.com/pkg/sftp#22e9c1ccc02fc1b9fa3264572e49109b68a86947 in /home/jenkins/.gradle/go/repo/github.com/pkg/sftp/a97d32b473b1b771dd73590d425c6efa.
Skip updating github.com/prometheus/client_golang#9bb6ab929dcbe1c8393cd9ef70387cb69811bd1c in /home/jenkins/.gradle/go/repo/github.com/prometheus/client_golang/e47e9fc2682ee532aab4f916e0ba7067.
Skip updating github.com/coreos/etcd#11214aa33bf5a47d3d9d8dafe0f6b97237dfe921 in /home/jenkins/.gradle/go/repo/github.com/coreos/etcd/e07ad470c42c48737a8fdaa60abf6316.
Skip updating github.com/coreos/etcd#11214aa33bf5a47d3d9d8dafe0f6b97237dfe921 in /home/jenkins/.gradle/go/repo/github.com/coreos/etcd/e07ad470c42c48737a8fdaa60abf6316.
Skip updating github.com/prometheus/procfs#cb4147076ac75738c9a7d279075a253c0cc5acbd in /home/jenkins/.gradle/go/repo/github.com/prometheus/procfs/520728c921fed5d680688350f35d5741.
Skip updating github.com/rcrowley/go-metrics#8732c616f52954686704c8645fe1a9d59e9df7c1 in /home/jenkins/.gradle/go/repo/github.com/rcrowley/go-metrics/f0d8dabece2ef254f6ec08366c62d08e.
Skip updating github.com/cpuguy83/go-md2man#dc9f53734905c233adfc09fd4f063dce63ce3daf in /home/jenkins/.gradle/go/repo/github.com/cpuguy83/go-md2man/12e5b04f5fe32bdd05573f005036f2c6.
Skip updating github.com/cpuguy83/go-md2man#dc9f53734905c233adfc09fd4f063dce63ce3daf in /home/jenkins/.gradle/go/repo/github.com/cpuguy83/go-md2man/12e5b04f5fe32bdd05573f005036f2c6.
Skip updating github.com/coreos/etcd#11214aa33bf5a47d3d9d8dafe0f6b97237dfe921 in /home/jenkins/.gradle/go/repo/github.com/coreos/etcd/e07ad470c42c48737a8fdaa60abf6316.
Skip updating github.com/coreos/etcd#11214aa33bf5a47d3d9d8dafe0f6b97237dfe921 in /home/jenkins/.gradle/go/repo/github.com/coreos/etcd/e07ad470c42c48737a8fdaa60abf6316.
Skip updating github.com/spf13/afero#bb8f1927f2a9d3ab41c9340aa034f6b803f4359c in /home/jenkins/.gradle/go/repo/github.com/spf13/afero/0d5b43f5d5a0d64c660c5f7f85c69eba.
Skip updating github.com/spf13/cast#acbeb36b902d72a7a4c18e8f3241075e7ab763e4 in /home/jenkins/.gradle/go/repo/github.com/spf13/cast/517542251c45d58331ec1dd452bb121b.
Skip updating github.com/spf13/cobra#93959269ad99e80983c9ba742a7e01203a4c0e4f in /home/jenkins/.gradle/go/repo/github.com/spf13/cobra/e71e66962e88c28e97f1d24435dc7be4.
Skip updating github.com/spf13/jwalterweatherman#7c0cea34c8ece3fbeb2b27ab9b59511d360fb394 in /home/jenkins/.gradle/go/repo/github.com/spf13/jwalterweatherman/330c1f6608327a4a7166e17f6e499144.
Skip updating github.com/coreos/etcd#11214aa33bf5a47d3d9d8dafe0f6b97237dfe921 in /home/jenkins/.gradle/go/repo/github.com/coreos/etcd/e07ad470c42c48737a8fdaa60abf6316.
Skip updating github.com/spf13/viper#aafc9e6bc7b7bb53ddaa75a5ef49a17d6e654be5 in /home/jenkins/.gradle/go/repo/github.com/spf13/viper/0646b428d96e964862ed970f8f3b1b0d.
Skip updating github.com/stathat/go#74669b9f388d9d788c97399a0824adbfee78400e in /home/jenkins/.gradle/go/repo/github.com/stathat/go/50bfc833dbb8ee4dc51ab0c7cc9cdadc.
Skip updating github.com/coreos/etcd#11214aa33bf5a47d3d9d8dafe0f6b97237dfe921 in /home/jenkins/.gradle/go/repo/github.com/coreos/etcd/e07ad470c42c48737a8fdaa60abf6316.
Skip updating github.com/coreos/etcd#11214aa33bf5a47d3d9d8dafe0f6b97237dfe921 in /home/jenkins/.gradle/go/repo/github.com/coreos/etcd/e07ad470c42c48737a8fdaa60abf6316.
Skip updating github.com/coreos/etcd#11214aa33bf5a47d3d9d8dafe0f6b97237dfe921 in /home/jenkins/.gradle/go/repo/github.com/coreos/etcd/e07ad470c42c48737a8fdaa60abf6316.
Skip updating github.com/coreos/etcd#11214aa33bf5a47d3d9d8dafe0f6b97237dfe921 in /home/jenkins/.gradle/go/repo/github.com/coreos/etcd/e07ad470c42c48737a8fdaa60abf6316.
Skip updating github.com/xordataexchange/crypt#b2862e3d0a775f18c7cfe02273500ae307b61218 in /home/jenkins/.gradle/go/repo/github.com/xordataexchange/crypt/8e109341273400bea10f5f0413dcdd9f.
Skip updating go.opencensus.io#aa2b39d1618ef56ba156f27cfcdae9042f68f0bc in /home/jenkins/.gradle/go/repo/go.opencensus.io/fec515add58c7d1c6457c89d887bb2cd.
Skip updating golang.org/x/crypto#d9133f5469342136e669e85192a26056b587f503 in /home/jenkins/.gradle/go/repo/golang.org/x/crypto/2aba65426fb5ce67509b4db7a8dec732.
Skip updating golang.org/x/debug#95515998a8a4bd7448134b2cb5971dbeb12e0b77 in /home/jenkins/.gradle/go/repo/golang.org/x/debug/9043712fb350d6971269000e35dcbfbe.
Skip updating golang.org/x/net#2fb46b16b8dda405028c50f7c7f0f9dd1fa6bfb1 in /home/jenkins/.gradle/go/repo/golang.org/x/net/f47324d5ea8156d76c2bbb6ec5ebfdb6.
Skip updating golang.org/x/oauth2#a032972e28060ca4f5644acffae3dfc268cc09db in /home/jenkins/.gradle/go/repo/golang.org/x/oauth2/b0090736c2a63258c64df39f8d8a4b28.
Skip updating golang.org/x/sync#fd80eb99c8f653c847d294a001bdf2a3a6f768f5 in /home/jenkins/.gradle/go/repo/golang.org/x/sync/bb244395f28c52df3e99060750ebb26d.
Skip updating golang.org/x/sys#37707fdb30a5b38865cfb95e5aab41707daec7fd in /home/jenkins/.gradle/go/repo/golang.org/x/sys/c019fea3f060e6ac3a7ba229face9b20.
Skip updating github.com/coreos/etcd#11214aa33bf5a47d3d9d8dafe0f6b97237dfe921 in /home/jenkins/.gradle/go/repo/github.com/coreos/etcd/e07ad470c42c48737a8fdaa60abf6316.
Skip updating github.com/coreos/etcd#11214aa33bf5a47d3d9d8dafe0f6b97237dfe921 in /home/jenkins/.gradle/go/repo/github.com/coreos/etcd/e07ad470c42c48737a8fdaa60abf6316.
Skip updating google.golang.org/api#386d4e5f4f92f86e6aec85985761bba4b938a2d5 in /home/jenkins/.gradle/go/repo/google.golang.org/api/e28049fb85a1109eef37826e4bbdd908.
Skip updating google.golang.org/genproto#2b5a72b8730b0b16380010cfe5286c42108d88e7 in /home/jenkins/.gradle/go/repo/google.golang.org/genproto/d671e773e8f05b7375b87bbe0b61b2ce.
Skip updating google.golang.org/grpc#7646b5360d049a7ca31e9133315db43456f39e2e in /home/jenkins/.gradle/go/repo/google.golang.org/grpc/f8a4497e5e07f775c7d9e343b98b7521.
Skip updating github.com/coreos/etcd#11214aa33bf5a47d3d9d8dafe0f6b97237dfe921 in /home/jenkins/.gradle/go/repo/github.com/coreos/etcd/e07ad470c42c48737a8fdaa60abf6316.
Skip updating github.com/coreos/etcd#11214aa33bf5a47d3d9d8dafe0f6b97237dfe921 in /home/jenkins/.gradle/go/repo/github.com/coreos/etcd/e07ad470c42c48737a8fdaa60abf6316.
:beam-sdks-go:installDependencies (Thread[Task worker for ':' Thread 8,5,main]) completed. Took 2.244 secs.
:beam-sdks-go:buildLinuxAmd64 (Thread[Task worker for ':' Thread 8,5,main]) started.
> Task :beam-sdks-go:buildLinuxAmd64
Caching disabled for task ':beam-sdks-go:buildLinuxAmd64': Caching has not been enabled for the task
Task ':beam-sdks-go:buildLinuxAmd64' is not up-to-date because:
Task has not declared any outputs despite executing actions.
> Task :beam-runners-java-fn-execution:compileJava
Created classpath snapshot for incremental compilation in 4.73 secs. 27100 duplicate classes found in classpath (see all with --debug).
Packing task ':beam-runners-java-fn-execution:compileJava'
:beam-runners-java-fn-execution:compileJava (Thread[Task worker for ':' Thread 11,5,main]) completed. Took 15.465 secs.
:beam-runners-java-fn-execution:classes (Thread[Task worker for ':' Thread 11,5,main]) started.
> Task :beam-runners-java-fn-execution:classes
Skipping task ':beam-runners-java-fn-execution:classes' as it has no actions.
:beam-runners-java-fn-execution:classes (Thread[Task worker for ':' Thread 11,5,main]) completed. Took 0.0 secs.
:beam-runners-java-fn-execution:shadowJar (Thread[Task worker for ':' Thread 11,5,main]) started.
> Task :beam-runners-java-fn-execution:shadowJar
Build cache key for task ':beam-runners-java-fn-execution:shadowJar' is f9679f92f31903c9d8d9c13896e44d98
Caching disabled for task ':beam-runners-java-fn-execution:shadowJar': Caching has not been enabled for the task
Task ':beam-runners-java-fn-execution:shadowJar' is not up-to-date because:
No history is available.
*******************
GRADLE SHADOW STATS
Total Jars: 2 (includes project)
Total Time: 2.331s [2331ms]
Average Time/Jar: 1.1655s [1165.5ms]
*******************
:beam-runners-java-fn-execution:shadowJar (Thread[Task worker for ':' Thread 11,5,main]) completed. Took 2.519 secs.
:beam-runners-flink_2.11:compileJava (Thread[Task worker for ':' Thread 11,5,main]) started.
> Task :beam-runners-flink_2.11:compileJava
Build cache key for task ':beam-runners-flink_2.11:compileJava' is 3ca989b0ff125e4222ec78903e0337da
Task ':beam-runners-flink_2.11:compileJava' is not up-to-date because:
No history is available.
Custom actions are attached to task ':beam-runners-flink_2.11:compileJava'.
All input files are considered out-of-date for incremental task ':beam-runners-flink_2.11:compileJava'.
Full recompilation is required because no incremental change information is available. This is usually caused by clean builds or changing compiler arguments.
Compiling with error-prone compiler
:beam-sdks-go:buildLinuxAmd64 (Thread[Task worker for ':' Thread 8,5,main]) completed. Took 10.318 secs.
:beam-sdks-go:build (Thread[Task worker for ':' Thread 8,5,main]) started.
> Task :beam-sdks-go:build
Caching disabled for task ':beam-sdks-go:build': Caching has not been enabled for the task
Task ':beam-sdks-go:build' is not up-to-date because:
Task has not declared any outputs despite executing actions.
:beam-sdks-go:build (Thread[Task worker for ':' Thread 8,5,main]) completed. Took 0.0 secs.
:beam-sdks-python-container:resolveBuildDependencies (Thread[Task worker for ':' Thread 8,5,main]) started.
> Task :beam-sdks-python-container:resolveBuildDependencies
Build cache key for task ':beam-sdks-python-container:resolveBuildDependencies' is ba05aa9a7d4b28ed4cee6d22b6a57b7e
Caching disabled for task ':beam-sdks-python-container:resolveBuildDependencies': Caching has not been enabled for the task
Task ':beam-sdks-python-container:resolveBuildDependencies' is not up-to-date because:
No history is available.
Cache <https://builds.apache.org/job/beam_PostCommit_Python_VR_Flink/ws/src/sdks/python/container/.gogradle/cache/PersistenceNotationToResolvedCache-0.10.bin> not found, skip.
Cache <https://builds.apache.org/job/beam_PostCommit_Python_VR_Flink/ws/src/sdks/python/container/.gogradle/cache/PersistenceResolvedToDependenciesCache-0.10.bin> not found, skip.
Resolving ./github.com/apache/beam/sdks/go@<https://builds.apache.org/job/beam_PostCommit_Python_VR_Flink/ws/src/sdks/go>
:beam-sdks-python-container:resolveBuildDependencies (Thread[Task worker for ':' Thread 8,5,main]) completed. Took 0.447 secs.
:beam-sdks-python-container:installDependencies (Thread[Task worker for ':' Thread 8,5,main]) started.
> Task :beam-sdks-python-container:installDependencies
Caching disabled for task ':beam-sdks-python-container:installDependencies': Caching has not been enabled for the task
Task ':beam-sdks-python-container:installDependencies' is not up-to-date because:
Task has not declared any outputs despite executing actions.
Cache <https://builds.apache.org/job/beam_PostCommit_Python_VR_Flink/ws/src/sdks/python/container/.gogradle/cache/VendorSnapshot-0.10.bin> not found, skip.
:beam-sdks-python-container:installDependencies (Thread[Task worker for ':' Thread 8,5,main]) completed. Took 0.764 secs.
:beam-sdks-python-container:buildDarwinAmd64 (Thread[Task worker for ':' Thread 8,5,main]) started.
> Task :beam-sdks-python-container:buildDarwinAmd64
Build cache key for task ':beam-sdks-python-container:buildDarwinAmd64' is 59950f0384bfc0a0edaf79b15f017de7
Caching disabled for task ':beam-sdks-python-container:buildDarwinAmd64': Caching has not been enabled for the task
Task ':beam-sdks-python-container:buildDarwinAmd64' is not up-to-date because:
No history is available.
> Task :beam-runners-flink_2.11:compileJava
Note: Some input files use or override a deprecated API.
Note: Recompile with -Xlint:deprecation for details.
Note: Some input files use unchecked or unsafe operations.
Note: Recompile with -Xlint:unchecked for details.
Created classpath snapshot for incremental compilation in 0.563 secs. 1853 duplicate classes found in classpath (see all with --debug).
Packing task ':beam-runners-flink_2.11:compileJava'
:beam-runners-flink_2.11:compileJava (Thread[Task worker for ':' Thread 11,5,main]) completed. Took 9.999 secs.
:beam-runners-flink_2.11:classes (Thread[Task worker for ':' Thread 11,5,main]) started.
> Task :beam-runners-flink_2.11:classes
Skipping task ':beam-runners-flink_2.11:classes' as it has no actions.
:beam-runners-flink_2.11:classes (Thread[Task worker for ':' Thread 11,5,main]) completed. Took 0.0 secs.
:beam-runners-flink_2.11:shadowJar (Thread[Task worker for ':' Thread 11,5,main]) started.
:beam-sdks-python-container:buildDarwinAmd64 (Thread[Task worker for ':' Thread 8,5,main]) completed. Took 5.261 secs.
:beam-sdks-python-container:buildLinuxAmd64 (Thread[Task worker for ':' Thread 8,5,main]) started.
> Task :beam-runners-flink_2.11:shadowJar
Build cache key for task ':beam-runners-flink_2.11:shadowJar' is 22c24d07ebc73c85ace4438e58397e89
Caching disabled for task ':beam-runners-flink_2.11:shadowJar': Caching has not been enabled for the task
Task ':beam-runners-flink_2.11:shadowJar' is not up-to-date because:
No history is available.
*******************
GRADLE SHADOW STATS
Total Jars: 2 (includes project)
Total Time: 1.958s [1958ms]
Average Time/Jar: 0.979s [979.0ms]
*******************
:beam-runners-flink_2.11:shadowJar (Thread[Task worker for ':' Thread 11,5,main]) completed. Took 2.329 secs.
:beam-runners-flink_2.11-job-server:compileJava (Thread[Task worker for ':' Thread 11,5,main]) started.
> Task :beam-runners-flink_2.11-job-server:compileJava NO-SOURCE
file or directory '<https://builds.apache.org/job/beam_PostCommit_Python_VR_Flink/ws/src/runners/flink/job-server/src/main/java',> not found
Skipping task ':beam-runners-flink_2.11-job-server:compileJava' as it has no source files and no previous output files.
:beam-runners-flink_2.11-job-server:compileJava (Thread[Task worker for ':' Thread 11,5,main]) completed. Took 0.001 secs.
:beam-runners-flink_2.11-job-server:classes (Thread[Task worker for ':' Thread 11,5,main]) started.
> Task :beam-runners-flink_2.11-job-server:classes UP-TO-DATE
Skipping task ':beam-runners-flink_2.11-job-server:classes' as it has no actions.
:beam-runners-flink_2.11-job-server:classes (Thread[Task worker for ':' Thread 11,5,main]) completed. Took 0.0 secs.
:beam-runners-flink_2.11-job-server:shadowJar (Thread[Task worker for ':' Thread 11,5,main]) started.
> Task :beam-sdks-python-container:buildLinuxAmd64
Build cache key for task ':beam-sdks-python-container:buildLinuxAmd64' is 0487bde8878a7f25dcde0365873231cc
Caching disabled for task ':beam-sdks-python-container:buildLinuxAmd64': Caching has not been enabled for the task
Task ':beam-sdks-python-container:buildLinuxAmd64' is not up-to-date because:
No history is available.
:beam-sdks-python-container:buildLinuxAmd64 (Thread[Task worker for ':' Thread 8,5,main]) completed. Took 3.767 secs.
:beam-sdks-python-container:build (Thread[Task worker for ':' Thread 8,5,main]) started.
> Task :beam-sdks-python-container:build
Caching disabled for task ':beam-sdks-python-container:build': Caching has not been enabled for the task
Task ':beam-sdks-python-container:build' is not up-to-date because:
Task has not declared any outputs despite executing actions.
:beam-sdks-python-container:build (Thread[Task worker for ':' Thread 8,5,main]) completed. Took 0.0 secs.
:beam-sdks-python-container:copyDockerfileDependencies (Thread[Task worker for ':' Thread 8,5,main]) started.
> Task :beam-sdks-python-container:copyDockerfileDependencies
Build cache key for task ':beam-sdks-python-container:copyDockerfileDependencies' is 96137b923ca0b0e92700ac40ca4332dd
Caching disabled for task ':beam-sdks-python-container:copyDockerfileDependencies': Caching has not been enabled for the task
Task ':beam-sdks-python-container:copyDockerfileDependencies' is not up-to-date because:
No history is available.
:beam-sdks-python-container:copyDockerfileDependencies (Thread[Task worker for ':' Thread 8,5,main]) completed. Took 0.03 secs.
:beam-sdks-python-container:dockerPrepare (Thread[Task worker for ':' Thread 8,5,main]) started.
> Task :beam-runners-flink_2.11-job-server:shadowJar
Build cache key for task ':beam-runners-flink_2.11-job-server:shadowJar' is ee2e3b215341bcf7962817116416f442
Caching disabled for task ':beam-runners-flink_2.11-job-server:shadowJar': Caching has not been enabled for the task
Task ':beam-runners-flink_2.11-job-server:shadowJar' is not up-to-date because:
No history is available.
> Task :beam-sdks-python-container:dockerPrepare
Build cache key for task ':beam-sdks-python-container:dockerPrepare' is 0378c34faed3d2ab739813ce11d73c69
Caching disabled for task ':beam-sdks-python-container:dockerPrepare': Caching has not been enabled for the task
Task ':beam-sdks-python-container:dockerPrepare' is not up-to-date because:
No history is available.
:beam-sdks-python-container:dockerPrepare (Thread[Task worker for ':' Thread 8,5,main]) completed. Took 0.173 secs.
:beam-sdks-python-container:docker (Thread[Task worker for ':' Thread 8,5,main]) started.
> Task :beam-sdks-python-container:docker
Caching disabled for task ':beam-sdks-python-container:docker': Caching has not been enabled for the task
Task ':beam-sdks-python-container:docker' is not up-to-date because:
Task has not declared any outputs despite executing actions.
Starting process 'command 'docker''. Working directory: <https://builds.apache.org/job/beam_PostCommit_Python_VR_Flink/ws/src/sdks/python/container/build/docker> Command: docker build --no-cache -t jenkins-docker-apache.bintray.io/beam/python:latest .
Successfully started process 'command 'docker''
Sending build context to Docker daemon 34.51MB
Step 1/9 : FROM python:2-stretch
---> f67e752245d6
Step 2/9 : MAINTAINER "Apache Beam <de...@beam.apache.org>"
---> Running in b293022c6d7e
---> a2ae9d9155ea
Removing intermediate container b293022c6d7e
Step 3/9 : RUN apt-get update && apt-get install -y libsnappy-dev libyaml-dev && rm -rf /var/lib/apt/lists/*
---> Running in 39a25ab094f3
grpc: the connection is unavailable
> Task :beam-sdks-python-container:docker FAILED
:beam-sdks-python-container:docker (Thread[Task worker for ':' Thread 8,5,main]) completed. Took 5.21 secs.
> Task :beam-runners-flink_2.11-job-server:shadowJar
*******************
GRADLE SHADOW STATS
Total Jars: 87 (includes project)
Total Time: 15.431s [15431ms]
Average Time/Jar: 0.177367816092s [177.367816092ms]
*******************
:beam-runners-flink_2.11-job-server:shadowJar (Thread[Task worker for ':' Thread 11,5,main]) completed. Took 16.202 secs.
FAILURE: Build failed with an exception.
* What went wrong:
Execution failed for task ':beam-sdks-python-container:docker'.
> Process 'command 'docker'' finished with non-zero exit value 1
* Try:
Run with --stacktrace option to get the stack trace. Run with --debug option to get more log output. Run with --scan to get full insights.
* Get more help at https://help.gradle.org
Deprecated Gradle features were used in this build, making it incompatible with Gradle 5.0.
Use '--warning-mode all' to show the individual deprecation warnings.
See https://docs.gradle.org/4.10.2/userguide/command_line_interface.html#sec:command_line_warnings
BUILD FAILED in 2m 22s
58 actionable tasks: 53 executed, 4 from cache, 1 up-to-date
Publishing build scan...
https://gradle.com/s/uruzvymjxjrqe
Build step 'Invoke Gradle script' changed build result to FAILURE
Build step 'Invoke Gradle script' marked build as failure
---------------------------------------------------------------------
To unsubscribe, e-mail: builds-unsubscribe@beam.apache.org
For additional commands, e-mail: builds-help@beam.apache.org
Jenkins build is back to normal : beam_PostCommit_Python_VR_Flink
#954
Posted by Apache Jenkins Server <je...@builds.apache.org>.
See <https://builds.apache.org/job/beam_PostCommit_Python_VR_Flink/954/display/redirect>
---------------------------------------------------------------------
To unsubscribe, e-mail: builds-unsubscribe@beam.apache.org
For additional commands, e-mail: builds-help@beam.apache.org
Build failed in Jenkins: beam_PostCommit_Python_VR_Flink #953
Posted by Apache Jenkins Server <je...@builds.apache.org>.
See <https://builds.apache.org/job/beam_PostCommit_Python_VR_Flink/953/display/redirect?page=changes>
Changes:
[heejong] [BEAM-5462] get rid of <pipeline>.options deprecation warnings in tests
------------------------------------------
[...truncated 4.61 MB...]
[flink-akka.actor.default-dispatcher-5] INFO org.apache.flink.runtime.dispatcher.DispatcherRestEndpoint - http://localhost:34105 was granted leadership with leaderSessionID=3f70e9fe-a005-4601-aa88-28223d14fa40
[flink-akka.actor.default-dispatcher-5] INFO org.apache.flink.runtime.highavailability.nonha.embedded.EmbeddedLeaderService - Received confirmation of leadership for leader http://localhost:34105 , session=3f70e9fe-a005-4601-aa88-28223d14fa40
[flink-runner-job-server] INFO org.apache.flink.runtime.rpc.akka.AkkaRpcService - Starting RPC endpoint for org.apache.flink.runtime.dispatcher.StandaloneDispatcher at akka://flink/user/dispatcher2376f3c1-facc-4710-bce8-40e8d0775b58 .
[flink-runner-job-server] INFO org.apache.flink.runtime.highavailability.nonha.embedded.EmbeddedLeaderService - Proposing leadership to contender org.apache.flink.runtime.dispatcher.StandaloneDispatcher@568d619d @ akka://flink/user/dispatcher2376f3c1-facc-4710-bce8-40e8d0775b58
[flink-runner-job-server] INFO org.apache.flink.runtime.minicluster.MiniCluster - Flink Mini Cluster started successfully
[flink-akka.actor.default-dispatcher-2] INFO org.apache.flink.runtime.dispatcher.StandaloneDispatcher - Dispatcher akka://flink/user/dispatcher2376f3c1-facc-4710-bce8-40e8d0775b58 was granted leadership with fencing token ad27b1db-c9d3-4194-98aa-82745688cb1d
[flink-akka.actor.default-dispatcher-3] INFO org.apache.flink.runtime.dispatcher.StandaloneDispatcher - Recovering all persisted jobs.
[flink-akka.actor.default-dispatcher-3] INFO org.apache.flink.runtime.highavailability.nonha.embedded.EmbeddedLeaderService - Received confirmation of leadership for leader akka://flink/user/dispatcher2376f3c1-facc-4710-bce8-40e8d0775b58 , session=ad27b1db-c9d3-4194-98aa-82745688cb1d
[flink-akka.actor.default-dispatcher-2] INFO org.apache.flink.runtime.dispatcher.StandaloneDispatcher - Submitting job 66f36436df570a9219863615b6091948 (test_windowing_1543950891.17).
[flink-akka.actor.default-dispatcher-2] INFO org.apache.flink.runtime.rpc.akka.AkkaRpcService - Starting RPC endpoint for org.apache.flink.runtime.jobmaster.JobMaster at akka://flink/user/jobmanager_43 .
[flink-akka.actor.default-dispatcher-2] INFO org.apache.flink.runtime.jobmaster.JobMaster - Initializing job test_windowing_1543950891.17 (66f36436df570a9219863615b6091948).
[flink-akka.actor.default-dispatcher-2] INFO org.apache.flink.runtime.jobmaster.JobMaster - Using restart strategy NoRestartStrategy for test_windowing_1543950891.17 (66f36436df570a9219863615b6091948).
[flink-akka.actor.default-dispatcher-2] INFO org.apache.flink.runtime.rpc.akka.AkkaRpcService - Starting RPC endpoint for org.apache.flink.runtime.jobmaster.slotpool.SlotPool at akka://flink/user/d5441d75-fa95-4b80-b2f5-6d75bdc627c6 .
[flink-akka.actor.default-dispatcher-2] INFO org.apache.flink.runtime.executiongraph.ExecutionGraph - Job recovers via failover strategy: full graph restart
[flink-akka.actor.default-dispatcher-2] INFO org.apache.flink.runtime.jobmaster.JobMaster - Running initialization on master for job test_windowing_1543950891.17 (66f36436df570a9219863615b6091948).
[flink-akka.actor.default-dispatcher-2] INFO org.apache.flink.runtime.jobmaster.JobMaster - Successfully ran initialization on master in 0 ms.
[flink-akka.actor.default-dispatcher-2] INFO org.apache.flink.runtime.jobmaster.JobMaster - No state backend has been configured, using default (Memory / JobManager) MemoryStateBackend (data in heap memory / checkpoints to JobManager) (checkpoints: 'null', savepoints: 'null', asynchronous: TRUE, maxStateSize: 5242880)
[flink-akka.actor.default-dispatcher-2] INFO org.apache.flink.runtime.highavailability.nonha.embedded.EmbeddedLeaderService - Proposing leadership to contender org.apache.flink.runtime.jobmaster.JobManagerRunner@784f75b2 @ akka://flink/user/jobmanager_43
[flink-akka.actor.default-dispatcher-2] INFO org.apache.flink.runtime.jobmaster.JobManagerRunner - JobManager runner for job test_windowing_1543950891.17 (66f36436df570a9219863615b6091948) was granted leadership with session id 18bafba1-c752-4605-8daf-521c7304e701 at akka://flink/user/jobmanager_43.
[flink-akka.actor.default-dispatcher-3] INFO org.apache.flink.runtime.jobmaster.JobMaster - Starting execution of job test_windowing_1543950891.17 (66f36436df570a9219863615b6091948)
[flink-akka.actor.default-dispatcher-3] INFO org.apache.flink.runtime.executiongraph.ExecutionGraph - Job test_windowing_1543950891.17 (66f36436df570a9219863615b6091948) switched from state CREATED to RUNNING.
[flink-akka.actor.default-dispatcher-3] INFO org.apache.flink.runtime.executiongraph.ExecutionGraph - Source: Impulse -> [3]{Create/FlatMap(<lambda at core.py:2027>), Create/MaybeReshuffle/Reshuffle/AddRandomKeys, Create/MaybeReshuffle/Reshuffle/ReshufflePerKey/Map(reify_timestamps)} -> ToKeyedWorkItem (1/1) (5ef8f8ad93f6cb6647b336589885804d) switched from CREATED to SCHEDULED.
[flink-akka.actor.default-dispatcher-3] INFO org.apache.flink.runtime.executiongraph.ExecutionGraph - Source: Impulse -> [4]{assert_that/Create/FlatMap(<lambda at core.py:2027>), assert_that/Create/Map(decode), assert_that/Group/pair_with_0, assert_that/Group/Flatten} (1/1) (1d98808248288efdaa7dbea9f8055e9b) switched from CREATED to SCHEDULED.
[flink-akka.actor.default-dispatcher-3] INFO org.apache.flink.runtime.executiongraph.ExecutionGraph - Create/MaybeReshuffle/Reshuffle/ReshufflePerKey/GroupByKey -> [5]{Create/MaybeReshuffle/Reshuffle/ReshufflePerKey/FlatMap(restore_timestamps), Create/MaybeReshuffle/Reshuffle/RemoveRandomKeys, Create/Map(decode), Map(<lambda at fn_api_runner_test.py:406>), WindowInto(WindowIntoFn)} -> ToKeyedWorkItem (1/1) (15f44185c98194e06ac4ed10c02851ff) switched from CREATED to SCHEDULED.
[flink-akka.actor.default-dispatcher-3] INFO org.apache.flink.runtime.executiongraph.ExecutionGraph - GroupByKey -> [5]{Map(<lambda at fn_api_runner_test.py:409>), assert_that/WindowInto(WindowIntoFn), assert_that/ToVoidKey, assert_that/Group/pair_with_1, assert_that/Group/Flatten} (1/1) (a3da6f92063969b00e6e8b46c9914432) switched from CREATED to SCHEDULED.
[flink-akka.actor.default-dispatcher-3] INFO org.apache.flink.runtime.executiongraph.ExecutionGraph - ToKeyedWorkItem (1/1) (a77ad3a3ab42726174b9f6c4a3792161) switched from CREATED to SCHEDULED.
[flink-akka.actor.default-dispatcher-5] INFO org.apache.flink.runtime.jobmaster.slotpool.SlotPool - Cannot serve slot request, no ResourceManager connected. Adding as pending request [SlotRequestId{5e90de8a959b83d6d884d95c98d648a6}]
[flink-akka.actor.default-dispatcher-3] INFO org.apache.flink.runtime.executiongraph.ExecutionGraph - assert_that/Group/GroupByKey -> [3]{assert_that/Group/Map(_merge_tagged_vals_under_key), assert_that/Unkey, assert_that/Match} (1/1) (0f3459b2b7b2a2665e7a1bf4fa7cad51) switched from CREATED to SCHEDULED.
[jobmanager-future-thread-1] INFO org.apache.flink.runtime.highavailability.nonha.embedded.EmbeddedLeaderService - Received confirmation of leadership for leader akka://flink/user/jobmanager_43 , session=18bafba1-c752-4605-8daf-521c7304e701
[flink-akka.actor.default-dispatcher-3] INFO org.apache.flink.runtime.jobmaster.JobMaster - Connecting to ResourceManager akka://flink/user/resourcemanager_43bbdf6a-04a4-4c53-abba-9f4751b14ed4(90b7882ef6e52b1139552971421c4dc9)
[flink-akka.actor.default-dispatcher-5] INFO org.apache.flink.runtime.jobmaster.JobMaster - Resolved ResourceManager address, beginning registration
[flink-akka.actor.default-dispatcher-5] INFO org.apache.flink.runtime.jobmaster.JobMaster - Registration at ResourceManager attempt 1 (timeout=100ms)
[flink-akka.actor.default-dispatcher-3] INFO org.apache.flink.runtime.resourcemanager.StandaloneResourceManager - Registering job manager 8daf521c7304e70118bafba1c7524605@akka://flink/user/jobmanager_43 for job 66f36436df570a9219863615b6091948.
[flink-akka.actor.default-dispatcher-4] INFO org.apache.flink.runtime.resourcemanager.StandaloneResourceManager - Registered job manager 8daf521c7304e70118bafba1c7524605@akka://flink/user/jobmanager_43 for job 66f36436df570a9219863615b6091948.
[flink-akka.actor.default-dispatcher-4] INFO org.apache.flink.runtime.jobmaster.JobMaster - JobManager successfully registered at ResourceManager, leader id: 90b7882ef6e52b1139552971421c4dc9.
[flink-akka.actor.default-dispatcher-3] INFO org.apache.flink.runtime.jobmaster.slotpool.SlotPool - Requesting new slot [SlotRequestId{5e90de8a959b83d6d884d95c98d648a6}] and profile ResourceProfile{cpuCores=-1.0, heapMemoryInMB=-1, directMemoryInMB=0, nativeMemoryInMB=0, networkMemoryInMB=0} from resource manager.
[flink-akka.actor.default-dispatcher-3] INFO org.apache.flink.runtime.resourcemanager.StandaloneResourceManager - Request slot with profile ResourceProfile{cpuCores=-1.0, heapMemoryInMB=-1, directMemoryInMB=0, nativeMemoryInMB=0, networkMemoryInMB=0} for job 66f36436df570a9219863615b6091948 with allocation id AllocationID{135397f4fe19bc90c5984e1e33662bf3}.
[flink-akka.actor.default-dispatcher-4] INFO org.apache.flink.runtime.taskexecutor.TaskExecutor - Receive slot request AllocationID{135397f4fe19bc90c5984e1e33662bf3} for job 66f36436df570a9219863615b6091948 from resource manager with leader id 90b7882ef6e52b1139552971421c4dc9.
[flink-akka.actor.default-dispatcher-4] INFO org.apache.flink.runtime.taskexecutor.TaskExecutor - Allocated slot for AllocationID{135397f4fe19bc90c5984e1e33662bf3}.
[flink-akka.actor.default-dispatcher-4] INFO org.apache.flink.runtime.taskexecutor.JobLeaderService - Add job 66f36436df570a9219863615b6091948 for job leader monitoring.
[flink-akka.actor.default-dispatcher-4] INFO org.apache.flink.runtime.taskexecutor.JobLeaderService - Try to register at job manager akka://flink/user/jobmanager_43 with leader id 18bafba1-c752-4605-8daf-521c7304e701.
[flink-akka.actor.default-dispatcher-2] INFO org.apache.flink.runtime.taskexecutor.JobLeaderService - Resolved JobManager address, beginning registration
[flink-akka.actor.default-dispatcher-2] INFO org.apache.flink.runtime.taskexecutor.JobLeaderService - Registration at JobManager attempt 1 (timeout=100ms)
[flink-akka.actor.default-dispatcher-5] INFO org.apache.flink.runtime.taskexecutor.JobLeaderService - Successful registration at job manager akka://flink/user/jobmanager_43 for job 66f36436df570a9219863615b6091948.
[flink-akka.actor.default-dispatcher-5] INFO org.apache.flink.runtime.taskexecutor.TaskExecutor - Establish JobManager connection for job 66f36436df570a9219863615b6091948.
[flink-akka.actor.default-dispatcher-5] INFO org.apache.flink.runtime.taskexecutor.TaskExecutor - Offer reserved slots to the leader of job 66f36436df570a9219863615b6091948.
[flink-akka.actor.default-dispatcher-5] INFO org.apache.flink.runtime.taskexecutor.slot.TaskSlotTable - Activate slot AllocationID{135397f4fe19bc90c5984e1e33662bf3}.
[flink-akka.actor.default-dispatcher-5] INFO org.apache.flink.runtime.executiongraph.ExecutionGraph - Source: Impulse -> [4]{assert_that/Create/FlatMap(<lambda at core.py:2027>), assert_that/Create/Map(decode), assert_that/Group/pair_with_0, assert_that/Group/Flatten} (1/1) (1d98808248288efdaa7dbea9f8055e9b) switched from SCHEDULED to DEPLOYING.
[flink-akka.actor.default-dispatcher-5] INFO org.apache.flink.runtime.executiongraph.ExecutionGraph - Deploying Source: Impulse -> [4]{assert_that/Create/FlatMap(<lambda at core.py:2027>), assert_that/Create/Map(decode), assert_that/Group/pair_with_0, assert_that/Group/Flatten} (1/1) (attempt #0) to localhost
[flink-akka.actor.default-dispatcher-5] INFO org.apache.flink.runtime.executiongraph.ExecutionGraph - Source: Impulse -> [3]{Create/FlatMap(<lambda at core.py:2027>), Create/MaybeReshuffle/Reshuffle/AddRandomKeys, Create/MaybeReshuffle/Reshuffle/ReshufflePerKey/Map(reify_timestamps)} -> ToKeyedWorkItem (1/1) (5ef8f8ad93f6cb6647b336589885804d) switched from SCHEDULED to DEPLOYING.
[flink-akka.actor.default-dispatcher-5] INFO org.apache.flink.runtime.executiongraph.ExecutionGraph - Deploying Source: Impulse -> [3]{Create/FlatMap(<lambda at core.py:2027>), Create/MaybeReshuffle/Reshuffle/AddRandomKeys, Create/MaybeReshuffle/Reshuffle/ReshufflePerKey/Map(reify_timestamps)} -> ToKeyedWorkItem (1/1) (attempt #0) to localhost
[flink-akka.actor.default-dispatcher-5] INFO org.apache.flink.runtime.executiongraph.ExecutionGraph - Create/MaybeReshuffle/Reshuffle/ReshufflePerKey/GroupByKey -> [5]{Create/MaybeReshuffle/Reshuffle/ReshufflePerKey/FlatMap(restore_timestamps), Create/MaybeReshuffle/Reshuffle/RemoveRandomKeys, Create/Map(decode), Map(<lambda at fn_api_runner_test.py:406>), WindowInto(WindowIntoFn)} -> ToKeyedWorkItem (1/1) (15f44185c98194e06ac4ed10c02851ff) switched from SCHEDULED to DEPLOYING.
[flink-akka.actor.default-dispatcher-5] INFO org.apache.flink.runtime.executiongraph.ExecutionGraph - Deploying Create/MaybeReshuffle/Reshuffle/ReshufflePerKey/GroupByKey -> [5]{Create/MaybeReshuffle/Reshuffle/ReshufflePerKey/FlatMap(restore_timestamps), Create/MaybeReshuffle/Reshuffle/RemoveRandomKeys, Create/Map(decode), Map(<lambda at fn_api_runner_test.py:406>), WindowInto(WindowIntoFn)} -> ToKeyedWorkItem (1/1) (attempt #0) to localhost
[flink-akka.actor.default-dispatcher-5] INFO org.apache.flink.runtime.executiongraph.ExecutionGraph - GroupByKey -> [5]{Map(<lambda at fn_api_runner_test.py:409>), assert_that/WindowInto(WindowIntoFn), assert_that/ToVoidKey, assert_that/Group/pair_with_1, assert_that/Group/Flatten} (1/1) (a3da6f92063969b00e6e8b46c9914432) switched from SCHEDULED to DEPLOYING.
[flink-akka.actor.default-dispatcher-5] INFO org.apache.flink.runtime.executiongraph.ExecutionGraph - Deploying GroupByKey -> [5]{Map(<lambda at fn_api_runner_test.py:409>), assert_that/WindowInto(WindowIntoFn), assert_that/ToVoidKey, assert_that/Group/pair_with_1, assert_that/Group/Flatten} (1/1) (attempt #0) to localhost
[flink-akka.actor.default-dispatcher-2] INFO org.apache.flink.runtime.taskexecutor.TaskExecutor - Received task Source: Impulse -> [4]{assert_that/Create/FlatMap(<lambda at core.py:2027>), assert_that/Create/Map(decode), assert_that/Group/pair_with_0, assert_that/Group/Flatten} (1/1).
[flink-akka.actor.default-dispatcher-5] INFO org.apache.flink.runtime.executiongraph.ExecutionGraph - ToKeyedWorkItem (1/1) (a77ad3a3ab42726174b9f6c4a3792161) switched from SCHEDULED to DEPLOYING.
[Source: Impulse -> [4]{assert_that/Create/FlatMap(<lambda at core.py:2027>), assert_that/Create/Map(decode), assert_that/Group/pair_with_0, assert_that/Group/Flatten} (1/1)] INFO org.apache.flink.runtime.taskmanager.Task - Source: Impulse -> [4]{assert_that/Create/FlatMap(<lambda at core.py:2027>), assert_that/Create/Map(decode), assert_that/Group/pair_with_0, assert_that/Group/Flatten} (1/1) (1d98808248288efdaa7dbea9f8055e9b) switched from CREATED to DEPLOYING.
[flink-akka.actor.default-dispatcher-5] INFO org.apache.flink.runtime.executiongraph.ExecutionGraph - Deploying ToKeyedWorkItem (1/1) (attempt #0) to localhost
[Source: Impulse -> [4]{assert_that/Create/FlatMap(<lambda at core.py:2027>), assert_that/Create/Map(decode), assert_that/Group/pair_with_0, assert_that/Group/Flatten} (1/1)] INFO org.apache.flink.runtime.taskmanager.Task - Creating FileSystem stream leak safety net for task Source: Impulse -> [4]{assert_that/Create/FlatMap(<lambda at core.py:2027>), assert_that/Create/Map(decode), assert_that/Group/pair_with_0, assert_that/Group/Flatten} (1/1) (1d98808248288efdaa7dbea9f8055e9b) [DEPLOYING]
[flink-akka.actor.default-dispatcher-5] INFO org.apache.flink.runtime.executiongraph.ExecutionGraph - assert_that/Group/GroupByKey -> [3]{assert_that/Group/Map(_merge_tagged_vals_under_key), assert_that/Unkey, assert_that/Match} (1/1) (0f3459b2b7b2a2665e7a1bf4fa7cad51) switched from SCHEDULED to DEPLOYING.
[flink-akka.actor.default-dispatcher-5] INFO org.apache.flink.runtime.executiongraph.ExecutionGraph - Deploying assert_that/Group/GroupByKey -> [3]{assert_that/Group/Map(_merge_tagged_vals_under_key), assert_that/Unkey, assert_that/Match} (1/1) (attempt #0) to localhost
[Source: Impulse -> [4]{assert_that/Create/FlatMap(<lambda at core.py:2027>), assert_that/Create/Map(decode), assert_that/Group/pair_with_0, assert_that/Group/Flatten} (1/1)] INFO org.apache.flink.runtime.taskmanager.Task - Loading JAR files for task Source: Impulse -> [4]{assert_that/Create/FlatMap(<lambda at core.py:2027>), assert_that/Create/Map(decode), assert_that/Group/pair_with_0, assert_that/Group/Flatten} (1/1) (1d98808248288efdaa7dbea9f8055e9b) [DEPLOYING].
[flink-akka.actor.default-dispatcher-2] INFO org.apache.flink.runtime.taskexecutor.TaskExecutor - Received task Source: Impulse -> [3]{Create/FlatMap(<lambda at core.py:2027>), Create/MaybeReshuffle/Reshuffle/AddRandomKeys, Create/MaybeReshuffle/Reshuffle/ReshufflePerKey/Map(reify_timestamps)} -> ToKeyedWorkItem (1/1).
[Source: Impulse -> [3]{Create/FlatMap(<lambda at core.py:2027>), Create/MaybeReshuffle/Reshuffle/AddRandomKeys, Create/MaybeReshuffle/Reshuffle/ReshufflePerKey/Map(reify_timestamps)} -> ToKeyedWorkItem (1/1)] INFO org.apache.flink.runtime.taskmanager.Task - Source: Impulse -> [3]{Create/FlatMap(<lambda at core.py:2027>), Create/MaybeReshuffle/Reshuffle/AddRandomKeys, Create/MaybeReshuffle/Reshuffle/ReshufflePerKey/Map(reify_timestamps)} -> ToKeyedWorkItem (1/1) (5ef8f8ad93f6cb6647b336589885804d) switched from CREATED to DEPLOYING.
[Source: Impulse -> [4]{assert_that/Create/FlatMap(<lambda at core.py:2027>), assert_that/Create/Map(decode), assert_that/Group/pair_with_0, assert_that/Group/Flatten} (1/1)] INFO org.apache.flink.runtime.taskmanager.Task - Registering task at network: Source: Impulse -> [4]{assert_that/Create/FlatMap(<lambda at core.py:2027>), assert_that/Create/Map(decode), assert_that/Group/pair_with_0, assert_that/Group/Flatten} (1/1) (1d98808248288efdaa7dbea9f8055e9b) [DEPLOYING].
[Source: Impulse -> [3]{Create/FlatMap(<lambda at core.py:2027>), Create/MaybeReshuffle/Reshuffle/AddRandomKeys, Create/MaybeReshuffle/Reshuffle/ReshufflePerKey/Map(reify_timestamps)} -> ToKeyedWorkItem (1/1)] INFO org.apache.flink.runtime.taskmanager.Task - Creating FileSystem stream leak safety net for task Source: Impulse -> [3]{Create/FlatMap(<lambda at core.py:2027>), Create/MaybeReshuffle/Reshuffle/AddRandomKeys, Create/MaybeReshuffle/Reshuffle/ReshufflePerKey/Map(reify_timestamps)} -> ToKeyedWorkItem (1/1) (5ef8f8ad93f6cb6647b336589885804d) [DEPLOYING]
[Source: Impulse -> [3]{Create/FlatMap(<lambda at core.py:2027>), Create/MaybeReshuffle/Reshuffle/AddRandomKeys, Create/MaybeReshuffle/Reshuffle/ReshufflePerKey/Map(reify_timestamps)} -> ToKeyedWorkItem (1/1)] INFO org.apache.flink.runtime.taskmanager.Task - Loading JAR files for task Source: Impulse -> [3]{Create/FlatMap(<lambda at core.py:2027>), Create/MaybeReshuffle/Reshuffle/AddRandomKeys, Create/MaybeReshuffle/Reshuffle/ReshufflePerKey/Map(reify_timestamps)} -> ToKeyedWorkItem (1/1) (5ef8f8ad93f6cb6647b336589885804d) [DEPLOYING].
[Source: Impulse -> [3]{Create/FlatMap(<lambda at core.py:2027>), Create/MaybeReshuffle/Reshuffle/AddRandomKeys, Create/MaybeReshuffle/Reshuffle/ReshufflePerKey/Map(reify_timestamps)} -> ToKeyedWorkItem (1/1)] INFO org.apache.flink.runtime.taskmanager.Task - Registering task at network: Source: Impulse -> [3]{Create/FlatMap(<lambda at core.py:2027>), Create/MaybeReshuffle/Reshuffle/AddRandomKeys, Create/MaybeReshuffle/Reshuffle/ReshufflePerKey/Map(reify_timestamps)} -> ToKeyedWorkItem (1/1) (5ef8f8ad93f6cb6647b336589885804d) [DEPLOYING].
[flink-akka.actor.default-dispatcher-2] INFO org.apache.flink.runtime.taskexecutor.TaskExecutor - Received task Create/MaybeReshuffle/Reshuffle/ReshufflePerKey/GroupByKey -> [5]{Create/MaybeReshuffle/Reshuffle/ReshufflePerKey/FlatMap(restore_timestamps), Create/MaybeReshuffle/Reshuffle/RemoveRandomKeys, Create/Map(decode), Map(<lambda at fn_api_runner_test.py:406>), WindowInto(WindowIntoFn)} -> ToKeyedWorkItem (1/1).
[Create/MaybeReshuffle/Reshuffle/ReshufflePerKey/GroupByKey -> [5]{Create/MaybeReshuffle/Reshuffle/ReshufflePerKey/FlatMap(restore_timestamps), Create/MaybeReshuffle/Reshuffle/RemoveRandomKeys, Create/Map(decode), Map(<lambda at fn_api_runner_test.py:406>), WindowInto(WindowIntoFn)} -> ToKeyedWorkItem (1/1)] INFO org.apache.flink.runtime.taskmanager.Task - Create/MaybeReshuffle/Reshuffle/ReshufflePerKey/GroupByKey -> [5]{Create/MaybeReshuffle/Reshuffle/ReshufflePerKey/FlatMap(restore_timestamps), Create/MaybeReshuffle/Reshuffle/RemoveRandomKeys, Create/Map(decode), Map(<lambda at fn_api_runner_test.py:406>), WindowInto(WindowIntoFn)} -> ToKeyedWorkItem (1/1) (15f44185c98194e06ac4ed10c02851ff) switched from CREATED to DEPLOYING.
[Create/MaybeReshuffle/Reshuffle/ReshufflePerKey/GroupByKey -> [5]{Create/MaybeReshuffle/Reshuffle/ReshufflePerKey/FlatMap(restore_timestamps), Create/MaybeReshuffle/Reshuffle/RemoveRandomKeys, Create/Map(decode), Map(<lambda at fn_api_runner_test.py:406>), WindowInto(WindowIntoFn)} -> ToKeyedWorkItem (1/1)] INFO org.apache.flink.runtime.taskmanager.Task - Creating FileSystem stream leak safety net for task Create/MaybeReshuffle/Reshuffle/ReshufflePerKey/GroupByKey -> [5]{Create/MaybeReshuffle/Reshuffle/ReshufflePerKey/FlatMap(restore_timestamps), Create/MaybeReshuffle/Reshuffle/RemoveRandomKeys, Create/Map(decode), Map(<lambda at fn_api_runner_test.py:406>), WindowInto(WindowIntoFn)} -> ToKeyedWorkItem (1/1) (15f44185c98194e06ac4ed10c02851ff) [DEPLOYING]
[Create/MaybeReshuffle/Reshuffle/ReshufflePerKey/GroupByKey -> [5]{Create/MaybeReshuffle/Reshuffle/ReshufflePerKey/FlatMap(restore_timestamps), Create/MaybeReshuffle/Reshuffle/RemoveRandomKeys, Create/Map(decode), Map(<lambda at fn_api_runner_test.py:406>), WindowInto(WindowIntoFn)} -> ToKeyedWorkItem (1/1)] INFO org.apache.flink.runtime.taskmanager.Task - Loading JAR files for task Create/MaybeReshuffle/Reshuffle/ReshufflePerKey/GroupByKey -> [5]{Create/MaybeReshuffle/Reshuffle/ReshufflePerKey/FlatMap(restore_timestamps), Create/MaybeReshuffle/Reshuffle/RemoveRandomKeys, Create/Map(decode), Map(<lambda at fn_api_runner_test.py:406>), WindowInto(WindowIntoFn)} -> ToKeyedWorkItem (1/1) (15f44185c98194e06ac4ed10c02851ff) [DEPLOYING].
[Create/MaybeReshuffle/Reshuffle/ReshufflePerKey/GroupByKey -> [5]{Create/MaybeReshuffle/Reshuffle/ReshufflePerKey/FlatMap(restore_timestamps), Create/MaybeReshuffle/Reshuffle/RemoveRandomKeys, Create/Map(decode), Map(<lambda at fn_api_runner_test.py:406>), WindowInto(WindowIntoFn)} -> ToKeyedWorkItem (1/1)] INFO org.apache.flink.runtime.taskmanager.Task - Registering task at network: Create/MaybeReshuffle/Reshuffle/ReshufflePerKey/GroupByKey -> [5]{Create/MaybeReshuffle/Reshuffle/ReshufflePerKey/FlatMap(restore_timestamps), Create/MaybeReshuffle/Reshuffle/RemoveRandomKeys, Create/Map(decode), Map(<lambda at fn_api_runner_test.py:406>), WindowInto(WindowIntoFn)} -> ToKeyedWorkItem (1/1) (15f44185c98194e06ac4ed10c02851ff) [DEPLOYING].
[flink-akka.actor.default-dispatcher-2] INFO org.apache.flink.runtime.taskexecutor.TaskExecutor - Received task GroupByKey -> [5]{Map(<lambda at fn_api_runner_test.py:409>), assert_that/WindowInto(WindowIntoFn), assert_that/ToVoidKey, assert_that/Group/pair_with_1, assert_that/Group/Flatten} (1/1).
[GroupByKey -> [5]{Map(<lambda at fn_api_runner_test.py:409>), assert_that/WindowInto(WindowIntoFn), assert_that/ToVoidKey, assert_that/Group/pair_with_1, assert_that/Group/Flatten} (1/1)] INFO org.apache.flink.runtime.taskmanager.Task - GroupByKey -> [5]{Map(<lambda at fn_api_runner_test.py:409>), assert_that/WindowInto(WindowIntoFn), assert_that/ToVoidKey, assert_that/Group/pair_with_1, assert_that/Group/Flatten} (1/1) (a3da6f92063969b00e6e8b46c9914432) switched from CREATED to DEPLOYING.
[GroupByKey -> [5]{Map(<lambda at fn_api_runner_test.py:409>), assert_that/WindowInto(WindowIntoFn), assert_that/ToVoidKey, assert_that/Group/pair_with_1, assert_that/Group/Flatten} (1/1)] INFO org.apache.flink.runtime.taskmanager.Task - Creating FileSystem stream leak safety net for task GroupByKey -> [5]{Map(<lambda at fn_api_runner_test.py:409>), assert_that/WindowInto(WindowIntoFn), assert_that/ToVoidKey, assert_that/Group/pair_with_1, assert_that/Group/Flatten} (1/1) (a3da6f92063969b00e6e8b46c9914432) [DEPLOYING]
[GroupByKey -> [5]{Map(<lambda at fn_api_runner_test.py:409>), assert_that/WindowInto(WindowIntoFn), assert_that/ToVoidKey, assert_that/Group/pair_with_1, assert_that/Group/Flatten} (1/1)] INFO org.apache.flink.runtime.taskmanager.Task - Loading JAR files for task GroupByKey -> [5]{Map(<lambda at fn_api_runner_test.py:409>), assert_that/WindowInto(WindowIntoFn), assert_that/ToVoidKey, assert_that/Group/pair_with_1, assert_that/Group/Flatten} (1/1) (a3da6f92063969b00e6e8b46c9914432) [DEPLOYING].
[GroupByKey -> [5]{Map(<lambda at fn_api_runner_test.py:409>), assert_that/WindowInto(WindowIntoFn), assert_that/ToVoidKey, assert_that/Group/pair_with_1, assert_that/Group/Flatten} (1/1)] INFO org.apache.flink.runtime.taskmanager.Task - Registering task at network: GroupByKey -> [5]{Map(<lambda at fn_api_runner_test.py:409>), assert_that/WindowInto(WindowIntoFn), assert_that/ToVoidKey, assert_that/Group/pair_with_1, assert_that/Group/Flatten} (1/1) (a3da6f92063969b00e6e8b46c9914432) [DEPLOYING].
[Source: Impulse -> [3]{Create/FlatMap(<lambda at core.py:2027>), Create/MaybeReshuffle/Reshuffle/AddRandomKeys, Create/MaybeReshuffle/Reshuffle/ReshufflePerKey/Map(reify_timestamps)} -> ToKeyedWorkItem (1/1)] INFO org.apache.flink.runtime.taskmanager.Task - Source: Impulse -> [3]{Create/FlatMap(<lambda at core.py:2027>), Create/MaybeReshuffle/Reshuffle/AddRandomKeys, Create/MaybeReshuffle/Reshuffle/ReshufflePerKey/Map(reify_timestamps)} -> ToKeyedWorkItem (1/1) (5ef8f8ad93f6cb6647b336589885804d) switched from DEPLOYING to RUNNING.
[flink-akka.actor.default-dispatcher-2] INFO org.apache.flink.runtime.taskexecutor.TaskExecutor - Received task ToKeyedWorkItem (1/1).
[flink-akka.actor.default-dispatcher-3] INFO org.apache.flink.runtime.executiongraph.ExecutionGraph - Source: Impulse -> [3]{Create/FlatMap(<lambda at core.py:2027>), Create/MaybeReshuffle/Reshuffle/AddRandomKeys, Create/MaybeReshuffle/Reshuffle/ReshufflePerKey/Map(reify_timestamps)} -> ToKeyedWorkItem (1/1) (5ef8f8ad93f6cb6647b336589885804d) switched from DEPLOYING to RUNNING.
[Source: Impulse -> [3]{Create/FlatMap(<lambda at core.py:2027>), Create/MaybeReshuffle/Reshuffle/AddRandomKeys, Create/MaybeReshuffle/Reshuffle/ReshufflePerKey/Map(reify_timestamps)} -> ToKeyedWorkItem (1/1)] INFO org.apache.flink.streaming.runtime.tasks.StreamTask - No state backend has been configured, using default (Memory / JobManager) MemoryStateBackend (data in heap memory / checkpoints to JobManager) (checkpoints: 'null', savepoints: 'null', asynchronous: TRUE, maxStateSize: 5242880)
[ToKeyedWorkItem (1/1)] INFO org.apache.flink.runtime.taskmanager.Task - ToKeyedWorkItem (1/1) (a77ad3a3ab42726174b9f6c4a3792161) switched from CREATED to DEPLOYING.
[Create/MaybeReshuffle/Reshuffle/ReshufflePerKey/GroupByKey -> [5]{Create/MaybeReshuffle/Reshuffle/ReshufflePerKey/FlatMap(restore_timestamps), Create/MaybeReshuffle/Reshuffle/RemoveRandomKeys, Create/Map(decode), Map(<lambda at fn_api_runner_test.py:406>), WindowInto(WindowIntoFn)} -> ToKeyedWorkItem (1/1)] INFO org.apache.flink.runtime.taskmanager.Task - Create/MaybeReshuffle/Reshuffle/ReshufflePerKey/GroupByKey -> [5]{Create/MaybeReshuffle/Reshuffle/ReshufflePerKey/FlatMap(restore_timestamps), Create/MaybeReshuffle/Reshuffle/RemoveRandomKeys, Create/Map(decode), Map(<lambda at fn_api_runner_test.py:406>), WindowInto(WindowIntoFn)} -> ToKeyedWorkItem (1/1) (15f44185c98194e06ac4ed10c02851ff) switched from DEPLOYING to RUNNING.
[ToKeyedWorkItem (1/1)] INFO org.apache.flink.runtime.taskmanager.Task - Creating FileSystem stream leak safety net for task ToKeyedWorkItem (1/1) (a77ad3a3ab42726174b9f6c4a3792161) [DEPLOYING]
[ToKeyedWorkItem (1/1)] INFO org.apache.flink.runtime.taskmanager.Task - Loading JAR files for task ToKeyedWorkItem (1/1) (a77ad3a3ab42726174b9f6c4a3792161) [DEPLOYING].
[GroupByKey -> [5]{Map(<lambda at fn_api_runner_test.py:409>), assert_that/WindowInto(WindowIntoFn), assert_that/ToVoidKey, assert_that/Group/pair_with_1, assert_that/Group/Flatten} (1/1)] INFO org.apache.flink.runtime.taskmanager.Task - GroupByKey -> [5]{Map(<lambda at fn_api_runner_test.py:409>), assert_that/WindowInto(WindowIntoFn), assert_that/ToVoidKey, assert_that/Group/pair_with_1, assert_that/Group/Flatten} (1/1) (a3da6f92063969b00e6e8b46c9914432) switched from DEPLOYING to RUNNING.
[flink-akka.actor.default-dispatcher-5] INFO org.apache.flink.runtime.executiongraph.ExecutionGraph - Create/MaybeReshuffle/Reshuffle/ReshufflePerKey/GroupByKey -> [5]{Create/MaybeReshuffle/Reshuffle/ReshufflePerKey/FlatMap(restore_timestamps), Create/MaybeReshuffle/Reshuffle/RemoveRandomKeys, Create/Map(decode), Map(<lambda at fn_api_runner_test.py:406>), WindowInto(WindowIntoFn)} -> ToKeyedWorkItem (1/1) (15f44185c98194e06ac4ed10c02851ff) switched from DEPLOYING to RUNNING.
[Create/MaybeReshuffle/Reshuffle/ReshufflePerKey/GroupByKey -> [5]{Create/MaybeReshuffle/Reshuffle/ReshufflePerKey/FlatMap(restore_timestamps), Create/MaybeReshuffle/Reshuffle/RemoveRandomKeys, Create/Map(decode), Map(<lambda at fn_api_runner_test.py:406>), WindowInto(WindowIntoFn)} -> ToKeyedWorkItem (1/1)] INFO org.apache.flink.streaming.runtime.tasks.StreamTask - No state backend has been configured, using default (Memory / JobManager) MemoryStateBackend (data in heap memory / checkpoints to JobManager) (checkpoints: 'null', savepoints: 'null', asynchronous: TRUE, maxStateSize: 5242880)
[GroupByKey -> [5]{Map(<lambda at fn_api_runner_test.py:409>), assert_that/WindowInto(WindowIntoFn), assert_that/ToVoidKey, assert_that/Group/pair_with_1, assert_that/Group/Flatten} (1/1)] INFO org.apache.flink.streaming.runtime.tasks.StreamTask - No state backend has been configured, using default (Memory / JobManager) MemoryStateBackend (data in heap memory / checkpoints to JobManager) (checkpoints: 'null', savepoints: 'null', asynchronous: TRUE, maxStateSize: 5242880)
[flink-akka.actor.default-dispatcher-5] INFO org.apache.flink.runtime.executiongraph.ExecutionGraph - GroupByKey -> [5]{Map(<lambda at fn_api_runner_test.py:409>), assert_that/WindowInto(WindowIntoFn), assert_that/ToVoidKey, assert_that/Group/pair_with_1, assert_that/Group/Flatten} (1/1) (a3da6f92063969b00e6e8b46c9914432) switched from DEPLOYING to RUNNING.
[ToKeyedWorkItem (1/1)] INFO org.apache.flink.runtime.taskmanager.Task - Registering task at network: ToKeyedWorkItem (1/1) (a77ad3a3ab42726174b9f6c4a3792161) [DEPLOYING].
[flink-akka.actor.default-dispatcher-2] INFO org.apache.flink.runtime.taskexecutor.TaskExecutor - Received task assert_that/Group/GroupByKey -> [3]{assert_that/Group/Map(_merge_tagged_vals_under_key), assert_that/Unkey, assert_that/Match} (1/1).
[Source: Impulse -> [4]{assert_that/Create/FlatMap(<lambda at core.py:2027>), assert_that/Create/Map(decode), assert_that/Group/pair_with_0, assert_that/Group/Flatten} (1/1)] INFO org.apache.flink.runtime.taskmanager.Task - Source: Impulse -> [4]{assert_that/Create/FlatMap(<lambda at core.py:2027>), assert_that/Create/Map(decode), assert_that/Group/pair_with_0, assert_that/Group/Flatten} (1/1) (1d98808248288efdaa7dbea9f8055e9b) switched from DEPLOYING to RUNNING.
[flink-akka.actor.default-dispatcher-5] INFO org.apache.flink.runtime.executiongraph.ExecutionGraph - Source: Impulse -> [4]{assert_that/Create/FlatMap(<lambda at core.py:2027>), assert_that/Create/Map(decode), assert_that/Group/pair_with_0, assert_that/Group/Flatten} (1/1) (1d98808248288efdaa7dbea9f8055e9b) switched from DEPLOYING to RUNNING.
[Source: Impulse -> [4]{assert_that/Create/FlatMap(<lambda at core.py:2027>), assert_that/Create/Map(decode), assert_that/Group/pair_with_0, assert_that/Group/Flatten} (1/1)] INFO org.apache.flink.streaming.runtime.tasks.StreamTask - No state backend has been configured, using default (Memory / JobManager) MemoryStateBackend (data in heap memory / checkpoints to JobManager) (checkpoints: 'null', savepoints: 'null', asynchronous: TRUE, maxStateSize: 5242880)
[assert_that/Group/GroupByKey -> [3]{assert_that/Group/Map(_merge_tagged_vals_under_key), assert_that/Unkey, assert_that/Match} (1/1)] INFO org.apache.flink.runtime.taskmanager.Task - assert_that/Group/GroupByKey -> [3]{assert_that/Group/Map(_merge_tagged_vals_under_key), assert_that/Unkey, assert_that/Match} (1/1) (0f3459b2b7b2a2665e7a1bf4fa7cad51) switched from CREATED to DEPLOYING.
[assert_that/Group/GroupByKey -> [3]{assert_that/Group/Map(_merge_tagged_vals_under_key), assert_that/Unkey, assert_that/Match} (1/1)] INFO org.apache.flink.runtime.taskmanager.Task - Creating FileSystem stream leak safety net for task assert_that/Group/GroupByKey -> [3]{assert_that/Group/Map(_merge_tagged_vals_under_key), assert_that/Unkey, assert_that/Match} (1/1) (0f3459b2b7b2a2665e7a1bf4fa7cad51) [DEPLOYING]
[assert_that/Group/GroupByKey -> [3]{assert_that/Group/Map(_merge_tagged_vals_under_key), assert_that/Unkey, assert_that/Match} (1/1)] INFO org.apache.flink.runtime.taskmanager.Task - Loading JAR files for task assert_that/Group/GroupByKey -> [3]{assert_that/Group/Map(_merge_tagged_vals_under_key), assert_that/Unkey, assert_that/Match} (1/1) (0f3459b2b7b2a2665e7a1bf4fa7cad51) [DEPLOYING].
[ToKeyedWorkItem (1/1)] INFO org.apache.flink.runtime.taskmanager.Task - ToKeyedWorkItem (1/1) (a77ad3a3ab42726174b9f6c4a3792161) switched from DEPLOYING to RUNNING.
[assert_that/Group/GroupByKey -> [3]{assert_that/Group/Map(_merge_tagged_vals_under_key), assert_that/Unkey, assert_that/Match} (1/1)] INFO org.apache.flink.runtime.taskmanager.Task - Registering task at network: assert_that/Group/GroupByKey -> [3]{assert_that/Group/Map(_merge_tagged_vals_under_key), assert_that/Unkey, assert_that/Match} (1/1) (0f3459b2b7b2a2665e7a1bf4fa7cad51) [DEPLOYING].
[flink-akka.actor.default-dispatcher-4] INFO org.apache.flink.runtime.executiongraph.ExecutionGraph - ToKeyedWorkItem (1/1) (a77ad3a3ab42726174b9f6c4a3792161) switched from DEPLOYING to RUNNING.
[ToKeyedWorkItem (1/1)] INFO org.apache.flink.streaming.runtime.tasks.StreamTask - No state backend has been configured, using default (Memory / JobManager) MemoryStateBackend (data in heap memory / checkpoints to JobManager) (checkpoints: 'null', savepoints: 'null', asynchronous: TRUE, maxStateSize: 5242880)
[assert_that/Group/GroupByKey -> [3]{assert_that/Group/Map(_merge_tagged_vals_under_key), assert_that/Unkey, assert_that/Match} (1/1)] INFO org.apache.flink.runtime.taskmanager.Task - assert_that/Group/GroupByKey -> [3]{assert_that/Group/Map(_merge_tagged_vals_under_key), assert_that/Unkey, assert_that/Match} (1/1) (0f3459b2b7b2a2665e7a1bf4fa7cad51) switched from DEPLOYING to RUNNING.
[flink-akka.actor.default-dispatcher-4] INFO org.apache.flink.runtime.executiongraph.ExecutionGraph - assert_that/Group/GroupByKey -> [3]{assert_that/Group/Map(_merge_tagged_vals_under_key), assert_that/Unkey, assert_that/Match} (1/1) (0f3459b2b7b2a2665e7a1bf4fa7cad51) switched from DEPLOYING to RUNNING.
[assert_that/Group/GroupByKey -> [3]{assert_that/Group/Map(_merge_tagged_vals_under_key), assert_that/Unkey, assert_that/Match} (1/1)] INFO org.apache.flink.streaming.runtime.tasks.StreamTask - No state backend has been configured, using default (Memory / JobManager) MemoryStateBackend (data in heap memory / checkpoints to JobManager) (checkpoints: 'null', savepoints: 'null', asynchronous: TRUE, maxStateSize: 5242880)
[Source: Impulse -> [3]{Create/FlatMap(<lambda at core.py:2027>), Create/MaybeReshuffle/Reshuffle/AddRandomKeys, Create/MaybeReshuffle/Reshuffle/ReshufflePerKey/Map(reify_timestamps)} -> ToKeyedWorkItem (1/1)] WARN org.apache.flink.metrics.MetricGroup - The operator name [3]{Create/FlatMap(<lambda at core.py:2027>), Create/MaybeReshuffle/Reshuffle/AddRandomKeys, Create/MaybeReshuffle/Reshuffle/ReshufflePerKey/Map(reify_timestamps)} exceeded the 80 characters length limit and was truncated.
[Source: Impulse -> [4]{assert_that/Create/FlatMap(<lambda at core.py:2027>), assert_that/Create/Map(decode), assert_that/Group/pair_with_0, assert_that/Group/Flatten} (1/1)] WARN org.apache.flink.metrics.MetricGroup - The operator name [4]{assert_that/Create/FlatMap(<lambda at core.py:2027>), assert_that/Create/Map(decode), assert_that/Group/pair_with_0, assert_that/Group/Flatten} exceeded the 80 characters length limit and was truncated.
[assert_that/Group/GroupByKey -> [3]{assert_that/Group/Map(_merge_tagged_vals_under_key), assert_that/Unkey, assert_that/Match} (1/1)] WARN org.apache.flink.metrics.MetricGroup - The operator name [3]{assert_that/Group/Map(_merge_tagged_vals_under_key), assert_that/Unkey, assert_that/Match} exceeded the 80 characters length limit and was truncated.
[GroupByKey -> [5]{Map(<lambda at fn_api_runner_test.py:409>), assert_that/WindowInto(WindowIntoFn), assert_that/ToVoidKey, assert_that/Group/pair_with_1, assert_that/Group/Flatten} (1/1)] WARN org.apache.flink.metrics.MetricGroup - The operator name [5]{Map(<lambda at fn_api_runner_test.py:409>), assert_that/WindowInto(WindowIntoFn), assert_that/ToVoidKey, assert_that/Group/pair_with_1, assert_that/Group/Flatten} exceeded the 80 characters length limit and was truncated.
[assert_that/Group/GroupByKey -> [3]{assert_that/Group/Map(_merge_tagged_vals_under_key), assert_that/Unkey, assert_that/Match} (1/1)] INFO org.apache.flink.runtime.state.heap.HeapKeyedStateBackend - Initializing heap keyed state backend with stream factory.
[GroupByKey -> [5]{Map(<lambda at fn_api_runner_test.py:409>), assert_that/WindowInto(WindowIntoFn), assert_that/ToVoidKey, assert_that/Group/pair_with_1, assert_that/Group/Flatten} (1/1)] INFO org.apache.flink.runtime.state.heap.HeapKeyedStateBackend - Initializing heap keyed state backend with stream factory.
[Create/MaybeReshuffle/Reshuffle/ReshufflePerKey/GroupByKey -> [5]{Create/MaybeReshuffle/Reshuffle/ReshufflePerKey/FlatMap(restore_timestamps), Create/MaybeReshuffle/Reshuffle/RemoveRandomKeys, Create/Map(decode), Map(<lambda at fn_api_runner_test.py:406>), WindowInto(WindowIntoFn)} -> ToKeyedWorkItem (1/1)] WARN org.apache.flink.metrics.MetricGroup - The operator name [5]{Create/MaybeReshuffle/Reshuffle/ReshufflePerKey/FlatMap(restore_timestamps), Create/MaybeReshuffle/Reshuffle/RemoveRandomKeys, Create/Map(decode), Map(<lambda at fn_api_runner_test.py:406>), WindowInto(WindowIntoFn)} exceeded the 80 characters length limit and was truncated.
[Create/MaybeReshuffle/Reshuffle/ReshufflePerKey/GroupByKey -> [5]{Create/MaybeReshuffle/Reshuffle/ReshufflePerKey/FlatMap(restore_timestamps), Create/MaybeReshuffle/Reshuffle/RemoveRandomKeys, Create/Map(decode), Map(<lambda at fn_api_runner_test.py:406>), WindowInto(WindowIntoFn)} -> ToKeyedWorkItem (1/1)] INFO org.apache.flink.runtime.state.heap.HeapKeyedStateBackend - Initializing heap keyed state backend with stream factory.
[Source: Impulse -> [3]{Create/FlatMap(<lambda at core.py:2027>), Create/MaybeReshuffle/Reshuffle/AddRandomKeys, Create/MaybeReshuffle/Reshuffle/ReshufflePerKey/Map(reify_timestamps)} -> ToKeyedWorkItem (1/1)] WARN org.apache.beam.runners.fnexecution.environment.DockerCommand - Unable to pull docker image jenkins-docker-apache.bintray.io/beam/python:latest, cause: Received exit code 1 for command 'docker pull jenkins-docker-apache.bintray.io/beam/python:latest'. stderr: Error response from daemon: unknown: Repo 'apache' was not found
[grpc-default-executor-1] INFO org.apache.beam.runners.fnexecution.artifact.BeamFileSystemArtifactRetrievalService - GetManifest for /tmp/flinktest_MrsTh/job_6a5cbc9c-88ad-499d-b6ff-b2dc816f9071/MANIFEST
[grpc-default-executor-1] INFO org.apache.beam.runners.fnexecution.artifact.BeamFileSystemArtifactRetrievalService - Loading manifest for retrieval token /tmp/flinktest_MrsTh/job_6a5cbc9c-88ad-499d-b6ff-b2dc816f9071/MANIFEST
[grpc-default-executor-1] INFO org.apache.beam.runners.fnexecution.artifact.BeamFileSystemArtifactRetrievalService - Manifest at /tmp/flinktest_MrsTh/job_6a5cbc9c-88ad-499d-b6ff-b2dc816f9071/MANIFEST has 0 artifact locations
[grpc-default-executor-1] INFO org.apache.beam.runners.fnexecution.artifact.BeamFileSystemArtifactRetrievalService - GetManifest for /tmp/flinktest_MrsTh/job_6a5cbc9c-88ad-499d-b6ff-b2dc816f9071/MANIFEST -> 0 artifacts
[grpc-default-executor-1] INFO org.apache.beam.runners.fnexecution.logging.GrpcLoggingService - Beam Fn Logging client connected.
[grpc-default-executor-1] INFO sdk_worker_main.main - Logging handler created.
[grpc-default-executor-1] INFO sdk_worker_main.start - Status HTTP server running at localhost:34117
[grpc-default-executor-1] INFO sdk_worker_main.main - semi_persistent_directory: /tmp
[grpc-default-executor-1] WARN sdk_worker_main._load_main_session - No session file found: /tmp/staged/pickled_main_session. Functions defined in __main__ (interactive session) may fail.
[grpc-default-executor-1] INFO pipeline_options.get_all_options - Parsing unknown args: [u'--direct_runner_use_stacked_bundle', u'--options_id=22', u'--pipeline_type_check', u'--sdk_worker_parallelism=1']
[grpc-default-executor-1] INFO sdk_worker_main.main - Python sdk harness started with pipeline_options: {'runner': u'None', 'streaming': True, 'experiments': [u'beam_fn_api'], 'sdk_location': u'container', 'flink_master': '[auto]', 'direct_runner_use_stacked_bundle': None, 'sdk_worker_parallelism': u'1', 'job_name': u'test_windowing_1543950891.17', 'options_id': u'22', 'pipeline_type_check': None, 'parallelism': 1, 'job_endpoint': u'localhost:44955'}
[grpc-default-executor-1] INFO sdk_worker.__init__ - Creating insecure control channel.
[grpc-default-executor-1] INFO sdk_worker.__init__ - Control channel established.
[grpc-default-executor-1] INFO sdk_worker.__init__ - Initializing SDKHarness with 12 workers.
[grpc-default-executor-1] INFO org.apache.beam.runners.fnexecution.control.FnApiControlClientPoolService - Beam Fn Control client connected with id 1
[grpc-default-executor-1] INFO sdk_worker.create_state_handler - Creating channel for localhost:32889
[grpc-default-executor-1] WARN bundle_processor.create_operation - No unique name set for transform fn/write/ref_PCollection_PCollection_4:0
[grpc-default-executor-1] WARN bundle_processor.create_operation - No unique name set for transform fn/write/ref_PCollection_PCollection_24:0:0
[grpc-default-executor-1] INFO data_plane.create_data_channel - Creating channel for localhost:34747
[grpc-default-executor-1] INFO org.apache.beam.runners.fnexecution.data.GrpcDataService - Beam Fn Data client connected.
[grpc-default-executor-1] WARN bundle_processor.create_operation - No unique name set for transform fn/read/ref_PCollection_PCollection_17:0
[grpc-default-executor-1] WARN bundle_processor.create_operation - No unique name set for transform fn/read/ref_PCollection_PCollection_1:0
[grpc-default-executor-1] WARN bundle_processor.create_operation - No unique name set for transform fn/write/ref_PCollection_PCollection_12:0
[Source: Impulse -> [3]{Create/FlatMap(<lambda at core.py:2027>), Create/MaybeReshuffle/Reshuffle/AddRandomKeys, Create/MaybeReshuffle/Reshuffle/ReshufflePerKey/Map(reify_timestamps)} -> ToKeyedWorkItem (1/1)] INFO org.apache.flink.runtime.taskmanager.Task - Source: Impulse -> [3]{Create/FlatMap(<lambda at core.py:2027>), Create/MaybeReshuffle/Reshuffle/AddRandomKeys, Create/MaybeReshuffle/Reshuffle/ReshufflePerKey/Map(reify_timestamps)} -> ToKeyedWorkItem (1/1) (5ef8f8ad93f6cb6647b336589885804d) switched from RUNNING to FINISHED.
[Source: Impulse -> [3]{Create/FlatMap(<lambda at core.py:2027>), Create/MaybeReshuffle/Reshuffle/AddRandomKeys, Create/MaybeReshuffle/Reshuffle/ReshufflePerKey/Map(reify_timestamps)} -> ToKeyedWorkItem (1/1)] INFO org.apache.flink.runtime.taskmanager.Task - Freeing task resources for Source: Impulse -> [3]{Create/FlatMap(<lambda at core.py:2027>), Create/MaybeReshuffle/Reshuffle/AddRandomKeys, Create/MaybeReshuffle/Reshuffle/ReshufflePerKey/Map(reify_timestamps)} -> ToKeyedWorkItem (1/1) (5ef8f8ad93f6cb6647b336589885804d).
[Source: Impulse -> [3]{Create/FlatMap(<lambda at core.py:2027>), Create/MaybeReshuffle/Reshuffle/AddRandomKeys, Create/MaybeReshuffle/Reshuffle/ReshufflePerKey/Map(reify_timestamps)} -> ToKeyedWorkItem (1/1)] INFO org.apache.flink.runtime.taskmanager.Task - Ensuring all FileSystem streams are closed for task Source: Impulse -> [3]{Create/FlatMap(<lambda at core.py:2027>), Create/MaybeReshuffle/Reshuffle/AddRandomKeys, Create/MaybeReshuffle/Reshuffle/ReshufflePerKey/Map(reify_timestamps)} -> ToKeyedWorkItem (1/1) (5ef8f8ad93f6cb6647b336589885804d) [FINISHED]
[flink-akka.actor.default-dispatcher-4] INFO org.apache.flink.runtime.taskexecutor.TaskExecutor - Un-registering task and sending final execution state FINISHED to JobManager for task Source: Impulse -> [3]{Create/FlatMap(<lambda at core.py:2027>), Create/MaybeReshuffle/Reshuffle/AddRandomKeys, Create/MaybeReshuffle/Reshuffle/ReshufflePerKey/Map(reify_timestamps)} -> ToKeyedWorkItem 5ef8f8ad93f6cb6647b336589885804d.
[flink-akka.actor.default-dispatcher-3] INFO org.apache.flink.runtime.executiongraph.ExecutionGraph - Source: Impulse -> [3]{Create/FlatMap(<lambda at core.py:2027>), Create/MaybeReshuffle/Reshuffle/AddRandomKeys, Create/MaybeReshuffle/Reshuffle/ReshufflePerKey/Map(reify_timestamps)} -> ToKeyedWorkItem (1/1) (5ef8f8ad93f6cb6647b336589885804d) switched from RUNNING to FINISHED.
[Source: Impulse -> [4]{assert_that/Create/FlatMap(<lambda at core.py:2027>), assert_that/Create/Map(decode), assert_that/Group/pair_with_0, assert_that/Group/Flatten} (1/1)] INFO org.apache.flink.runtime.taskmanager.Task - Source: Impulse -> [4]{assert_that/Create/FlatMap(<lambda at core.py:2027>), assert_that/Create/Map(decode), assert_that/Group/pair_with_0, assert_that/Group/Flatten} (1/1) (1d98808248288efdaa7dbea9f8055e9b) switched from RUNNING to FINISHED.
[Source: Impulse -> [4]{assert_that/Create/FlatMap(<lambda at core.py:2027>), assert_that/Create/Map(decode), assert_that/Group/pair_with_0, assert_that/Group/Flatten} (1/1)] INFO org.apache.flink.runtime.taskmanager.Task - Freeing task resources for Source: Impulse -> [4]{assert_that/Create/FlatMap(<lambda at core.py:2027>), assert_that/Create/Map(decode), assert_that/Group/pair_with_0, assert_that/Group/Flatten} (1/1) (1d98808248288efdaa7dbea9f8055e9b).
[Source: Impulse -> [4]{assert_that/Create/FlatMap(<lambda at core.py:2027>), assert_that/Create/Map(decode), assert_that/Group/pair_with_0, assert_that/Group/Flatten} (1/1)] INFO org.apache.flink.runtime.taskmanager.Task - Ensuring all FileSystem streams are closed for task Source: Impulse -> [4]{assert_that/Create/FlatMap(<lambda at core.py:2027>), assert_that/Create/Map(decode), assert_that/Group/pair_with_0, assert_that/Group/Flatten} (1/1) (1d98808248288efdaa7dbea9f8055e9b) [FINISHED]
[flink-akka.actor.default-dispatcher-2] INFO org.apache.flink.runtime.taskexecutor.TaskExecutor - Un-registering task and sending final execution state FINISHED to JobManager for task Source: Impulse -> [4]{assert_that/Create/FlatMap(<lambda at core.py:2027>), assert_that/Create/Map(decode), assert_that/Group/pair_with_0, assert_that/Group/Flatten} 1d98808248288efdaa7dbea9f8055e9b.
[flink-akka.actor.default-dispatcher-2] INFO org.apache.flink.runtime.executiongraph.ExecutionGraph - Source: Impulse -> [4]{assert_that/Create/FlatMap(<lambda at core.py:2027>), assert_that/Create/Map(decode), assert_that/Group/pair_with_0, assert_that/Group/Flatten} (1/1) (1d98808248288efdaa7dbea9f8055e9b) switched from RUNNING to FINISHED.
[grpc-default-executor-1] WARN bundle_processor.create_operation - No unique name set for transform fn/read/ref_PCollection_PCollection_7:0
[Create/MaybeReshuffle/Reshuffle/ReshufflePerKey/GroupByKey -> [5]{Create/MaybeReshuffle/Reshuffle/ReshufflePerKey/FlatMap(restore_timestamps), Create/MaybeReshuffle/Reshuffle/RemoveRandomKeys, Create/Map(decode), Map(<lambda at fn_api_runner_test.py:406>), WindowInto(WindowIntoFn)} -> ToKeyedWorkItem (1/1)] INFO org.apache.flink.runtime.taskmanager.Task - Create/MaybeReshuffle/Reshuffle/ReshufflePerKey/GroupByKey -> [5]{Create/MaybeReshuffle/Reshuffle/ReshufflePerKey/FlatMap(restore_timestamps), Create/MaybeReshuffle/Reshuffle/RemoveRandomKeys, Create/Map(decode), Map(<lambda at fn_api_runner_test.py:406>), WindowInto(WindowIntoFn)} -> ToKeyedWorkItem (1/1) (15f44185c98194e06ac4ed10c02851ff) switched from RUNNING to FINISHED.
[Create/MaybeReshuffle/Reshuffle/ReshufflePerKey/GroupByKey -> [5]{Create/MaybeReshuffle/Reshuffle/ReshufflePerKey/FlatMap(restore_timestamps), Create/MaybeReshuffle/Reshuffle/RemoveRandomKeys, Create/Map(decode), Map(<lambda at fn_api_runner_test.py:406>), WindowInto(WindowIntoFn)} -> ToKeyedWorkItem (1/1)] INFO org.apache.flink.runtime.taskmanager.Task - Freeing task resources for Create/MaybeReshuffle/Reshuffle/ReshufflePerKey/GroupByKey -> [5]{Create/MaybeReshuffle/Reshuffle/ReshufflePerKey/FlatMap(restore_timestamps), Create/MaybeReshuffle/Reshuffle/RemoveRandomKeys, Create/Map(decode), Map(<lambda at fn_api_runner_test.py:406>), WindowInto(WindowIntoFn)} -> ToKeyedWorkItem (1/1) (15f44185c98194e06ac4ed10c02851ff).
[Create/MaybeReshuffle/Reshuffle/ReshufflePerKey/GroupByKey -> [5]{Create/MaybeReshuffle/Reshuffle/ReshufflePerKey/FlatMap(restore_timestamps), Create/MaybeReshuffle/Reshuffle/RemoveRandomKeys, Create/Map(decode), Map(<lambda at fn_api_runner_test.py:406>), WindowInto(WindowIntoFn)} -> ToKeyedWorkItem (1/1)] INFO org.apache.flink.runtime.taskmanager.Task - Ensuring all FileSystem streams are closed for task Create/MaybeReshuffle/Reshuffle/ReshufflePerKey/GroupByKey -> [5]{Create/MaybeReshuffle/Reshuffle/ReshufflePerKey/FlatMap(restore_timestamps), Create/MaybeReshuffle/Reshuffle/RemoveRandomKeys, Create/Map(decode), Map(<lambda at fn_api_runner_test.py:406>), WindowInto(WindowIntoFn)} -> ToKeyedWorkItem (1/1) (15f44185c98194e06ac4ed10c02851ff) [FINISHED]
[flink-akka.actor.default-dispatcher-3] INFO org.apache.flink.runtime.taskexecutor.TaskExecutor - Un-registering task and sending final execution state FINISHED to JobManager for task Create/MaybeReshuffle/Reshuffle/ReshufflePerKey/GroupByKey -> [5]{Create/MaybeReshuffle/Reshuffle/ReshufflePerKey/FlatMap(restore_timestamps), Create/MaybeReshuffle/Reshuffle/RemoveRandomKeys, Create/Map(decode), Map(<lambda at fn_api_runner_test.py:406>), WindowInto(WindowIntoFn)} -> ToKeyedWorkItem 15f44185c98194e06ac4ed10c02851ff.
[flink-akka.actor.default-dispatcher-3] INFO org.apache.flink.runtime.executiongraph.ExecutionGraph - Create/MaybeReshuffle/Reshuffle/ReshufflePerKey/GroupByKey -> [5]{Create/MaybeReshuffle/Reshuffle/ReshufflePerKey/FlatMap(restore_timestamps), Create/MaybeReshuffle/Reshuffle/RemoveRandomKeys, Create/Map(decode), Map(<lambda at fn_api_runner_test.py:406>), WindowInto(WindowIntoFn)} -> ToKeyedWorkItem (1/1) (15f44185c98194e06ac4ed10c02851ff) switched from RUNNING to FINISHED.
[grpc-default-executor-1] WARN bundle_processor.create_operation - No unique name set for transform fn/write/ref_PCollection_PCollection_24:1:0
[grpc-default-executor-1] WARN bundle_processor.create_operation - No unique name set for transform fn/read/ref_PCollection_PCollection_15:0
[GroupByKey -> [5]{Map(<lambda at fn_api_runner_test.py:409>), assert_that/WindowInto(WindowIntoFn), assert_that/ToVoidKey, assert_that/Group/pair_with_1, assert_that/Group/Flatten} (1/1)] INFO org.apache.flink.runtime.taskmanager.Task - GroupByKey -> [5]{Map(<lambda at fn_api_runner_test.py:409>), assert_that/WindowInto(WindowIntoFn), assert_that/ToVoidKey, assert_that/Group/pair_with_1, assert_that/Group/Flatten} (1/1) (a3da6f92063969b00e6e8b46c9914432) switched from RUNNING to FINISHED.
[GroupByKey -> [5]{Map(<lambda at fn_api_runner_test.py:409>), assert_that/WindowInto(WindowIntoFn), assert_that/ToVoidKey, assert_that/Group/pair_with_1, assert_that/Group/Flatten} (1/1)] INFO org.apache.flink.runtime.taskmanager.Task - Freeing task resources for GroupByKey -> [5]{Map(<lambda at fn_api_runner_test.py:409>), assert_that/WindowInto(WindowIntoFn), assert_that/ToVoidKey, assert_that/Group/pair_with_1, assert_that/Group/Flatten} (1/1) (a3da6f92063969b00e6e8b46c9914432).
[GroupByKey -> [5]{Map(<lambda at fn_api_runner_test.py:409>), assert_that/WindowInto(WindowIntoFn), assert_that/ToVoidKey, assert_that/Group/pair_with_1, assert_that/Group/Flatten} (1/1)] INFO org.apache.flink.runtime.taskmanager.Task - Ensuring all FileSystem streams are closed for task GroupByKey -> [5]{Map(<lambda at fn_api_runner_test.py:409>), assert_that/WindowInto(WindowIntoFn), assert_that/ToVoidKey, assert_that/Group/pair_with_1, assert_that/Group/Flatten} (1/1) (a3da6f92063969b00e6e8b46c9914432) [FINISHED]
[flink-akka.actor.default-dispatcher-4] INFO org.apache.flink.runtime.taskexecutor.TaskExecutor - Un-registering task and sending final execution state FINISHED to JobManager for task GroupByKey -> [5]{Map(<lambda at fn_api_runner_test.py:409>), assert_that/WindowInto(WindowIntoFn), assert_that/ToVoidKey, assert_that/Group/pair_with_1, assert_that/Group/Flatten} a3da6f92063969b00e6e8b46c9914432.
[ToKeyedWorkItem (1/1)] INFO org.apache.flink.runtime.taskmanager.Task - ToKeyedWorkItem (1/1) (a77ad3a3ab42726174b9f6c4a3792161) switched from RUNNING to FINISHED.
[ToKeyedWorkItem (1/1)] INFO org.apache.flink.runtime.taskmanager.Task - Freeing task resources for ToKeyedWorkItem (1/1) (a77ad3a3ab42726174b9f6c4a3792161).
[ToKeyedWorkItem (1/1)] INFO org.apache.flink.runtime.taskmanager.Task - Ensuring all FileSystem streams are closed for task ToKeyedWorkItem (1/1) (a77ad3a3ab42726174b9f6c4a3792161) [FINISHED]
[flink-akka.actor.default-dispatcher-4] INFO org.apache.flink.runtime.taskexecutor.TaskExecutor - Un-registering task and sending final execution state FINISHED to JobManager for task ToKeyedWorkItem a77ad3a3ab42726174b9f6c4a3792161.
[flink-akka.actor.default-dispatcher-3] INFO org.apache.flink.runtime.executiongraph.ExecutionGraph - GroupByKey -> [5]{Map(<lambda at fn_api_runner_test.py:409>), assert_that/WindowInto(WindowIntoFn), assert_that/ToVoidKey, assert_that/Group/pair_with_1, assert_that/Group/Flatten} (1/1) (a3da6f92063969b00e6e8b46c9914432) switched from RUNNING to FINISHED.
[flink-akka.actor.default-dispatcher-3] INFO org.apache.flink.runtime.executiongraph.ExecutionGraph - ToKeyedWorkItem (1/1) (a77ad3a3ab42726174b9f6c4a3792161) switched from RUNNING to FINISHED.
[grpc-default-executor-1] WARN bundle_processor.create_operation - No unique name set for transform fn/read/ref_PCollection_PCollection_27:0
[grpc-default-executor-1] INFO sdk_worker.run - No more requests from control plane
[grpc-default-executor-1] INFO sdk_worker.run - SDK Harness waiting for in-flight requests to complete
[grpc-default-executor-1] WARN org.apache.beam.sdk.fn.data.BeamFnDataGrpcMultiplexer - Hanged up for unknown endpoint.
[grpc-default-executor-1] INFO data_plane.close - Closing all cached grpc data channels.
[grpc-default-executor-0] INFO sdk_worker.close - Closing all cached gRPC state handlers.
[grpc-default-executor-0] INFO sdk_worker.run - Done consuming work.
[grpc-default-executor-0] INFO sdk_worker_main.main - Python sdk harness exiting.
[grpc-default-executor-0] INFO org.apache.beam.runners.fnexecution.logging.GrpcLoggingService - Logging client hanged up.
[assert_that/Group/GroupByKey -> [3]{assert_that/Group/Map(_merge_tagged_vals_under_key), assert_that/Unkey, assert_that/Match} (1/1)] WARN org.apache.beam.sdk.fn.data.BeamFnDataGrpcMultiplexer - Hanged up for unknown endpoint.
[assert_that/Group/GroupByKey -> [3]{assert_that/Group/Map(_merge_tagged_vals_under_key), assert_that/Unkey, assert_that/Match} (1/1)] INFO org.apache.flink.runtime.taskmanager.Task - assert_that/Group/GroupByKey -> [3]{assert_that/Group/Map(_merge_tagged_vals_under_key), assert_that/Unkey, assert_that/Match} (1/1) (0f3459b2b7b2a2665e7a1bf4fa7cad51) switched from RUNNING to FINISHED.
[assert_that/Group/GroupByKey -> [3]{assert_that/Group/Map(_merge_tagged_vals_under_key), assert_that/Unkey, assert_that/Match} (1/1)] INFO org.apache.flink.runtime.taskmanager.Task - Freeing task resources for assert_that/Group/GroupByKey -> [3]{assert_that/Group/Map(_merge_tagged_vals_under_key), assert_that/Unkey, assert_that/Match} (1/1) (0f3459b2b7b2a2665e7a1bf4fa7cad51).
[assert_that/Group/GroupByKey -> [3]{assert_that/Group/Map(_merge_tagged_vals_under_key), assert_that/Unkey, assert_that/Match} (1/1)] INFO org.apache.flink.runtime.taskmanager.Task - Ensuring all FileSystem streams are closed for task assert_that/Group/GroupByKey -> [3]{assert_that/Group/Map(_merge_tagged_vals_under_key), assert_that/Unkey, assert_that/Match} (1/1) (0f3459b2b7b2a2665e7a1bf4fa7cad51) [FINISHED]
[flink-akka.actor.default-dispatcher-3] INFO org.apache.flink.runtime.taskexecutor.TaskExecutor - Un-registering task and sending final execution state FINISHED to JobManager for task assert_that/Group/GroupByKey -> [3]{assert_that/Group/Map(_merge_tagged_vals_under_key), assert_that/Unkey, assert_that/Match} 0f3459b2b7b2a2665e7a1bf4fa7cad51.
[flink-akka.actor.default-dispatcher-3] INFO org.apache.flink.runtime.executiongraph.ExecutionGraph - assert_that/Group/GroupByKey -> [3]{assert_that/Group/Map(_merge_tagged_vals_under_key), assert_that/Unkey, assert_that/Match} (1/1) (0f3459b2b7b2a2665e7a1bf4fa7cad51) switched from RUNNING to FINISHED.
[flink-akka.actor.default-dispatcher-3] INFO org.apache.flink.runtime.executiongraph.ExecutionGraph - Job test_windowing_1543950891.17 (66f36436df570a9219863615b6091948) switched from state RUNNING to FINISHED.
[flink-akka.actor.default-dispatcher-3] INFO org.apache.flink.runtime.checkpoint.CheckpointCoordinator - Stopping checkpoint coordinator for job 66f36436df570a9219863615b6091948.
[flink-akka.actor.default-dispatcher-3] INFO org.apache.flink.runtime.checkpoint.StandaloneCompletedCheckpointStore - Shutting down
[flink-akka.actor.default-dispatcher-2] INFO org.apache.flink.runtime.dispatcher.StandaloneDispatcher - Job 66f36436df570a9219863615b6091948 reached globally terminal state FINISHED.
[flink-runner-job-server] INFO org.apache.flink.runtime.minicluster.MiniCluster - Shutting down Flink Mini Cluster
[flink-runner-job-server] INFO org.apache.flink.runtime.dispatcher.DispatcherRestEndpoint - Shutting down rest endpoint.
[flink-akka.actor.default-dispatcher-2] INFO org.apache.flink.runtime.taskexecutor.TaskExecutor - Stopping TaskExecutor akka://flink/user/taskmanager_42.
[flink-akka.actor.default-dispatcher-4] INFO org.apache.flink.runtime.dispatcher.StandaloneDispatcher - Stopping dispatcher akka://flink/user/dispatcher2376f3c1-facc-4710-bce8-40e8d0775b58.
[flink-akka.actor.default-dispatcher-4] INFO org.apache.flink.runtime.dispatcher.StandaloneDispatcher - Stopping all currently running jobs of dispatcher akka://flink/user/dispatcher2376f3c1-facc-4710-bce8-40e8d0775b58.
[flink-akka.actor.default-dispatcher-2] INFO org.apache.flink.runtime.state.TaskExecutorLocalStateStoresManager - Shutting down TaskExecutorLocalStateStoresManager.
[flink-akka.actor.default-dispatcher-4] INFO org.apache.flink.runtime.resourcemanager.slotmanager.SlotManager - Closing the SlotManager.
[flink-akka.actor.default-dispatcher-4] INFO org.apache.flink.runtime.resourcemanager.slotmanager.SlotManager - Suspending the SlotManager.
[flink-akka.actor.default-dispatcher-3] INFO org.apache.flink.runtime.jobmaster.JobMaster - Stopping the JobMaster for job test_windowing_1543950891.17(66f36436df570a9219863615b6091948).
[flink-akka.actor.default-dispatcher-3] INFO org.apache.flink.runtime.jobmaster.JobMaster - Close ResourceManager connection a54a9bdb795ffb4730ec08f45e88f954: JobManager is shutting down..
[flink-akka.actor.default-dispatcher-4] INFO org.apache.flink.runtime.jobmaster.slotpool.SlotPool - Suspending SlotPool.
[flink-akka.actor.default-dispatcher-5] INFO org.apache.flink.runtime.rpc.akka.AkkaRpcActor - The rpc endpoint org.apache.flink.runtime.jobmaster.slotpool.SlotPool has not been started yet. Discarding message org.apache.flink.runtime.rpc.messages.LocalRpcInvocation until processing is started.
[flink-akka.actor.default-dispatcher-5] INFO org.apache.flink.runtime.jobmaster.slotpool.SlotPool - Stopping SlotPool.
[flink-akka.actor.default-dispatcher-3] INFO org.apache.flink.runtime.taskexecutor.TaskExecutor - JobManager for job 66f36436df570a9219863615b6091948 with leader id 8daf521c7304e70118bafba1c7524605 lost leadership.
[flink-akka.actor.default-dispatcher-4] INFO org.apache.flink.runtime.rest.handler.legacy.backpressure.StackTraceSampleCoordinator - Shutting down stack trace sample coordinator.
[ForkJoinPool.commonPool-worker-11] INFO org.apache.flink.runtime.dispatcher.DispatcherRestEndpoint - Removing cache directory /tmp/flink-web-ui
[flink-akka.actor.default-dispatcher-4] INFO org.apache.flink.runtime.dispatcher.StandaloneDispatcher - Stopped dispatcher akka://flink/user/dispatcher2376f3c1-facc-4710-bce8-40e8d0775b58.
[flink-akka.actor.default-dispatcher-2] INFO org.apache.flink.runtime.io.disk.iomanager.IOManager - I/O manager removed spill file directory /tmp/flink-io-b2a16708-cf21-432a-97d8-e41ad295f0cc
[flink-akka.actor.default-dispatcher-2] INFO org.apache.flink.runtime.io.network.NetworkEnvironment - Shutting down the network environment and its components.
[flink-akka.actor.default-dispatcher-2] INFO org.apache.flink.runtime.taskexecutor.JobLeaderService - Stop job leader service.
[flink-akka.actor.default-dispatcher-2] INFO org.apache.flink.runtime.taskexecutor.TaskExecutor - Stopped TaskExecutor akka://flink/user/taskmanager_42.
[flink-akka.actor.default-dispatcher-2] INFO org.apache.flink.runtime.rpc.akka.AkkaRpcService - Stopping Akka RPC service.
[flink-akka.actor.default-dispatcher-2] INFO org.apache.flink.runtime.blob.PermanentBlobCache - Shutting down BLOB cache
[flink-akka.actor.default-dispatcher-2] INFO org.apache.flink.runtime.blob.TransientBlobCache - Shutting down BLOB cache
[flink-akka.actor.default-dispatcher-2] INFO org.apache.flink.runtime.blob.BlobServer - Stopped BLOB server at 0.0.0.0:38643
[flink-akka.actor.default-dispatcher-2] INFO org.apache.flink.runtime.rpc.akka.AkkaRpcService - Stopped Akka RPC service.
[flink-runner-job-server] INFO org.apache.beam.runners.flink.FlinkRunner - Execution finished in 1886 msecs
[flink-runner-job-server] INFO org.apache.beam.runners.flink.FlinkRunner - Final accumulator values:
[flink-runner-job-server] INFO org.apache.beam.runners.flink.FlinkRunner - __metricscontainers : org.apache.beam.runners.core.metrics.MetricsContainerStepMap@fe9e86d9
INFO:root:Job state changed to DONE
.
----------------------------------------------------------------------
Ran 27 tests in 107.198s
OK (skipped=7)
:beam-sdks-python:flinkCompatibilityMatrixStreamingDOCKER (Thread[Task worker for ':' Thread 7,5,main]) completed. Took 1 mins 49.095 secs.
FAILURE: Build failed with an exception.
* Where:
Build file '<https://builds.apache.org/job/beam_PostCommit_Python_VR_Flink/ws/src/sdks/python/build.gradle'> line: 345
* What went wrong:
Execution failed for task ':beam-sdks-python:flinkCompatibilityMatrixBatchDOCKER'.
> Process 'command 'sh'' finished with non-zero exit value 1
* Try:
Run with --stacktrace option to get the stack trace. Run with --debug option to get more log output. Run with --scan to get full insights.
* Get more help at https://help.gradle.org
Deprecated Gradle features were used in this build, making it incompatible with Gradle 5.0.
Use '--warning-mode all' to show the individual deprecation warnings.
See https://docs.gradle.org/4.10.2/userguide/command_line_interface.html#sec:command_line_warnings
BUILD FAILED in 13m 31s
60 actionable tasks: 55 executed, 4 from cache, 1 up-to-date
Publishing build scan...
https://gradle.com/s/epe4xa3wuuety
Build step 'Invoke Gradle script' changed build result to FAILURE
Build step 'Invoke Gradle script' marked build as failure
---------------------------------------------------------------------
To unsubscribe, e-mail: builds-unsubscribe@beam.apache.org
For additional commands, e-mail: builds-help@beam.apache.org