You are viewing a plain text version of this content. The canonical link for it is here.
Posted to builds@lucene.apache.org by Apache Jenkins Server <je...@builds.apache.org> on 2019/10/03 14:57:35 UTC
[JENKINS] Lucene-Solr-Tests-8.x - Build # 672 - Unstable
Build: https://builds.apache.org/job/Lucene-Solr-Tests-8.x/672/
1 tests failed.
FAILED: org.apache.solr.security.AuditLoggerIntegrationTest.testSynchronous
Error Message:
expected:<3> but was:<2>
Stack Trace:
java.lang.AssertionError: expected:<3> but was:<2>
at __randomizedtesting.SeedInfo.seed([1CCC24AF0F462ADD:AB7A622E239FD600]:0)
at org.junit.Assert.fail(Assert.java:88)
at org.junit.Assert.failNotEquals(Assert.java:834)
at org.junit.Assert.assertEquals(Assert.java:645)
at org.junit.Assert.assertEquals(Assert.java:631)
at org.apache.solr.security.AuditLoggerIntegrationTest.assertThreeAdminEvents(AuditLoggerIntegrationTest.java:255)
at org.apache.solr.security.AuditLoggerIntegrationTest.testSynchronous(AuditLoggerIntegrationTest.java:102)
at sun.reflect.NativeMethodAccessorImpl.invoke0(Native Method)
at sun.reflect.NativeMethodAccessorImpl.invoke(NativeMethodAccessorImpl.java:62)
at sun.reflect.DelegatingMethodAccessorImpl.invoke(DelegatingMethodAccessorImpl.java:43)
at java.lang.reflect.Method.invoke(Method.java:498)
at com.carrotsearch.randomizedtesting.RandomizedRunner.invoke(RandomizedRunner.java:1750)
at com.carrotsearch.randomizedtesting.RandomizedRunner$8.evaluate(RandomizedRunner.java:938)
at com.carrotsearch.randomizedtesting.RandomizedRunner$9.evaluate(RandomizedRunner.java:974)
at com.carrotsearch.randomizedtesting.RandomizedRunner$10.evaluate(RandomizedRunner.java:988)
at com.carrotsearch.randomizedtesting.rules.SystemPropertiesRestoreRule$1.evaluate(SystemPropertiesRestoreRule.java:57)
at org.apache.lucene.util.TestRuleSetupTeardownChained$1.evaluate(TestRuleSetupTeardownChained.java:49)
at org.apache.lucene.util.AbstractBeforeAfterRule$1.evaluate(AbstractBeforeAfterRule.java:45)
at org.apache.lucene.util.TestRuleThreadAndTestName$1.evaluate(TestRuleThreadAndTestName.java:48)
at org.apache.lucene.util.TestRuleIgnoreAfterMaxFailures$1.evaluate(TestRuleIgnoreAfterMaxFailures.java:64)
at org.apache.lucene.util.TestRuleMarkFailure$1.evaluate(TestRuleMarkFailure.java:47)
at com.carrotsearch.randomizedtesting.rules.StatementAdapter.evaluate(StatementAdapter.java:36)
at com.carrotsearch.randomizedtesting.ThreadLeakControl$StatementRunner.run(ThreadLeakControl.java:368)
at com.carrotsearch.randomizedtesting.ThreadLeakControl.forkTimeoutingTask(ThreadLeakControl.java:817)
at com.carrotsearch.randomizedtesting.ThreadLeakControl$3.evaluate(ThreadLeakControl.java:468)
at com.carrotsearch.randomizedtesting.RandomizedRunner.runSingleTest(RandomizedRunner.java:947)
at com.carrotsearch.randomizedtesting.RandomizedRunner$5.evaluate(RandomizedRunner.java:832)
at com.carrotsearch.randomizedtesting.RandomizedRunner$6.evaluate(RandomizedRunner.java:883)
at com.carrotsearch.randomizedtesting.RandomizedRunner$7.evaluate(RandomizedRunner.java:894)
at com.carrotsearch.randomizedtesting.rules.StatementAdapter.evaluate(StatementAdapter.java:36)
at com.carrotsearch.randomizedtesting.rules.SystemPropertiesRestoreRule$1.evaluate(SystemPropertiesRestoreRule.java:57)
at org.apache.lucene.util.AbstractBeforeAfterRule$1.evaluate(AbstractBeforeAfterRule.java:45)
at com.carrotsearch.randomizedtesting.rules.StatementAdapter.evaluate(StatementAdapter.java:36)
at org.apache.lucene.util.TestRuleStoreClassName$1.evaluate(TestRuleStoreClassName.java:41)
at com.carrotsearch.randomizedtesting.rules.NoShadowingOrOverridesOnMethodsRule$1.evaluate(NoShadowingOrOverridesOnMethodsRule.java:40)
at com.carrotsearch.randomizedtesting.rules.NoShadowingOrOverridesOnMethodsRule$1.evaluate(NoShadowingOrOverridesOnMethodsRule.java:40)
at com.carrotsearch.randomizedtesting.rules.StatementAdapter.evaluate(StatementAdapter.java:36)
at com.carrotsearch.randomizedtesting.rules.StatementAdapter.evaluate(StatementAdapter.java:36)
at com.carrotsearch.randomizedtesting.rules.StatementAdapter.evaluate(StatementAdapter.java:36)
at org.apache.lucene.util.TestRuleAssertionsRequired$1.evaluate(TestRuleAssertionsRequired.java:53)
at org.apache.lucene.util.TestRuleMarkFailure$1.evaluate(TestRuleMarkFailure.java:47)
at org.apache.lucene.util.TestRuleIgnoreAfterMaxFailures$1.evaluate(TestRuleIgnoreAfterMaxFailures.java:64)
at org.apache.lucene.util.TestRuleIgnoreTestSuites$1.evaluate(TestRuleIgnoreTestSuites.java:54)
at com.carrotsearch.randomizedtesting.rules.StatementAdapter.evaluate(StatementAdapter.java:36)
at com.carrotsearch.randomizedtesting.ThreadLeakControl$StatementRunner.run(ThreadLeakControl.java:368)
at java.lang.Thread.run(Thread.java:748)
Build Log:
[...truncated 15960 lines...]
[junit4] Suite: org.apache.solr.security.AuditLoggerIntegrationTest
[junit4] 2> 2799177 INFO (SUITE-AuditLoggerIntegrationTest-seed#[1CCC24AF0F462ADD]-worker) [ ] o.a.s.SolrTestCaseJ4 SecureRandom sanity checks: test.solr.allowed.securerandom=null & java.security.egd=file:/dev/./urandom
[junit4] 2> 2799178 INFO (SUITE-AuditLoggerIntegrationTest-seed#[1CCC24AF0F462ADD]-worker) [ ] o.a.s.SolrTestCaseJ4 Created dataDir: /home/jenkins/jenkins-slave/workspace/Lucene-Solr-Tests-8.x/solr/build/solr-core/test/J1/temp/solr.security.AuditLoggerIntegrationTest_1CCC24AF0F462ADD-001/data-dir-272-001
[junit4] 2> 2799178 WARN (SUITE-AuditLoggerIntegrationTest-seed#[1CCC24AF0F462ADD]-worker) [ ] o.a.s.SolrTestCaseJ4 startTrackingSearchers: numOpens=27 numCloses=27
[junit4] 2> 2799178 INFO (SUITE-AuditLoggerIntegrationTest-seed#[1CCC24AF0F462ADD]-worker) [ ] o.a.s.SolrTestCaseJ4 Using PointFields (NUMERIC_POINTS_SYSPROP=true) w/NUMERIC_DOCVALUES_SYSPROP=true
[junit4] 2> 2799180 INFO (SUITE-AuditLoggerIntegrationTest-seed#[1CCC24AF0F462ADD]-worker) [ ] o.a.s.SolrTestCaseJ4 Randomized ssl (false) and clientAuth (false) via: @org.apache.solr.SolrTestCaseJ4$SuppressSSL(bugUrl=None)
[junit4] 2> 2799184 INFO (TEST-AuditLoggerIntegrationTest.searchWithException-seed#[1CCC24AF0F462ADD]) [ ] o.a.s.SolrTestCaseJ4 ###Starting searchWithException
[junit4] 2> 2799187 INFO (TEST-AuditLoggerIntegrationTest.searchWithException-seed#[1CCC24AF0F462ADD]) [ ] o.a.s.c.MiniSolrCloudCluster Starting cluster of 1 servers in /home/jenkins/jenkins-slave/workspace/Lucene-Solr-Tests-8.x/solr/build/solr-core/test/J1/temp/solr.security.AuditLoggerIntegrationTest_1CCC24AF0F462ADD-001/tempDir-001
[junit4] 2> 2799187 INFO (TEST-AuditLoggerIntegrationTest.searchWithException-seed#[1CCC24AF0F462ADD]) [ ] o.a.s.c.ZkTestServer STARTING ZK TEST SERVER
[junit4] 2> 2799188 INFO (ZkTestServer Run Thread) [ ] o.a.s.c.ZkTestServer client port:0.0.0.0/0.0.0.0:0
[junit4] 2> 2799188 INFO (ZkTestServer Run Thread) [ ] o.a.s.c.ZkTestServer Starting server
[junit4] 2> 2799188 INFO (auditTestCallback-13455-thread-1) [ ] o.a.s.s.AuditLoggerIntegrationTest Listening for audit callbacks on on port 38819
[junit4] 2> 2799288 INFO (TEST-AuditLoggerIntegrationTest.searchWithException-seed#[1CCC24AF0F462ADD]) [ ] o.a.s.c.ZkTestServer start zk server on port:35949
[junit4] 2> 2799288 INFO (TEST-AuditLoggerIntegrationTest.searchWithException-seed#[1CCC24AF0F462ADD]) [ ] o.a.s.c.ZkTestServer waitForServerUp: 127.0.0.1:35949
[junit4] 2> 2799288 INFO (TEST-AuditLoggerIntegrationTest.searchWithException-seed#[1CCC24AF0F462ADD]) [ ] o.a.s.c.ZkTestServer parse host and port list: 127.0.0.1:35949
[junit4] 2> 2799288 INFO (TEST-AuditLoggerIntegrationTest.searchWithException-seed#[1CCC24AF0F462ADD]) [ ] o.a.s.c.ZkTestServer connecting to 127.0.0.1 35949
[junit4] 2> 2799291 INFO (TEST-AuditLoggerIntegrationTest.searchWithException-seed#[1CCC24AF0F462ADD]) [ ] o.a.s.c.c.ConnectionManager Waiting for client to connect to ZooKeeper
[junit4] 2> 2799301 INFO (zkConnectionManagerCallback-17909-thread-1) [ ] o.a.s.c.c.ConnectionManager zkClient has connected
[junit4] 2> 2799302 INFO (TEST-AuditLoggerIntegrationTest.searchWithException-seed#[1CCC24AF0F462ADD]) [ ] o.a.s.c.c.ConnectionManager Client is connected to ZooKeeper
[junit4] 2> 2799316 INFO (TEST-AuditLoggerIntegrationTest.searchWithException-seed#[1CCC24AF0F462ADD]) [ ] o.a.s.c.c.ConnectionManager Waiting for client to connect to ZooKeeper
[junit4] 2> 2799320 INFO (zkConnectionManagerCallback-17911-thread-1) [ ] o.a.s.c.c.ConnectionManager zkClient has connected
[junit4] 2> 2799320 INFO (TEST-AuditLoggerIntegrationTest.searchWithException-seed#[1CCC24AF0F462ADD]) [ ] o.a.s.c.c.ConnectionManager Client is connected to ZooKeeper
[junit4] 2> 2799324 INFO (TEST-AuditLoggerIntegrationTest.searchWithException-seed#[1CCC24AF0F462ADD]) [ ] o.a.s.c.c.ConnectionManager Waiting for client to connect to ZooKeeper
[junit4] 2> 2799325 INFO (zkConnectionManagerCallback-17913-thread-1) [ ] o.a.s.c.c.ConnectionManager zkClient has connected
[junit4] 2> 2799325 INFO (TEST-AuditLoggerIntegrationTest.searchWithException-seed#[1CCC24AF0F462ADD]) [ ] o.a.s.c.c.ConnectionManager Client is connected to ZooKeeper
[junit4] 2> 2799432 WARN (jetty-launcher-17914-thread-1) [ ] o.e.j.s.AbstractConnector Ignoring deprecated socket close linger time
[junit4] 2> 2799432 INFO (jetty-launcher-17914-thread-1) [ ] o.a.s.c.s.e.JettySolrRunner Start Jetty (configured port=0, binding port=0)
[junit4] 2> 2799432 INFO (jetty-launcher-17914-thread-1) [ ] o.a.s.c.s.e.JettySolrRunner Trying to start Jetty on port 0 try number 1 ...
[junit4] 2> 2799432 INFO (jetty-launcher-17914-thread-1) [ ] o.e.j.s.Server jetty-9.4.19.v20190610; built: 2019-06-10T16:30:51.723Z; git: afcf563148970e98786327af5e07c261fda175d3; jvm 1.8.0_191-b12
[junit4] 2> 2799435 INFO (jetty-launcher-17914-thread-1) [ ] o.e.j.s.session DefaultSessionIdManager workerName=node0
[junit4] 2> 2799436 INFO (jetty-launcher-17914-thread-1) [ ] o.e.j.s.session No SessionScavenger set, using defaults
[junit4] 2> 2799436 INFO (jetty-launcher-17914-thread-1) [ ] o.e.j.s.session node0 Scavenging every 600000ms
[junit4] 2> 2799436 INFO (jetty-launcher-17914-thread-1) [ ] o.e.j.s.h.ContextHandler Started o.e.j.s.ServletContextHandler@30fdeb29{/solr,null,AVAILABLE}
[junit4] 2> 2799437 INFO (jetty-launcher-17914-thread-1) [ ] o.e.j.s.AbstractConnector Started ServerConnector@5424dc37{HTTP/1.1,[http/1.1, h2c]}{127.0.0.1:39593}
[junit4] 2> 2799437 INFO (jetty-launcher-17914-thread-1) [ ] o.e.j.s.Server Started @2799509ms
[junit4] 2> 2799437 INFO (jetty-launcher-17914-thread-1) [ ] o.a.s.c.s.e.JettySolrRunner Jetty properties: {hostContext=/solr, hostPort=39593}
[junit4] 2> 2799437 ERROR (jetty-launcher-17914-thread-1) [ ] o.a.s.u.StartupLoggingUtils Missing Java Option solr.log.dir. Logging may be missing or incomplete.
[junit4] 2> 2799437 INFO (jetty-launcher-17914-thread-1) [ ] o.a.s.s.SolrDispatchFilter Using logger factory org.apache.logging.slf4j.Log4jLoggerFactory
[junit4] 2> 2799437 INFO (jetty-launcher-17914-thread-1) [ ] o.a.s.s.SolrDispatchFilter ___ _ Welcome to Apache Solr™ version 8.3.0
[junit4] 2> 2799437 INFO (jetty-launcher-17914-thread-1) [ ] o.a.s.s.SolrDispatchFilter / __| ___| |_ _ Starting in cloud mode on port null
[junit4] 2> 2799437 INFO (jetty-launcher-17914-thread-1) [ ] o.a.s.s.SolrDispatchFilter \__ \/ _ \ | '_| Install dir: null
[junit4] 2> 2799437 INFO (jetty-launcher-17914-thread-1) [ ] o.a.s.s.SolrDispatchFilter |___/\___/_|_| Start time: 2019-10-03T14:26:43.548Z
[junit4] 2> 2799441 INFO (jetty-launcher-17914-thread-1) [ ] o.a.s.c.c.ConnectionManager Waiting for client to connect to ZooKeeper
[junit4] 2> 2799442 INFO (zkConnectionManagerCallback-17916-thread-1) [ ] o.a.s.c.c.ConnectionManager zkClient has connected
[junit4] 2> 2799442 INFO (jetty-launcher-17914-thread-1) [ ] o.a.s.c.c.ConnectionManager Client is connected to ZooKeeper
[junit4] 2> 2799443 INFO (jetty-launcher-17914-thread-1) [ ] o.a.s.s.SolrDispatchFilter solr.xml found in ZooKeeper. Loading...
[junit4] 2> 2799713 INFO (jetty-launcher-17914-thread-1) [ ] o.a.s.h.c.HttpShardHandlerFactory Host whitelist initialized: WhitelistHostChecker [whitelistHosts=null, whitelistHostCheckingEnabled=true]
[junit4] 2> 2799716 WARN (jetty-launcher-17914-thread-1) [ ] o.e.j.u.s.S.config Trusting all certificates configured for Client@5eb61658[provider=null,keyStore=null,trustStore=null]
[junit4] 2> 2799716 WARN (jetty-launcher-17914-thread-1) [ ] o.e.j.u.s.S.config No Client EndPointIdentificationAlgorithm configured for Client@5eb61658[provider=null,keyStore=null,trustStore=null]
[junit4] 2> 2799721 WARN (jetty-launcher-17914-thread-1) [ ] o.e.j.u.s.S.config Trusting all certificates configured for Client@3378ddd2[provider=null,keyStore=null,trustStore=null]
[junit4] 2> 2799721 WARN (jetty-launcher-17914-thread-1) [ ] o.e.j.u.s.S.config No Client EndPointIdentificationAlgorithm configured for Client@3378ddd2[provider=null,keyStore=null,trustStore=null]
[junit4] 2> 2799722 INFO (jetty-launcher-17914-thread-1) [ ] o.a.s.c.ZkContainer Zookeeper client=127.0.0.1:35949/solr
[junit4] 2> 2799728 INFO (jetty-launcher-17914-thread-1) [ ] o.a.s.c.c.ConnectionManager Waiting for client to connect to ZooKeeper
[junit4] 2> 2799728 INFO (zkConnectionManagerCallback-17923-thread-1) [ ] o.a.s.c.c.ConnectionManager zkClient has connected
[junit4] 2> 2799729 INFO (jetty-launcher-17914-thread-1) [ ] o.a.s.c.c.ConnectionManager Client is connected to ZooKeeper
[junit4] 2> 2799833 INFO (jetty-launcher-17914-thread-1) [n:127.0.0.1:39593_solr ] o.a.s.c.c.ConnectionManager Waiting for client to connect to ZooKeeper
[junit4] 2> 2799834 INFO (zkConnectionManagerCallback-17925-thread-1) [ ] o.a.s.c.c.ConnectionManager zkClient has connected
[junit4] 2> 2799834 INFO (jetty-launcher-17914-thread-1) [n:127.0.0.1:39593_solr ] o.a.s.c.c.ConnectionManager Client is connected to ZooKeeper
[junit4] 2> 2799994 INFO (jetty-launcher-17914-thread-1) [n:127.0.0.1:39593_solr ] o.a.s.c.OverseerElectionContext I am going to be the leader 127.0.0.1:39593_solr
[junit4] 2> 2799995 INFO (jetty-launcher-17914-thread-1) [n:127.0.0.1:39593_solr ] o.a.s.c.Overseer Overseer (id=72485832250163205-127.0.0.1:39593_solr-n_0000000000) starting
[junit4] 2> 2800005 INFO (jetty-launcher-17914-thread-1) [n:127.0.0.1:39593_solr ] o.a.s.c.c.ConnectionManager Waiting for client to connect to ZooKeeper
[junit4] 2> 2800012 INFO (zkConnectionManagerCallback-17932-thread-1) [ ] o.a.s.c.c.ConnectionManager zkClient has connected
[junit4] 2> 2800012 INFO (jetty-launcher-17914-thread-1) [n:127.0.0.1:39593_solr ] o.a.s.c.c.ConnectionManager Client is connected to ZooKeeper
[junit4] 2> 2800016 INFO (jetty-launcher-17914-thread-1) [n:127.0.0.1:39593_solr ] o.a.s.c.s.i.ZkClientClusterStateProvider Cluster at 127.0.0.1:35949/solr ready
[junit4] 2> 2800020 INFO (OverseerStateUpdate-72485832250163205-127.0.0.1:39593_solr-n_0000000000) [n:127.0.0.1:39593_solr ] o.a.s.c.Overseer Starting to work on the main queue : 127.0.0.1:39593_solr
[junit4] 2> 2800022 INFO (jetty-launcher-17914-thread-1) [n:127.0.0.1:39593_solr ] o.a.s.c.ZkController Register node as live in ZooKeeper:/live_nodes/127.0.0.1:39593_solr
[junit4] 2> 2800026 INFO (OverseerStateUpdate-72485832250163205-127.0.0.1:39593_solr-n_0000000000) [n:127.0.0.1:39593_solr ] o.a.s.c.c.ZkStateReader Updated live nodes from ZooKeeper... (0) -> (1)
[junit4] 2> 2800028 INFO (zkCallback-17931-thread-1) [ ] o.a.s.c.c.ZkStateReader Updated live nodes from ZooKeeper... (0) -> (1)
[junit4] 2> 2800031 INFO (jetty-launcher-17914-thread-1) [n:127.0.0.1:39593_solr ] o.a.s.c.PackageManager clusterprops.json changed , version -1
[junit4] 2> 2800031 INFO (jetty-launcher-17914-thread-1) [n:127.0.0.1:39593_solr ] o.a.s.c.CoreContainer Initializing auditlogger plugin: solr.CallbackAuditLoggerPlugin
[junit4] 2> 2800167 INFO (jetty-launcher-17914-thread-1) [n:127.0.0.1:39593_solr ] o.a.s.h.a.MetricsHistoryHandler No .system collection, keeping metrics history in memory.
[junit4] 2> 2800211 INFO (jetty-launcher-17914-thread-1) [n:127.0.0.1:39593_solr ] o.a.s.m.r.SolrJmxReporter JMX monitoring for 'solr_39593.solr.node' (registry 'solr.node') enabled at server: com.sun.jmx.mbeanserver.JmxMBeanServer@3427585c
[junit4] 2> 2800226 INFO (jetty-launcher-17914-thread-1) [n:127.0.0.1:39593_solr ] o.a.s.m.r.SolrJmxReporter JMX monitoring for 'solr_39593.solr.jvm' (registry 'solr.jvm') enabled at server: com.sun.jmx.mbeanserver.JmxMBeanServer@3427585c
[junit4] 2> 2800226 INFO (jetty-launcher-17914-thread-1) [n:127.0.0.1:39593_solr ] o.a.s.m.r.SolrJmxReporter JMX monitoring for 'solr_39593.solr.jetty' (registry 'solr.jetty') enabled at server: com.sun.jmx.mbeanserver.JmxMBeanServer@3427585c
[junit4] 2> 2800228 INFO (jetty-launcher-17914-thread-1) [n:127.0.0.1:39593_solr ] o.a.s.c.CorePropertiesLocator Found 0 core definitions underneath /home/jenkins/jenkins-slave/workspace/Lucene-Solr-Tests-8.x/solr/build/solr-core/test/J1/temp/solr.security.AuditLoggerIntegrationTest_1CCC24AF0F462ADD-001/tempDir-001/node1/.
[junit4] 2> 2800256 INFO (TEST-AuditLoggerIntegrationTest.searchWithException-seed#[1CCC24AF0F462ADD]) [ ] o.a.s.c.MiniSolrCloudCluster waitForAllNodes: numServers=1
[junit4] 2> 2800258 INFO (TEST-AuditLoggerIntegrationTest.searchWithException-seed#[1CCC24AF0F462ADD]) [ ] o.a.s.c.c.ConnectionManager Waiting for client to connect to ZooKeeper
[junit4] 2> 2800260 INFO (zkConnectionManagerCallback-17938-thread-1) [ ] o.a.s.c.c.ConnectionManager zkClient has connected
[junit4] 2> 2800260 INFO (TEST-AuditLoggerIntegrationTest.searchWithException-seed#[1CCC24AF0F462ADD]) [ ] o.a.s.c.c.ConnectionManager Client is connected to ZooKeeper
[junit4] 2> 2800262 INFO (TEST-AuditLoggerIntegrationTest.searchWithException-seed#[1CCC24AF0F462ADD]) [ ] o.a.s.c.c.ZkStateReader Updated live nodes from ZooKeeper... (0) -> (1)
[junit4] 2> 2800263 INFO (TEST-AuditLoggerIntegrationTest.searchWithException-seed#[1CCC24AF0F462ADD]) [ ] o.a.s.c.s.i.ZkClientClusterStateProvider Cluster at 127.0.0.1:35949/solr ready
[junit4] 2> 2800268 INFO (TEST-AuditLoggerIntegrationTest.searchWithException-seed#[1CCC24AF0F462ADD]) [ ] o.a.s.c.MiniSolrCloudCluster waitForAllNodes: numServers=1
[junit4] 2> 2800270 INFO (qtp1524836635-48153) [n:127.0.0.1:39593_solr ] o.a.s.h.a.CollectionsHandler Invoked Collection Action :create with params pullReplicas=0&name=test&nrtReplicas=1&action=CREATE&numShards=1&tlogReplicas=0&wt=javabin&version=2 and sendToOCPQueue=true
[junit4] 2> 2800278 INFO (OverseerThreadFactory-13464-thread-1-processing-n:127.0.0.1:39593_solr) [n:127.0.0.1:39593_solr ] o.a.s.c.a.c.CreateCollectionCmd Create collection test
[junit4] 2> 2800281 INFO (OverseerThreadFactory-13464-thread-1-processing-n:127.0.0.1:39593_solr) [n:127.0.0.1:39593_solr ] o.a.s.c.c.ZkConfigManager Copying zk node /configs/_default/protwords.txt to /configs/test.AUTOCREATED/protwords.txt
[junit4] 2> 2800284 INFO (OverseerThreadFactory-13464-thread-1-processing-n:127.0.0.1:39593_solr) [n:127.0.0.1:39593_solr ] o.a.s.c.c.ZkConfigManager Copying zk node /configs/_default/managed-schema to /configs/test.AUTOCREATED/managed-schema
[junit4] 2> 2800287 INFO (OverseerThreadFactory-13464-thread-1-processing-n:127.0.0.1:39593_solr) [n:127.0.0.1:39593_solr ] o.a.s.c.c.ZkConfigManager Copying zk node /configs/_default/solrconfig.xml to /configs/test.AUTOCREATED/solrconfig.xml
[junit4] 2> 2800290 INFO (OverseerThreadFactory-13464-thread-1-processing-n:127.0.0.1:39593_solr) [n:127.0.0.1:39593_solr ] o.a.s.c.c.ZkConfigManager Copying zk node /configs/_default/synonyms.txt to /configs/test.AUTOCREATED/synonyms.txt
[junit4] 2> 2800307 INFO (OverseerThreadFactory-13464-thread-1-processing-n:127.0.0.1:39593_solr) [n:127.0.0.1:39593_solr ] o.a.s.c.c.ZkConfigManager Copying zk node /configs/_default/stopwords.txt to /configs/test.AUTOCREATED/stopwords.txt
[junit4] 2> 2800310 INFO (OverseerThreadFactory-13464-thread-1-processing-n:127.0.0.1:39593_solr) [n:127.0.0.1:39593_solr ] o.a.s.c.c.ZkConfigManager Copying zk node /configs/_default/params.json to /configs/test.AUTOCREATED/params.json
[junit4] 2> 2800313 INFO (OverseerThreadFactory-13464-thread-1-processing-n:127.0.0.1:39593_solr) [n:127.0.0.1:39593_solr ] o.a.s.c.c.ZkConfigManager Copying zk node /configs/_default/lang/contractions_it.txt to /configs/test.AUTOCREATED/lang/contractions_it.txt
[junit4] 2> 2800315 INFO (OverseerThreadFactory-13464-thread-1-processing-n:127.0.0.1:39593_solr) [n:127.0.0.1:39593_solr ] o.a.s.c.c.ZkConfigManager Copying zk node /configs/_default/lang/stopwords_no.txt to /configs/test.AUTOCREATED/lang/stopwords_no.txt
[junit4] 2> 2800319 INFO (OverseerThreadFactory-13464-thread-1-processing-n:127.0.0.1:39593_solr) [n:127.0.0.1:39593_solr ] o.a.s.c.c.ZkConfigManager Copying zk node /configs/_default/lang/contractions_ca.txt to /configs/test.AUTOCREATED/lang/contractions_ca.txt
[junit4] 2> 2800321 INFO (OverseerThreadFactory-13464-thread-1-processing-n:127.0.0.1:39593_solr) [n:127.0.0.1:39593_solr ] o.a.s.c.c.ZkConfigManager Copying zk node /configs/_default/lang/stemdict_nl.txt to /configs/test.AUTOCREATED/lang/stemdict_nl.txt
[junit4] 2> 2800324 INFO (OverseerThreadFactory-13464-thread-1-processing-n:127.0.0.1:39593_solr) [n:127.0.0.1:39593_solr ] o.a.s.c.c.ZkConfigManager Copying zk node /configs/_default/lang/stopwords_hy.txt to /configs/test.AUTOCREATED/lang/stopwords_hy.txt
[junit4] 2> 2800327 INFO (OverseerThreadFactory-13464-thread-1-processing-n:127.0.0.1:39593_solr) [n:127.0.0.1:39593_solr ] o.a.s.c.c.ZkConfigManager Copying zk node /configs/_default/lang/stopwords_id.txt to /configs/test.AUTOCREATED/lang/stopwords_id.txt
[junit4] 2> 2800330 INFO (OverseerThreadFactory-13464-thread-1-processing-n:127.0.0.1:39593_solr) [n:127.0.0.1:39593_solr ] o.a.s.c.c.ZkConfigManager Copying zk node /configs/_default/lang/stopwords_et.txt to /configs/test.AUTOCREATED/lang/stopwords_et.txt
[junit4] 2> 2800333 INFO (OverseerThreadFactory-13464-thread-1-processing-n:127.0.0.1:39593_solr) [n:127.0.0.1:39593_solr ] o.a.s.c.c.ZkConfigManager Copying zk node /configs/_default/lang/stopwords_ga.txt to /configs/test.AUTOCREATED/lang/stopwords_ga.txt
[junit4] 2> 2800342 INFO (OverseerThreadFactory-13464-thread-1-processing-n:127.0.0.1:39593_solr) [n:127.0.0.1:39593_solr ] o.a.s.c.c.ZkConfigManager Copying zk node /configs/_default/lang/stopwords_da.txt to /configs/test.AUTOCREATED/lang/stopwords_da.txt
[junit4] 2> 2800345 INFO (OverseerThreadFactory-13464-thread-1-processing-n:127.0.0.1:39593_solr) [n:127.0.0.1:39593_solr ] o.a.s.c.c.ZkConfigManager Copying zk node /configs/_default/lang/stopwords_hi.txt to /configs/test.AUTOCREATED/lang/stopwords_hi.txt
[junit4] 2> 2800348 INFO (OverseerThreadFactory-13464-thread-1-processing-n:127.0.0.1:39593_solr) [n:127.0.0.1:39593_solr ] o.a.s.c.c.ZkConfigManager Copying zk node /configs/_default/lang/stopwords_ja.txt to /configs/test.AUTOCREATED/lang/stopwords_ja.txt
[junit4] 2> 2800354 INFO (OverseerThreadFactory-13464-thread-1-processing-n:127.0.0.1:39593_solr) [n:127.0.0.1:39593_solr ] o.a.s.c.c.ZkConfigManager Copying zk node /configs/_default/lang/stopwords_pt.txt to /configs/test.AUTOCREATED/lang/stopwords_pt.txt
[junit4] 2> 2800357 INFO (OverseerThreadFactory-13464-thread-1-processing-n:127.0.0.1:39593_solr) [n:127.0.0.1:39593_solr ] o.a.s.c.c.ZkConfigManager Copying zk node /configs/_default/lang/stopwords_hu.txt to /configs/test.AUTOCREATED/lang/stopwords_hu.txt
[junit4] 2> 2800360 INFO (OverseerThreadFactory-13464-thread-1-processing-n:127.0.0.1:39593_solr) [n:127.0.0.1:39593_solr ] o.a.s.c.c.ZkConfigManager Copying zk node /configs/_default/lang/stopwords_el.txt to /configs/test.AUTOCREATED/lang/stopwords_el.txt
[junit4] 2> 2800362 INFO (OverseerThreadFactory-13464-thread-1-processing-n:127.0.0.1:39593_solr) [n:127.0.0.1:39593_solr ] o.a.s.c.c.ZkConfigManager Copying zk node /configs/_default/lang/stopwords_ru.txt to /configs/test.AUTOCREATED/lang/stopwords_ru.txt
[junit4] 2> 2800365 INFO (OverseerThreadFactory-13464-thread-1-processing-n:127.0.0.1:39593_solr) [n:127.0.0.1:39593_solr ] o.a.s.c.c.ZkConfigManager Copying zk node /configs/_default/lang/stopwords_tr.txt to /configs/test.AUTOCREATED/lang/stopwords_tr.txt
[junit4] 2> 2800368 INFO (OverseerThreadFactory-13464-thread-1-processing-n:127.0.0.1:39593_solr) [n:127.0.0.1:39593_solr ] o.a.s.c.c.ZkConfigManager Copying zk node /configs/_default/lang/stopwords_ar.txt to /configs/test.AUTOCREATED/lang/stopwords_ar.txt
[junit4] 2> 2800370 INFO (OverseerThreadFactory-13464-thread-1-processing-n:127.0.0.1:39593_solr) [n:127.0.0.1:39593_solr ] o.a.s.c.c.ZkConfigManager Copying zk node /configs/_default/lang/userdict_ja.txt to /configs/test.AUTOCREATED/lang/userdict_ja.txt
[junit4] 2> 2800372 INFO (OverseerThreadFactory-13464-thread-1-processing-n:127.0.0.1:39593_solr) [n:127.0.0.1:39593_solr ] o.a.s.c.c.ZkConfigManager Copying zk node /configs/_default/lang/stopwords_it.txt to /configs/test.AUTOCREATED/lang/stopwords_it.txt
[junit4] 2> 2800375 INFO (OverseerThreadFactory-13464-thread-1-processing-n:127.0.0.1:39593_solr) [n:127.0.0.1:39593_solr ] o.a.s.c.c.ZkConfigManager Copying zk node /configs/_default/lang/stopwords_eu.txt to /configs/test.AUTOCREATED/lang/stopwords_eu.txt
[junit4] 2> 2800377 INFO (OverseerThreadFactory-13464-thread-1-processing-n:127.0.0.1:39593_solr) [n:127.0.0.1:39593_solr ] o.a.s.c.c.ZkConfigManager Copying zk node /configs/_default/lang/stopwords_cz.txt to /configs/test.AUTOCREATED/lang/stopwords_cz.txt
[junit4] 2> 2800380 INFO (OverseerThreadFactory-13464-thread-1-processing-n:127.0.0.1:39593_solr) [n:127.0.0.1:39593_solr ] o.a.s.c.c.ZkConfigManager Copying zk node /configs/_default/lang/stoptags_ja.txt to /configs/test.AUTOCREATED/lang/stoptags_ja.txt
[junit4] 2> 2800382 INFO (OverseerThreadFactory-13464-thread-1-processing-n:127.0.0.1:39593_solr) [n:127.0.0.1:39593_solr ] o.a.s.c.c.ZkConfigManager Copying zk node /configs/_default/lang/contractions_fr.txt to /configs/test.AUTOCREATED/lang/contractions_fr.txt
[junit4] 2> 2800384 INFO (OverseerThreadFactory-13464-thread-1-processing-n:127.0.0.1:39593_solr) [n:127.0.0.1:39593_solr ] o.a.s.c.c.ZkConfigManager Copying zk node /configs/_default/lang/stopwords_de.txt to /configs/test.AUTOCREATED/lang/stopwords_de.txt
[junit4] 2> 2800386 INFO (OverseerThreadFactory-13464-thread-1-processing-n:127.0.0.1:39593_solr) [n:127.0.0.1:39593_solr ] o.a.s.c.c.ZkConfigManager Copying zk node /configs/_default/lang/stopwords_fa.txt to /configs/test.AUTOCREATED/lang/stopwords_fa.txt
[junit4] 2> 2800389 INFO (OverseerThreadFactory-13464-thread-1-processing-n:127.0.0.1:39593_solr) [n:127.0.0.1:39593_solr ] o.a.s.c.c.ZkConfigManager Copying zk node /configs/_default/lang/contractions_ga.txt to /configs/test.AUTOCREATED/lang/contractions_ga.txt
[junit4] 2> 2800391 INFO (OverseerThreadFactory-13464-thread-1-processing-n:127.0.0.1:39593_solr) [n:127.0.0.1:39593_solr ] o.a.s.c.c.ZkConfigManager Copying zk node /configs/_default/lang/stopwords_ca.txt to /configs/test.AUTOCREATED/lang/stopwords_ca.txt
[junit4] 2> 2800393 INFO (OverseerThreadFactory-13464-thread-1-processing-n:127.0.0.1:39593_solr) [n:127.0.0.1:39593_solr ] o.a.s.c.c.ZkConfigManager Copying zk node /configs/_default/lang/stopwords_nl.txt to /configs/test.AUTOCREATED/lang/stopwords_nl.txt
[junit4] 2> 2800395 INFO (OverseerThreadFactory-13464-thread-1-processing-n:127.0.0.1:39593_solr) [n:127.0.0.1:39593_solr ] o.a.s.c.c.ZkConfigManager Copying zk node /configs/_default/lang/stopwords_bg.txt to /configs/test.AUTOCREATED/lang/stopwords_bg.txt
[junit4] 2> 2800397 INFO (OverseerThreadFactory-13464-thread-1-processing-n:127.0.0.1:39593_solr) [n:127.0.0.1:39593_solr ] o.a.s.c.c.ZkConfigManager Copying zk node /configs/_default/lang/stopwords_en.txt to /configs/test.AUTOCREATED/lang/stopwords_en.txt
[junit4] 2> 2800399 INFO (OverseerThreadFactory-13464-thread-1-processing-n:127.0.0.1:39593_solr) [n:127.0.0.1:39593_solr ] o.a.s.c.c.ZkConfigManager Copying zk node /configs/_default/lang/stopwords_lv.txt to /configs/test.AUTOCREATED/lang/stopwords_lv.txt
[junit4] 2> 2800402 INFO (OverseerThreadFactory-13464-thread-1-processing-n:127.0.0.1:39593_solr) [n:127.0.0.1:39593_solr ] o.a.s.c.c.ZkConfigManager Copying zk node /configs/_default/lang/stopwords_es.txt to /configs/test.AUTOCREATED/lang/stopwords_es.txt
[junit4] 2> 2800404 INFO (OverseerThreadFactory-13464-thread-1-processing-n:127.0.0.1:39593_solr) [n:127.0.0.1:39593_solr ] o.a.s.c.c.ZkConfigManager Copying zk node /configs/_default/lang/stopwords_th.txt to /configs/test.AUTOCREATED/lang/stopwords_th.txt
[junit4] 2> 2800406 INFO (OverseerThreadFactory-13464-thread-1-processing-n:127.0.0.1:39593_solr) [n:127.0.0.1:39593_solr ] o.a.s.c.c.ZkConfigManager Copying zk node /configs/_default/lang/stopwords_ro.txt to /configs/test.AUTOCREATED/lang/stopwords_ro.txt
[junit4] 2> 2800408 INFO (OverseerThreadFactory-13464-thread-1-processing-n:127.0.0.1:39593_solr) [n:127.0.0.1:39593_solr ] o.a.s.c.c.ZkConfigManager Copying zk node /configs/_default/lang/stopwords_fr.txt to /configs/test.AUTOCREATED/lang/stopwords_fr.txt
[junit4] 2> 2800411 INFO (OverseerThreadFactory-13464-thread-1-processing-n:127.0.0.1:39593_solr) [n:127.0.0.1:39593_solr ] o.a.s.c.c.ZkConfigManager Copying zk node /configs/_default/lang/stopwords_sv.txt to /configs/test.AUTOCREATED/lang/stopwords_sv.txt
[junit4] 2> 2800419 INFO (OverseerThreadFactory-13464-thread-1-processing-n:127.0.0.1:39593_solr) [n:127.0.0.1:39593_solr ] o.a.s.c.c.ZkConfigManager Copying zk node /configs/_default/lang/stopwords_fi.txt to /configs/test.AUTOCREATED/lang/stopwords_fi.txt
[junit4] 2> 2800421 INFO (OverseerThreadFactory-13464-thread-1-processing-n:127.0.0.1:39593_solr) [n:127.0.0.1:39593_solr ] o.a.s.c.c.ZkConfigManager Copying zk node /configs/_default/lang/hyphenations_ga.txt to /configs/test.AUTOCREATED/lang/hyphenations_ga.txt
[junit4] 2> 2800424 INFO (OverseerThreadFactory-13464-thread-1-processing-n:127.0.0.1:39593_solr) [n:127.0.0.1:39593_solr ] o.a.s.c.c.ZkConfigManager Copying zk node /configs/_default/lang/stopwords_gl.txt to /configs/test.AUTOCREATED/lang/stopwords_gl.txt
[junit4] 2> 2800538 INFO (OverseerStateUpdate-72485832250163205-127.0.0.1:39593_solr-n_0000000000) [n:127.0.0.1:39593_solr ] o.a.s.c.o.SliceMutator createReplica() {
[junit4] 2> "operation":"ADDREPLICA",
[junit4] 2> "collection":"test",
[junit4] 2> "shard":"shard1",
[junit4] 2> "core":"test_shard1_replica_n1",
[junit4] 2> "state":"down",
[junit4] 2> "base_url":"http://127.0.0.1:39593/solr",
[junit4] 2> "type":"NRT",
[junit4] 2> "waitForFinalState":"false"}
[junit4] 2> 2800743 INFO (qtp1524836635-48155) [n:127.0.0.1:39593_solr x:test_shard1_replica_n1 ] o.a.s.h.a.CoreAdminOperation core create command qt=/admin/cores&coreNodeName=core_node2&collection.configName=test.AUTOCREATED&newCollection=true&name=test_shard1_replica_n1&action=CREATE&numShards=1&collection=test&shard=shard1&wt=javabin&version=2&replicaType=NRT
[junit4] 2> 2800743 INFO (qtp1524836635-48155) [n:127.0.0.1:39593_solr x:test_shard1_replica_n1 ] o.a.s.c.TransientSolrCoreCacheDefault Allocating transient cache for 2147483647 transient cores
[junit4] 2> 2801764 INFO (qtp1524836635-48155) [n:127.0.0.1:39593_solr c:test s:shard1 r:core_node2 x:test_shard1_replica_n1 ] o.a.s.c.RequestParams conf resource params.json loaded . version : 0
[junit4] 2> 2801764 INFO (qtp1524836635-48155) [n:127.0.0.1:39593_solr c:test s:shard1 r:core_node2 x:test_shard1_replica_n1 ] o.a.s.c.RequestParams request params refreshed to version 0
[junit4] 2> 2801765 WARN (qtp1524836635-48155) [n:127.0.0.1:39593_solr c:test s:shard1 r:core_node2 x:test_shard1_replica_n1 ] o.a.s.c.SolrConfig Couldn't add files from /home/jenkins/jenkins-slave/workspace/Lucene-Solr-Tests-8.x/solr/build/solr-core/test/J1/temp/solr.security.AuditLoggerIntegrationTest_1CCC24AF0F462ADD-001/tempDir-001/node1/test_shard1_replica_n1/../../../../contrib/extraction/lib filtered by .*\.jar to classpath: /home/jenkins/jenkins-slave/workspace/Lucene-Solr-Tests-8.x/solr/build/solr-core/test/J1/temp/solr.security.AuditLoggerIntegrationTest_1CCC24AF0F462ADD-001/tempDir-001/node1/test_shard1_replica_n1/../../../../contrib/extraction/lib
[junit4] 2> 2801766 WARN (qtp1524836635-48155) [n:127.0.0.1:39593_solr c:test s:shard1 r:core_node2 x:test_shard1_replica_n1 ] o.a.s.c.SolrConfig Couldn't add files from /home/jenkins/jenkins-slave/workspace/Lucene-Solr-Tests-8.x/solr/build/solr-core/test/J1/temp/solr.security.AuditLoggerIntegrationTest_1CCC24AF0F462ADD-001/tempDir-001/node1/test_shard1_replica_n1/../../../../dist filtered by solr-cell-\d.*\.jar to classpath: /home/jenkins/jenkins-slave/workspace/Lucene-Solr-Tests-8.x/solr/build/solr-core/test/J1/temp/solr.security.AuditLoggerIntegrationTest_1CCC24AF0F462ADD-001/tempDir-001/node1/test_shard1_replica_n1/../../../../dist
[junit4] 2> 2801767 WARN (qtp1524836635-48155) [n:127.0.0.1:39593_solr c:test s:shard1 r:core_node2 x:test_shard1_replica_n1 ] o.a.s.c.SolrConfig Couldn't add files from /home/jenkins/jenkins-slave/workspace/Lucene-Solr-Tests-8.x/solr/build/solr-core/test/J1/temp/solr.security.AuditLoggerIntegrationTest_1CCC24AF0F462ADD-001/tempDir-001/node1/test_shard1_replica_n1/../../../../contrib/clustering/lib filtered by .*\.jar to classpath: /home/jenkins/jenkins-slave/workspace/Lucene-Solr-Tests-8.x/solr/build/solr-core/test/J1/temp/solr.security.AuditLoggerIntegrationTest_1CCC24AF0F462ADD-001/tempDir-001/node1/test_shard1_replica_n1/../../../../contrib/clustering/lib
[junit4] 2> 2801767 WARN (qtp1524836635-48155) [n:127.0.0.1:39593_solr c:test s:shard1 r:core_node2 x:test_shard1_replica_n1 ] o.a.s.c.SolrConfig Couldn't add files from /home/jenkins/jenkins-slave/workspace/Lucene-Solr-Tests-8.x/solr/build/solr-core/test/J1/temp/solr.security.AuditLoggerIntegrationTest_1CCC24AF0F462ADD-001/tempDir-001/node1/test_shard1_replica_n1/../../../../dist filtered by solr-clustering-\d.*\.jar to classpath: /home/jenkins/jenkins-slave/workspace/Lucene-Solr-Tests-8.x/solr/build/solr-core/test/J1/temp/solr.security.AuditLoggerIntegrationTest_1CCC24AF0F462ADD-001/tempDir-001/node1/test_shard1_replica_n1/../../../../dist
[junit4] 2> 2801767 WARN (qtp1524836635-48155) [n:127.0.0.1:39593_solr c:test s:shard1 r:core_node2 x:test_shard1_replica_n1 ] o.a.s.c.SolrConfig Couldn't add files from /home/jenkins/jenkins-slave/workspace/Lucene-Solr-Tests-8.x/solr/build/solr-core/test/J1/temp/solr.security.AuditLoggerIntegrationTest_1CCC24AF0F462ADD-001/tempDir-001/node1/test_shard1_replica_n1/../../../../contrib/langid/lib filtered by .*\.jar to classpath: /home/jenkins/jenkins-slave/workspace/Lucene-Solr-Tests-8.x/solr/build/solr-core/test/J1/temp/solr.security.AuditLoggerIntegrationTest_1CCC24AF0F462ADD-001/tempDir-001/node1/test_shard1_replica_n1/../../../../contrib/langid/lib
[junit4] 2> 2801782 WARN (qtp1524836635-48155) [n:127.0.0.1:39593_solr c:test s:shard1 r:core_node2 x:test_shard1_replica_n1 ] o.a.s.c.SolrConfig Couldn't add files from /home/jenkins/jenkins-slave/workspace/Lucene-Solr-Tests-8.x/solr/build/solr-core/test/J1/temp/solr.security.AuditLoggerIntegrationTest_1CCC24AF0F462ADD-001/tempDir-001/node1/test_shard1_replica_n1/../../../../dist filtered by solr-langid-\d.*\.jar to classpath: /home/jenkins/jenkins-slave/workspace/Lucene-Solr-Tests-8.x/solr/build/solr-core/test/J1/temp/solr.security.AuditLoggerIntegrationTest_1CCC24AF0F462ADD-001/tempDir-001/node1/test_shard1_replica_n1/../../../../dist
[junit4] 2> 2801782 WARN (qtp1524836635-48155) [n:127.0.0.1:39593_solr c:test s:shard1 r:core_node2 x:test_shard1_replica_n1 ] o.a.s.c.SolrConfig Couldn't add files from /home/jenkins/jenkins-slave/workspace/Lucene-Solr-Tests-8.x/solr/build/solr-core/test/J1/temp/solr.security.AuditLoggerIntegrationTest_1CCC24AF0F462ADD-001/tempDir-001/node1/test_shard1_replica_n1/../../../../contrib/velocity/lib filtered by .*\.jar to classpath: /home/jenkins/jenkins-slave/workspace/Lucene-Solr-Tests-8.x/solr/build/solr-core/test/J1/temp/solr.security.AuditLoggerIntegrationTest_1CCC24AF0F462ADD-001/tempDir-001/node1/test_shard1_replica_n1/../../../../contrib/velocity/lib
[junit4] 2> 2801783 WARN (qtp1524836635-48155) [n:127.0.0.1:39593_solr c:test s:shard1 r:core_node2 x:test_shard1_replica_n1 ] o.a.s.c.SolrConfig Couldn't add files from /home/jenkins/jenkins-slave/workspace/Lucene-Solr-Tests-8.x/solr/build/solr-core/test/J1/temp/solr.security.AuditLoggerIntegrationTest_1CCC24AF0F462ADD-001/tempDir-001/node1/test_shard1_replica_n1/../../../../dist filtered by solr-velocity-\d.*\.jar to classpath: /home/jenkins/jenkins-slave/workspace/Lucene-Solr-Tests-8.x/solr/build/solr-core/test/J1/temp/solr.security.AuditLoggerIntegrationTest_1CCC24AF0F462ADD-001/tempDir-001/node1/test_shard1_replica_n1/../../../../dist
[junit4] 2> 2801783 WARN (qtp1524836635-48155) [n:127.0.0.1:39593_solr c:test s:shard1 r:core_node2 x:test_shard1_replica_n1 ] o.a.s.c.SolrConfig Couldn't add files from /home/jenkins/jenkins-slave/workspace/Lucene-Solr-Tests-8.x/solr/build/solr-core/test/J1/temp/solr.security.AuditLoggerIntegrationTest_1CCC24AF0F462ADD-001/tempDir-001/node1/test_shard1_replica_n1/../../../../dist filtered by solr-ltr-\d.*\.jar to classpath: /home/jenkins/jenkins-slave/workspace/Lucene-Solr-Tests-8.x/solr/build/solr-core/test/J1/temp/solr.security.AuditLoggerIntegrationTest_1CCC24AF0F462ADD-001/tempDir-001/node1/test_shard1_replica_n1/../../../../dist
[junit4] 2> 2801785 INFO (qtp1524836635-48155) [n:127.0.0.1:39593_solr c:test s:shard1 r:core_node2 x:test_shard1_replica_n1 ] o.a.s.c.SolrConfig Using Lucene MatchVersion: 8.3.0
[junit4] 2> 2801844 INFO (qtp1524836635-48155) [n:127.0.0.1:39593_solr c:test s:shard1 r:core_node2 x:test_shard1_replica_n1 ] o.a.s.s.IndexSchema [test_shard1_replica_n1] Schema name=default-config
[junit4] 2> 2802105 INFO (qtp1524836635-48155) [n:127.0.0.1:39593_solr c:test s:shard1 r:core_node2 x:test_shard1_replica_n1 ] o.a.s.s.IndexSchema Loaded schema default-config/1.6 with uniqueid field id
[junit4] 2> 2802179 INFO (qtp1524836635-48155) [n:127.0.0.1:39593_solr c:test s:shard1 r:core_node2 x:test_shard1_replica_n1 ] o.a.s.c.CoreContainer Creating SolrCore 'test_shard1_replica_n1' using configuration from collection test, trusted=true
[junit4] 2> 2802180 INFO (qtp1524836635-48155) [n:127.0.0.1:39593_solr c:test s:shard1 r:core_node2 x:test_shard1_replica_n1 ] o.a.s.m.r.SolrJmxReporter JMX monitoring for 'solr_39593.solr.core.test.shard1.replica_n1' (registry 'solr.core.test.shard1.replica_n1') enabled at server: com.sun.jmx.mbeanserver.JmxMBeanServer@3427585c
[junit4] 2> 2802180 INFO (qtp1524836635-48155) [n:127.0.0.1:39593_solr c:test s:shard1 r:core_node2 x:test_shard1_replica_n1 ] o.a.s.c.SolrCore [[test_shard1_replica_n1] ] Opening new SolrCore at [/home/jenkins/jenkins-slave/workspace/Lucene-Solr-Tests-8.x/solr/build/solr-core/test/J1/temp/solr.security.AuditLoggerIntegrationTest_1CCC24AF0F462ADD-001/tempDir-001/node1/test_shard1_replica_n1], dataDir=[/home/jenkins/jenkins-slave/workspace/Lucene-Solr-Tests-8.x/solr/build/solr-core/test/J1/temp/solr.security.AuditLoggerIntegrationTest_1CCC24AF0F462ADD-001/tempDir-001/node1/./test_shard1_replica_n1/data/]
[junit4] 2> 2802184 INFO (qtp1524836635-48155) [n:127.0.0.1:39593_solr c:test s:shard1 r:core_node2 x:test_shard1_replica_n1 ] o.a.s.r.XSLTResponseWriter xsltCacheLifetimeSeconds=5
[junit4] 2> 2802270 INFO (qtp1524836635-48155) [n:127.0.0.1:39593_solr c:test s:shard1 r:core_node2 x:test_shard1_replica_n1 ] o.a.s.u.UpdateHandler Using UpdateLog implementation: org.apache.solr.update.UpdateLog
[junit4] 2> 2802270 INFO (qtp1524836635-48155) [n:127.0.0.1:39593_solr c:test s:shard1 r:core_node2 x:test_shard1_replica_n1 ] o.a.s.u.UpdateLog Initializing UpdateLog: dataDir= defaultSyncLevel=FLUSH numRecordsToKeep=100 maxNumLogsToKeep=10 numVersionBuckets=65536
[junit4] 2> 2802272 INFO (qtp1524836635-48155) [n:127.0.0.1:39593_solr c:test s:shard1 r:core_node2 x:test_shard1_replica_n1 ] o.a.s.u.CommitTracker Hard AutoCommit: if uncommitted for 15000ms;
[junit4] 2> 2802272 INFO (qtp1524836635-48155) [n:127.0.0.1:39593_solr c:test s:shard1 r:core_node2 x:test_shard1_replica_n1 ] o.a.s.u.CommitTracker Soft AutoCommit: disabled
[junit4] 2> 2802274 INFO (qtp1524836635-48155) [n:127.0.0.1:39593_solr c:test s:shard1 r:core_node2 x:test_shard1_replica_n1 ] o.a.s.s.SolrIndexSearcher Opening [Searcher@2ed8a8d2[test_shard1_replica_n1] main]
[junit4] 2> 2802276 INFO (qtp1524836635-48155) [n:127.0.0.1:39593_solr c:test s:shard1 r:core_node2 x:test_shard1_replica_n1 ] o.a.s.r.ManagedResourceStorage Configured ZooKeeperStorageIO with znodeBase: /configs/test.AUTOCREATED
[junit4] 2> 2802277 INFO (qtp1524836635-48155) [n:127.0.0.1:39593_solr c:test s:shard1 r:core_node2 x:test_shard1_replica_n1 ] o.a.s.r.ManagedResourceStorage Loaded null at path _rest_managed.json using ZooKeeperStorageIO:path=/configs/test.AUTOCREATED
[junit4] 2> 2802278 INFO (qtp1524836635-48155) [n:127.0.0.1:39593_solr c:test s:shard1 r:core_node2 x:test_shard1_replica_n1 ] o.a.s.s.ZkIndexSchemaReader Creating ZooKeeper watch for the managed schema at /configs/test.AUTOCREATED/managed-schema
[junit4] 2> 2802279 INFO (qtp1524836635-48155) [n:127.0.0.1:39593_solr c:test s:shard1 r:core_node2 x:test_shard1_replica_n1 ] o.a.s.s.ZkIndexSchemaReader Current schema version 0 is already the latest
[junit4] 2> 2802279 INFO (qtp1524836635-48155) [n:127.0.0.1:39593_solr c:test s:shard1 r:core_node2 x:test_shard1_replica_n1 ] o.a.s.h.c.SpellCheckComponent Initializing spell checkers
[junit4] 2> 2802280 INFO (qtp1524836635-48155) [n:127.0.0.1:39593_solr c:test s:shard1 r:core_node2 x:test_shard1_replica_n1 ] o.a.s.s.DirectSolrSpellChecker init: {name=default,field=_text_,classname=solr.DirectSolrSpellChecker,distanceMeasure=internal,accuracy=0.5,maxEdits=2,minPrefix=1,maxInspections=5,minQueryLength=4,maxQueryFrequency=0.01}
[junit4] 2> 2802282 INFO (qtp1524836635-48155) [n:127.0.0.1:39593_solr c:test s:shard1 r:core_node2 x:test_shard1_replica_n1 ] o.a.s.h.ReplicationHandler Commits will be reserved for 10000ms.
[junit4] 2> 2802282 INFO (qtp1524836635-48155) [n:127.0.0.1:39593_solr c:test s:shard1 r:core_node2 x:test_shard1_replica_n1 ] o.a.s.u.UpdateLog Could not find max version in index or recent updates, using new clock 1646382606076346368
[junit4] 2> 2802286 INFO (searcherExecutor-13469-thread-1-processing-n:127.0.0.1:39593_solr x:test_shard1_replica_n1 c:test s:shard1 r:core_node2) [n:127.0.0.1:39593_solr c:test s:shard1 r:core_node2 x:test_shard1_replica_n1 ] o.a.s.c.QuerySenderListener QuerySenderListener sending requests to Searcher@2ed8a8d2[test_shard1_replica_n1] main{ExitableDirectoryReader(UninvertingDirectoryReader())}
[junit4] 2> 2802286 INFO (searcherExecutor-13469-thread-1-processing-n:127.0.0.1:39593_solr x:test_shard1_replica_n1 c:test s:shard1 r:core_node2) [n:127.0.0.1:39593_solr c:test s:shard1 r:core_node2 x:test_shard1_replica_n1 ] o.a.s.c.QuerySenderListener QuerySenderListener done.
[junit4] 2> 2802286 INFO (searcherExecutor-13469-thread-1-processing-n:127.0.0.1:39593_solr x:test_shard1_replica_n1 c:test s:shard1 r:core_node2) [n:127.0.0.1:39593_solr c:test s:shard1 r:core_node2 x:test_shard1_replica_n1 ] o.a.s.h.c.SpellCheckComponent Loading spell index for spellchecker: default
[junit4] 2> 2802287 INFO (searcherExecutor-13469-thread-1-processing-n:127.0.0.1:39593_solr x:test_shard1_replica_n1 c:test s:shard1 r:core_node2) [n:127.0.0.1:39593_solr c:test s:shard1 r:core_node2 x:test_shard1_replica_n1 ] o.a.s.c.SolrCore [test_shard1_replica_n1] Registered new searcher Searcher@2ed8a8d2[test_shard1_replica_n1] main{ExitableDirectoryReader(UninvertingDirectoryReader())}
[junit4] 2> 2802294 INFO (qtp1524836635-48155) [n:127.0.0.1:39593_solr c:test s:shard1 r:core_node2 x:test_shard1_replica_n1 ] o.a.s.c.ZkShardTerms Successful update of terms at /collections/test/terms/shard1 to Terms{values={core_node2=0}, version=0}
[junit4] 2> 2802294 INFO (qtp1524836635-48155) [n:127.0.0.1:39593_solr c:test s:shard1 r:core_node2 x:test_shard1_replica_n1 ] o.a.s.c.ShardLeaderElectionContextBase make sure parent is created /collections/test/leaders/shard1
[junit4] 2> 2802302 INFO (qtp1524836635-48155) [n:127.0.0.1:39593_solr c:test s:shard1 r:core_node2 x:test_shard1_replica_n1 ] o.a.s.c.ShardLeaderElectionContext Enough replicas found to continue.
[junit4] 2> 2802302 INFO (qtp1524836635-48155) [n:127.0.0.1:39593_solr c:test s:shard1 r:core_node2 x:test_shard1_replica_n1 ] o.a.s.c.ShardLeaderElectionContext I may be the new leader - try and sync
[junit4] 2> 2802302 INFO (qtp1524836635-48155) [n:127.0.0.1:39593_solr c:test s:shard1 r:core_node2 x:test_shard1_replica_n1 ] o.a.s.c.SyncStrategy Sync replicas to http://127.0.0.1:39593/solr/test_shard1_replica_n1/
[junit4] 2> 2802303 INFO (qtp1524836635-48155) [n:127.0.0.1:39593_solr c:test s:shard1 r:core_node2 x:test_shard1_replica_n1 ] o.a.s.c.SyncStrategy Sync Success - now sync replicas to me
[junit4] 2> 2802309 INFO (qtp1524836635-48155) [n:127.0.0.1:39593_solr c:test s:shard1 r:core_node2 x:test_shard1_replica_n1 ] o.a.s.c.SyncStrategy http://127.0.0.1:39593/solr/test_shard1_replica_n1/ has no replicas
[junit4] 2> 2802309 INFO (qtp1524836635-48155) [n:127.0.0.1:39593_solr c:test s:shard1 r:core_node2 x:test_shard1_replica_n1 ] o.a.s.c.ShardLeaderElectionContextBase Creating leader registration node /collections/test/leaders/shard1/leader after winning as /collections/test/leader_elect/shard1/election/72485832250163205-core_node2-n_0000000000
[junit4] 2> 2802315 INFO (qtp1524836635-48155) [n:127.0.0.1:39593_solr c:test s:shard1 r:core_node2 x:test_shard1_replica_n1 ] o.a.s.c.ShardLeaderElectionContext I am the new leader: http://127.0.0.1:39593/solr/test_shard1_replica_n1/ shard1
[junit4] 2> 2802418 INFO (zkCallback-17924-thread-1) [ ] o.a.s.c.c.ZkStateReader A cluster state change: [WatchedEvent state:SyncConnected type:NodeDataChanged path:/collections/test/state.json] for collection [test] has occurred - updating... (live nodes size: [1])
[junit4] 2> 2802418 INFO (zkCallback-17924-thread-2) [ ] o.a.s.c.c.ZkStateReader A cluster state change: [WatchedEvent state:SyncConnected type:NodeDataChanged path:/collections/test/state.json] for collection [test] has occurred - updating... (live nodes size: [1])
[junit4] 2> 2802420 INFO (qtp1524836635-48155) [n:127.0.0.1:39593_solr c:test s:shard1 r:core_node2 x:test_shard1_replica_n1 ] o.a.s.c.ZkController I am the leader, no recovery necessary
[junit4] 2> 2802423 INFO (qtp1524836635-48155) [n:127.0.0.1:39593_solr c:test s:shard1 r:core_node2 x:test_shard1_replica_n1 ] o.a.s.s.HttpSolrCall [admin] webapp=null path=/admin/cores params={qt=/admin/cores&coreNodeName=core_node2&collection.configName=test.AUTOCREATED&newCollection=true&name=test_shard1_replica_n1&action=CREATE&numShards=1&collection=test&shard=shard1&wt=javabin&version=2&replicaType=NRT} status=0 QTime=1680
[junit4] 2> 2802517 INFO (qtp1524836635-48155) [n:127.0.0.1:39593_solr c:test s:shard1 r:core_node2 x:test_shard1_replica_n1 ] o.a.s.s.CallbackAuditLoggerPlugin Sent audit callback {"requestUrl":"http://127.0.0.1:39593/solr/admin/cores","nodeName":"n:127.0.0.1:39593_solr","message":"Completed","level":"INFO","date":1570112806542,"clientIp":"127.0.0.1","collections":[],"headers":{"User-Agent":"Solr[org.apache.solr.client.solrj.impl.HttpSolrClient] 1.0","Connection":"keep-alive","internalRequest":"$","Host":"127.0.0.1:39593","Content-Length":"221","Content-Type":"application/x-www-form-urlencoded; charset=UTF-8"},"solrParams":{"qt":["/admin/cores"],"coreNodeName":["core_node2"],"collection.configName":["test.AUTOCREATED"],"newCollection":["true"],"name":["test_shard1_replica_n1"],"action":["CREATE"],"numShards":["1"],"collection":["test"],"shard":["shard1"],"wt":["javabin"],"version":["2"],"replicaType":["NRT"]},"solrHost":"127.0.0.1","solrPort":39593,"solrIp":"127.0.0.1","resource":"/admin/cores","httpMethod":"POST","eventType":"COMPLETED","requestType":"ADMIN","status":200,"qtime":1688.0} to localhost:38819
[junit4] 2> 2802522 INFO (qtp1524836635-48153) [n:127.0.0.1:39593_solr ] o.a.s.h.a.CollectionsHandler Wait for new collection to be active for at most 45 seconds. Check all shard replicas
[junit4] 2> 2802536 INFO (zkCallback-17924-thread-3) [ ] o.a.s.c.c.ZkStateReader A cluster state change: [WatchedEvent state:SyncConnected type:NodeDataChanged path:/collections/test/state.json] for collection [test] has occurred - updating... (live nodes size: [1])
[junit4] 2> 2802536 INFO (zkCallback-17924-thread-2) [ ] o.a.s.c.c.ZkStateReader A cluster state change: [WatchedEvent state:SyncConnected type:NodeDataChanged path:/collections/test/state.json] for collection [test] has occurred - updating... (live nodes size: [1])
[junit4] 2> 2802536 INFO (zkCallback-17924-thread-1) [ ] o.a.s.c.c.ZkStateReader A cluster state change: [WatchedEvent state:SyncConnected type:NodeDataChanged path:/collections/test/state.json] for collection [test] has occurred - updating... (live nodes size: [1])
[junit4] 2> 2802537 INFO (qtp1524836635-48153) [n:127.0.0.1:39593_solr ] o.a.s.s.HttpSolrCall [admin] webapp=null path=/admin/collections params={pullReplicas=0&name=test&nrtReplicas=1&action=CREATE&numShards=1&tlogReplicas=0&wt=javabin&version=2} status=0 QTime=2267
[junit4] 2> 2802570 INFO (qtp1524836635-48153) [n:127.0.0.1:39593_solr ] o.a.s.s.CallbackAuditLoggerPlugin Sent audit callback {"requestUrl":"http://127.0.0.1:39593/solr/admin/collections","nodeName":"n:127.0.0.1:39593_solr","message":"Completed","level":"INFO","date":1570112806649,"clientIp":"127.0.0.1","collections":["test"],"headers":{"User-Agent":"Solr[org.apache.solr.client.solrj.impl.HttpSolrClient] 1.0","Connection":"keep-alive","Host":"127.0.0.1:39593"},"solrParams":{"pullReplicas":["0"],"name":["test"],"nrtReplicas":["1"],"action":["CREATE"],"numShards":["1"],"tlogReplicas":["0"],"wt":["javabin"],"version":["2"]},"solrHost":"127.0.0.1","solrPort":39593,"solrIp":"127.0.0.1","resource":"/admin/collections","httpMethod":"GET","httpQueryString":"action=CREATE&name=test&numShards=1&nrtReplicas=1&pullReplicas=0&tlogReplicas=0&wt=javabin&version=2","eventType":"COMPLETED","requestType":"ADMIN","status":200,"qtime":2267.0} to localhost:38819
[junit4] 2> 2802579 INFO (auditTestCallback-13455-thread-1) [ ] o.a.s.s.AuditLoggerIntegrationTest Received audit event for path /admin/cores
[junit4] 2> 2802581 ERROR (qtp1524836635-48156) [n:127.0.0.1:39593_solr c:test s:shard1 r:core_node2 x:test_shard1_replica_n1 ] o.a.s.h.RequestHandlerBase org.apache.solr.common.SolrException: org.apache.solr.search.SyntaxError: Cannot parse 'a(bc': Encountered "<EOF>" at line 1, column 4.
[junit4] 2> Was expecting one of:
[junit4] 2> <AND> ...
[junit4] 2> <OR> ...
[junit4] 2> <NOT> ...
[junit4] 2> "+" ...
[junit4] 2> "-" ...
[junit4] 2> <BAREOPER> ...
[junit4] 2> "(" ...
[junit4] 2> ")" ...
[junit4] 2> "*" ...
[junit4] 2> "^" ...
[junit4] 2> <QUOTED> ...
[junit4] 2> <TERM> ...
[junit4] 2> <FUZZY_SLOP> ...
[junit4] 2> <PREFIXTERM> ...
[junit4] 2> <WILDTERM> ...
[junit4] 2> <REGEXPTERM> ...
[junit4] 2> "[" ...
[junit4] 2> "{" ...
[junit4] 2> <LPARAMS> ...
[junit4] 2> "filter(" ...
[junit4] 2> <NUMBER> ...
[junit4] 2>
[junit4] 2> at org.apache.solr.handler.component.QueryComponent.prepare(QueryComponent.java:218)
[junit4] 2> at org.apache.solr.handler.component.SearchHandler.handleRequestBody(SearchHandler.java:279)
[junit4] 2> at org.apache.solr.handler.RequestHandlerBase.handleRequest(RequestHandlerBase.java:198)
[junit4] 2> at org.apache.solr.core.SolrCore.execute(SolrCore.java:2609)
[junit4] 2> at org.apache.solr.servlet.HttpSolrCall.execute(HttpSolrCall.java:780)
[junit4] 2> at org.apache.solr.servlet.HttpSolrCall.call(HttpSolrCall.java:566)
[junit4] 2> at org.apache.solr.servlet.SolrDispatchFilter.doFilter(SolrDispatchFilter.java:424)
[junit4] 2> at org.apache.solr.servlet.SolrDispatchFilter.doFilter(SolrDispatchFilter.java:351)
[junit4] 2> at org.eclipse.jetty.servlet.ServletHandler$CachedChain.doFilter(ServletHandler.java:1610)
[junit4] 2> at org.apache.solr.client.solrj.embedded.JettySolrRunner$DebugFilter.doFilter(JettySolrRunner.java:167)
[junit4] 2> at org.eclipse.jetty.servlet.ServletHandler$CachedChain.doFilter(ServletHandler.java:1610)
[junit4] 2> at org.eclipse.jetty.servlet.ServletHandler.doHandle(ServletHandler.java:540)
[junit4] 2> at org.eclipse.jetty.server.handler.ScopedHandler.nextHandle(ScopedHandler.java:255)
[junit4] 2> at org.eclipse.jetty.server.session.SessionHandler.doHandle(SessionHandler.java:1711)
[junit4] 2> at org.eclipse.jetty.server.handler.ScopedHandler.nextHandle(ScopedHandler.java:255)
[junit4] 2> at org.eclipse.jetty.server.handler.ContextHandler.doHandle(ContextHandler.java:1347)
[junit4] 2> at org.eclipse.jetty.server.handler.ScopedHandler.nextScope(ScopedHandler.java:203)
[junit4] 2> at org.eclipse.jetty.servlet.ServletHandler.doScope(ServletHandler.java:480)
[junit4] 2> at org.eclipse.jetty.server.session.SessionHandler.doScope(SessionHandler.java:1678)
[junit4] 2> at org.eclipse.jetty.server.handler.ScopedHandler.nextScope(ScopedHandler.java:201)
[junit4] 2> at org.eclipse.jetty.server.handler.ContextHandler.doScope(ContextHandler.java:1249)
[junit4] 2> at org.eclipse.jetty.server.handler.ScopedHandler.handle(ScopedHandler.java:144)
[junit4] 2> at org.eclipse.jetty.server.handler.HandlerWrapper.handle(HandlerWrapper.java:132)
[junit4] 2> at org.eclipse.jetty.rewrite.handler.RewriteHandler.handle(RewriteHandler.java:335)
[junit4] 2> at org.eclipse.jetty.server.handler.gzip.GzipHandler.handle(GzipHandler.java:753)
[junit4] 2> at org.eclipse.jetty.server.handler.HandlerWrapper.handle(HandlerWrapper.java:132)
[junit4] 2> at org.eclipse.jetty.server.Server.handle(Server.java:505)
[junit4] 2> at org.eclipse.jetty.server.HttpChannel.handle(HttpChannel.java:370)
[junit4] 2> at org.eclipse.jetty.server.HttpConnection.onFillable(HttpConnection.java:267)
[junit4] 2> at org.eclipse.jetty.io.AbstractConnection$ReadCallback.succeeded(AbstractConnection.java:305)
[junit4] 2> at org.eclipse.jetty.io.FillInterest.fillable(FillInterest.java:103)
[junit4] 2> at org.eclipse.jetty.io.ChannelEndPoint$2.run(ChannelEndPoint.java:117)
[junit4] 2> at org.eclipse.jetty.util.thread.QueuedThreadPool.runJob(QueuedThreadPool.java:781)
[junit4] 2> at org.eclipse.jetty.util.thread.QueuedThreadPool$Runner.run(QueuedThreadPool.java:917)
[junit4] 2> at java.lang.Thread.run(Thread.java:748)
[junit4] 2> Caused by: org.apache.solr.search.SyntaxError: Cannot parse 'a(bc': Encountered "<EOF>" at line 1, column 4.
[junit4] 2> Was expecting one of:
[junit4] 2> <AND> ...
[junit4] 2> <OR> ...
[junit4] 2> <NOT> ...
[junit4] 2> "+" ...
[junit4] 2> "-" ...
[junit4] 2> <BAREOPER> ...
[junit4] 2> "(" ...
[junit4] 2> ")" ...
[junit4] 2> "*" ...
[junit4] 2> "^" ...
[junit4] 2> <QUOTED> ...
[junit4] 2> <TERM> ...
[junit4] 2> <FUZZY_SLOP> ...
[junit4] 2> <PREFIXTERM> ...
[junit4] 2> <WILDTERM> ...
[junit4] 2> <REGEXPTERM> ...
[junit4] 2> "[" ...
[junit4] 2> "{" ...
[junit4] 2> <LPARAMS> ...
[junit4] 2> "filter(" ...
[junit4] 2> <NUMBER> ...
[junit4] 2>
[junit4] 2> at org.apache.solr.parser.SolrQueryParserBase.parse(SolrQueryParserBase.java:264)
[junit4] 2> at org.apache.solr.search.LuceneQParser.parse(LuceneQParser.java:49)
[junit4] 2> at org.apache.solr.search.QParser.getQuery(QParser.java:174)
[junit4] 2> at org.apache.solr.handler.component.QueryComponent.prepare(QueryComponent.java:160)
[junit4] 2> ... 34 more
[junit4] 2> Caused by: org.apache.solr.parser.ParseException: Encountered "<EOF>" at line 1, column 4.
[junit4] 2> Was expecting one of:
[junit4] 2> <AND> ...
[junit4] 2> <OR> ...
[junit4] 2> <NOT> ...
[junit4] 2> "+" ...
[junit4] 2> "-" ...
[junit4] 2> <BAREOPER> ...
[junit4] 2> "(" ...
[junit4] 2> ")" ...
[junit4] 2> "*" ...
[junit4] 2> "^" ...
[junit4] 2> <QUOTED> ...
[junit4] 2> <TERM> ...
[junit4] 2> <FUZZY_SLOP> ...
[junit4] 2> <PREFIXTERM> ...
[junit4] 2> <WILDTERM> ...
[junit4] 2> <REGEXPTERM> ...
[junit4] 2> "[" ...
[junit4] 2> "{" ...
[junit4] 2> <LPARAMS> ...
[junit4] 2> "filter(" ...
[junit4] 2> <NUMBER> ...
[junit4] 2>
[junit4] 2> at org.apache.solr.parser.QueryParser.generateParseException(QueryParser.java:885)
[junit4] 2> at org.apache.solr.parser.QueryParser.jj_consume_token(QueryParser.java:767)
[junit4] 2> at org.apache.solr.parser.QueryParser.Clause(QueryParser.java:283)
[junit4] 2> at org.apache.solr.parser.QueryParser.Query(QueryParser.java:222)
[junit4] 2> at org.apache.solr.parser.QueryParser.TopLevelQuery(QueryParser.java:131)
[junit4] 2> at org.apache.solr.parser.SolrQueryParserBase.parse(SolrQueryParserBase.java:260)
[junit4] 2> ... 37 more
[junit4] 2>
[junit4] 2> 2802581 INFO (qtp1524836635-48156) [n:127.0.0.1:39593_solr c:test s:shard1 r:core_node2 x:test_shard1_replica_n1 ] o.a.s.c.S.Request [test_shard1_replica_n1] webapp=/solr path=/select params={q=a(bc&wt=javabin&version=2} status=400 QTime=8
[junit4] 2> 2802593 INFO (auditTestCallback-13455-thread-1) [ ] o.a.s.s.AuditLoggerIntegrationTest Received audit event for path /admin/collections
[junit4] 2> 2802692 INFO (auditTestCallback-13455-thread-1) [ ] o.a.s.s.AuditLoggerIntegrationTest Received audit event for path /select
[junit4] 2> 2802699 INFO (qtp1524836635-48156) [n:127.0.0.1:39593_solr c:test s:shard1 r:core_node2 x:test_shard1_replica_n1 ] o.a.s.s.CallbackAuditLoggerPlugin Sent audit callback {"requestUrl":"http://127.0.0.1:39593/solr/test/select","nodeName":"n:127.0.0.1:39593_solr","message":"Error","level":"ERROR","date":1570112806692,"clientIp":"127.0.0.1","collections":["test"],"headers":{"User-Agent":"Solr[org.apache.solr.client.solrj.impl.HttpSolrClient] 1.0","Connection":"keep-alive","Host":"127.0.0.1:39593"},"solrParams":{"q":["a(bc"],"df":["_text_"],"echoParams":["explicit"],"rows":["10"],"wt":["javabin"],"version":["2"]},"solrHost":"127.0.0.1","solrPort":39593,"solrIp":"127.0.0.1","resource":"/select","httpMethod":"GET","httpQueryString":"q=a%28bc&wt=javabin&version=2","eventType":"ERROR","requestType":"SEARCH","status":400,"exception":{"cause":{"cause":{"stackTrace":[{"methodName":"generateParseException","fileName":"QueryParser.java","lineNumber":885,"className":"org.apache.solr.parser.QueryParser","nativeMethod":false},{"methodName":"jj_consume_token","fileName":"QueryParser.java","lineNumber":767,"className":"org.apache.solr.parser.QueryParser","nativeMethod":false},{"methodName":"Clause","fileName":"QueryParser.java","lineNumber":283,"className":"org.apache.solr.parser.QueryParser","nativeMethod":false},{"methodName":"Query","fileName":"QueryParser.java","lineNumber":222,"className":"org.apache.solr.parser.QueryParser","nativeMethod":false},{"methodName":"TopLevelQuery","fileName":"QueryParser.java","lineNumber":131,"className":"org.apache.solr.parser.QueryParser","nativeMethod":false},{"methodName":"parse","fileName":"SolrQueryParserBase.java","lineNumber":260,"className":"org.apache.solr.parser.SolrQueryParserBase","nativeMethod":false},{"methodName":"parse","fileName":"LuceneQParser.java","lineNumber":49,"className":"org.apache.solr.search.LuceneQParser","nativeMethod":false},{"methodName":"getQuery","fileName":"QParser.java","lineNumber":174,"className":"org.apache.solr.search.QParser","nativeMethod":false},{"methodName":"prepare","fileName":"QueryComponent.java","lineNumber":160,"className":"org.apache.solr.handler.component.QueryComponent","nativeMethod":false},{"methodName":"handleRequestBody","fileName":"SearchHandler.java","lineNumber":279,"className":"org.apache.solr.handler.component.SearchHandler","nativeMethod":false},{"methodName":"handleRequest","fileName":"RequestHandlerBase.java","lineNumber":198,"className":"org.apache.solr.handler.RequestHandlerBase","nativeMethod":false},{"methodName":"execute","fileName":"SolrCore.java","lineNumber":2609,"className":"org.apache.solr.core.SolrCore","nativeMethod":false},{"methodName":"execute","fileName":"HttpSolrCall.java","lineNumber":780,"className":"org.apache.solr.servlet.HttpSolrCall","nativeMethod":false},{"methodName":"call","fileName":"HttpSolrCall.java","lineNumber":566,"className":"org.apache.solr.servlet.HttpSolrCall","nativeMethod":false},{"methodName":"doFilter","fileName":"SolrDispatchFilter.java","lineNumber":424,"className":"org.apache.solr.servlet.SolrDispatchFilter","nativeMethod":false},{"methodName":"doFilter","fileName":"SolrDispatchFilter.java","lineNumber":351,"className":"org.apache.solr.servlet.SolrDispatchFilter","nativeMethod":false},{"methodName":"doFilter","fileName":"ServletHandler.java","lineNumber":1610,"className":"org.eclipse.jetty.servlet.ServletHandler$CachedChain","nativeMethod":false},{"methodName":"doFilter","fileName":"JettySolrRunner.java","lineNumber":167,"className":"org.apache.solr.client.solrj.embedded.JettySolrRunner$DebugFilter","nativeMethod":false},{"methodName":"doFilter","fileName":"ServletHandler.java","lineNumber":1610,"className":"org.eclipse.jetty.servlet.ServletHandler$CachedChain","nativeMethod":false},{"methodName":"doHandle","fileName":"ServletHandler.java","lineNumber":540,"className":"org.eclipse.jetty.servlet.ServletHandler","nativeMethod":false},{"methodName":"nextHandle","fileName":"ScopedHandler.java","lineNumber":255,"className":"org.eclipse.jetty.server.handler.ScopedHandler","nativeMethod":false},{"methodName":"doHandle","fileName":"SessionHandler.java","lineNumber":1711,"className":"org.eclipse.jetty.server.session.SessionHandler","nativeMethod":false},{"methodName":"nextHandle","fileName":"ScopedHandler.java","lineNumber":255,"className":"org.eclipse.jetty.server.handler.ScopedHandler","nativeMethod":false},{"methodName":"doHandle","fileName":"ContextHandler.java","lineNumber":1347,"className":"org.eclipse.jetty.server.handler.ContextHandler","nativeMethod":false},{"methodName":"nextScope","fileName":"ScopedHandler.java","lineNumber":203,"className":"org.eclipse.jetty.server.handler.ScopedHandler","nativeMethod":false},{"methodName":"doScope","fileName":"ServletHandler.java","lineNumber":480,"className":"org.eclipse.jetty.servlet.ServletHandler","nativeMethod":false},{"methodName":"doScope","fileName":"SessionHandler.java","lineNumber":1678,"className":"org.eclipse.jetty.server.session.SessionHandler","nativeMethod":false},{"methodName":"nextScope","fileName":"ScopedHandler.java","lineNumber":201,"className":"org.eclipse.jetty.server.handler.ScopedHandler","nativeMethod":false},{"methodName":"doScope","fileName":"ContextHandler.java","lineNumber":1249,"className":"org.eclipse.jetty.server.handler.ContextHandler","nativeMethod":false},{"methodName":"handle","fileName":"ScopedHandler.java","lineNumber":144,"className":"org.eclipse.jetty.server.handler.ScopedHandler","nativeMethod":false},{"methodName":"handle","fileName":"HandlerWrapper.java","lineNumber":132,"className":"org.eclipse.jetty.server.handler.HandlerWrapper","nativeMethod":false},{"methodName":"handle","fileName":"RewriteHandler.java","lineNumber":335,"className":"org.eclipse.jetty.rewrite.handler.RewriteHandler","nativeMethod":false},{"methodName":"handle","fileName":"GzipHandler.java","lineNumber":753,"className":"org.eclipse.jetty.server.handler.gzip.GzipHandler","nativeMethod":false},{"methodName":"handle","fileName":"HandlerWrapper.java","lineNumber":132,"className":"org.eclipse.jetty.server.handler.HandlerWrapper","nativeMethod":false},{"methodName":"handle","fileName":"Server.java","lineNumber":505,"className":"org.eclipse.jetty.server.Server","nativeMethod":false},{"methodName":"handle","fileName":"HttpChannel.java","lineNumber":370,"className":"org.eclipse.jetty.server.HttpChannel","nativeMethod":false},{"methodName":"onFillable","fileName":"HttpConnection.java","lineNumber":267,"className":"org.eclipse.jetty.server.HttpConnection","nativeMethod":false},{"methodName":"succeeded","fileName":"AbstractConnection.java","lineNumber":305,"className":"org.eclipse.jetty.io.AbstractConnection$ReadCallback","nativeMethod":false},{"methodName":"fillable","fileName":"FillInterest.java","lineNumber":103,"className":"org.eclipse.jetty.io.FillInterest","nativeMethod":false},{"methodName":"run","fileName":"ChannelEndPoint.java","lineNumber":117,"className":"org.eclipse.jetty.io.ChannelEndPoint$2","nativeMethod":false},{"methodName":"runJob","fileName":"QueuedThreadPool.java","lineNumber":781,"className":"org.eclipse.jetty.util.thread.QueuedThreadPool","nativeMethod":false},{"methodName":"run","fileName":"QueuedThreadPool.java","lineNumber":917,"className":"org.eclipse.jetty.util.thread.QueuedThreadPool$Runner","nativeMethod":false},{"methodName":"run","fileName":"Thread.java","lineNumber":748,"className":"java.lang.Thread","nativeMethod":false}],"currentToken":{"kind":25,"beginLine":1,"beginColumn":2,"endLine":1,"endColumn":4,"image":"bc","next":{"kind":0,"beginLine":1,"beginColumn":4,"endLine":1,"endColumn":4,"image":""}},"expectedTokenSequences":[[13],[14],[15],[16],[17],[18],[19],[20],[22],[23],[24],[25],[26],[27],[28],[29],[30],[31],[32],[33],[34]],"tokenImage":["<EOF>","<_NUM_CHAR>","<_ESCAPED_CHAR>","<_TERM_START_CHAR>","<_TERM_CHAR>","<_WHITESPACE>","<_QUOTED_CHAR>","<_SQUOTED_CHAR>","<token of kind 8>","\"/*\"","\"*/\"","<token of kind 11>","<token of kind 12>","<AND>","<OR>","<NOT>","\"+\"","\"-\"","<BAREOPER>","\"(\"","\")\"","\":\"","\"*\"","\"^\"","<QUOTED>","<TERM>","<FUZZY_SLOP>","<PREFIXTERM>","<WILDTERM>","<REGEXPTERM>","\"[\"","\"{\"","<LPARAMS>","\"filter(\"","<NUMBER>","\"TO\"","\"]\"","\"}\"","<RANGE_QUOTED>","<RANGE_GOOP>"],"message":"Encountered \"<EOF>\" at line 1, column 4.\nWas expecting one of:\n <AND> ...\n <OR> ...\n <NOT> ...\n \"+\" ...\n \"-\" ...\n <BAREOPER> ...\n \"(\" ...\n \")\" ...\n \"*\" ...\n \"^\" ...\n <QUOTED> ...\n <TERM> ...\n <FUZZY_SLOP> ...\n <PREFIXTERM> ...\n <WILDTERM> ...\n <REGEXPTERM> ...\n \"[\" ...\n \"{\" ...\n <LPARAMS> ...\n \"filter(\" ...\n <NUMBER> ...\n ","localizedMessage":"Encountered \"<EOF>\" at line 1, column 4.\nWas expecting one of:\n <AND> ...\n <OR> ...\n <NOT> ...\n \"+\" ...\n \"-\" ...\n <BAREOPER> ...\n \"(\" ...\n \")\" ...\n \"*\" ...\n \"^\" ...\n <QUOTED> ...\n <TERM> ...\n <FUZZY_SLOP> ...\n <PREFIXTERM> ...\n <WILDTERM> ...\n <REGEXPTERM> ...\n \"[\" ...\n \"{\" ...\n <LPARAMS> ...\n \"filter(\" ...\n <NUMBER> ...\n ","suppressed":[]},"stackTrace":[{"methodName":"parse","fileName":"SolrQueryParserBase.java","lineNumber":264,"className":"org.apache.solr.parser.SolrQueryParserBase","nativeMethod":false},{"methodName":"parse","fileName":"LuceneQParser.java","lineNumber":49,"className":"org.apache.solr.search.LuceneQParser","nativeMethod":false},{"methodName":"getQuery","fileName":"QParser.java","lineNumber":174,"className":"org.apache.solr.search.QParser","nativeMethod":false},{"methodName":"prepare","fileName":"QueryComponent.java","lineNumber":160,"className":"org.apache.solr.handler.component.QueryComponent","nativeMethod":false},{"methodName":"handleRequestBody","fileName":"SearchHandler.java","lineNumber":279,"className":"org.apache.solr.handler.component.SearchHandler","nativeMethod":false},{"methodName":"handleRequest","fileName":"RequestHandlerBase.java","lineNumber":198,"className":"org.apache.solr.handler.RequestHandlerBase","nativeMethod":false},{"methodName":"execute","fileName":"SolrCore.java","lineNumber":2609,"className":"org.apache.solr.core.SolrCore","...
[junit4] 2> 2802700 ERROR (TEST-AuditLoggerIntegrationTest.searchWithException-seed#[1CCC24AF0F462ADD]) [ ] o.a.s.c.s.i.BaseCloudSolrClient Request to collection [test] failed due to (400) org.apache.solr.client.solrj.impl.HttpSolrClient$RemoteSolrException: Error from server at http://127.0.0.1:39593/solr/test: org.apache.solr.search.SyntaxError: Cannot parse 'a(bc': Encountered "<EOF>" at line 1, column 4.
[junit4] 2> Was expecting one of:
[junit4] 2> <AND> ...
[junit4] 2> <OR> ...
[junit4] 2> <NOT> ...
[junit4] 2> "+" ...
[junit4] 2> "-" ...
[junit4] 2> <BAREOPER> ...
[junit4] 2> "(" ...
[junit4] 2> ")" ...
[junit4] 2> "*" ...
[junit4] 2> "^" ...
[junit4] 2> <QUOTED> ...
[junit4] 2> <TERM> ...
[junit4] 2> <FUZZY_SLOP> ...
[junit4] 2> <PREFIXTERM> ...
[junit4] 2> <WILDTERM> ...
[junit4] 2> <REGEXPTERM> ...
[junit4] 2> "[" ...
[junit4] 2> "{" ...
[junit4] 2> <LPARAMS> ...
[junit4] 2> "filter(" ...
[junit4] 2> <NUMBER> ...
[junit4] 2> , retry=0 commError=false errorCode=400
[junit4] 2> 2802700 INFO (TEST-AuditLoggerIntegrationTest.searchWithException-seed#[1CCC24AF0F462ADD]) [ ] o.a.s.c.s.i.BaseCloudSolrClient request was not communication error it seems
[junit4] 2> 2802803 INFO (jetty-closer-17940-thread-1) [ ] o.a.s.c.CoreContainer Shutting down CoreContainer instance=1596925725
[junit4] 2> 2802804 INFO (jetty-closer-17940-thread-1) [ ] o.a.s.c.ZkController Remove node as live in ZooKeeper:/live_nodes/127.0.0.1:39593_solr
[junit4] 2> 2802804 INFO (jetty-closer-17940-thread-1) [ ] o.a.s.c.ZkController Publish this node as DOWN...
[junit4] 2> 2802804 INFO (jetty-closer-17940-thread-1) [ ] o.a.s.c.ZkController Publish node=127.0.0.1:39593_solr as DOWN
[junit4] 2> 2802808 INFO (coreCloseExecutor-13474-thread-1) [n:127.0.0.1:39593_solr c:test s:shard1 r:core_node2 x:test_shard1_replica_n1 ] o.a.s.c.SolrCore [test_shard1_replica_n1] CLOSING SolrCore org.apache.solr.core.SolrCore@6384fc49
[junit4] 2> 2802808 INFO (coreCloseExecutor-13474-thread-1) [n:127.0.0.1:39593_solr c:test s:shard1 r:core_node2 x:test_shard1_replica_n1 ] o.a.s.m.SolrMetricManager Closing metric reporters for registry=solr.core.test.shard1.replica_n1, tag=6384fc49
[junit4] 2> 2802808 INFO (coreCloseExecutor-13474-thread-1) [n:127.0.0.1:39593_solr c:test s:shard1 r:core_node2 x:test_shard1_replica_n1 ] o.a.s.m.r.SolrJmxReporter Closing reporter [org.apache.solr.metrics.reporters.SolrJmxReporter@65029eb0: rootName = solr_39593, domain = solr.core.test.shard1.replica_n1, service url = null, agent id = null] for registry solr.core.test.shard1.replica_n1 / com.codahale.metrics.MetricRegistry@5d27d268
[junit4] 2> 2802823 INFO (coreCloseExecutor-13474-thread-1) [n:127.0.0.1:39593_solr c:test s:shard1 r:core_node2 x:test_shard1_replica_n1 ] o.a.s.m.SolrMetricManager Closing metric reporters for registry=solr.collection.test.shard1.leader, tag=6384fc49
[junit4] 2> 2802825 INFO (jetty-closer-17940-thread-1) [ ] o.a.s.m.SolrMetricManager Closing metric reporters for registry=solr.node, tag=null
[junit4] 2> 2802825 INFO (jetty-closer-17940-thread-1) [ ] o.a.s.m.r.SolrJmxReporter Closing reporter [org.apache.solr.metrics.reporters.SolrJmxReporter@2c52cfe8: rootName = solr_39593, domain = solr.node, service url = null, agent id = null] for registry solr.node / com.codahale.metrics.MetricRegistry@5d4438ee
[junit4] 2> 2802832 INFO (jetty-closer-17940-thread-1) [ ] o.a.s.m.SolrMetricManager Closing metric reporters for registry=solr.jvm, tag=null
[junit4] 2> 2802832 INFO (jetty-closer-17940-thread-1) [ ] o.a.s.m.r.SolrJmxReporter Closing reporter [org.apache.solr.metrics.reporters.SolrJmxReporter@6c3c0952: rootName = solr_39593, domain = solr.jvm, service url = null, agent id = null] for registry solr.jvm / com.codahale.metrics.MetricRegistry@4c37dc62
[junit4] 2> 2802835 INFO (jetty-closer-17940-thread-1) [ ] o.a.s.m.SolrMetricManager Closing metric reporters for registry=solr.jetty, tag=null
[junit4] 2> 2802835 INFO (jetty-closer-17940-thread-1) [ ] o.a.s.m.r.SolrJmxReporter Closing reporter [org.apache.solr.metrics.reporters.SolrJmxReporter@1ece00b9: rootName = solr_39593, domain = solr.jetty, service url = null, agent id = null] for registry solr.jetty / com.codahale.metrics.MetricRegistry@34f6da7b
[junit4] 2> 2802835 INFO (jetty-closer-17940-thread-1) [ ] o.a.s.m.SolrMetricManager Closing metric reporters for registry=solr.cluster, tag=null
[junit4] 2> 2802836 INFO (closeThreadPool-17944-thread-2) [ ] o.a.s.c.Overseer Overseer (id=72485832250163205-127.0.0.1:39593_solr-n_0000000000) closing
[junit4] 2> 2802841 INFO (OverseerStateUpdate-72485832250163205-127.0.0.1:39593_solr-n_0000000000) [n:127.0.0.1:39593_solr ] o.a.s.c.Overseer Overseer Loop exiting : 127.0.0.1:39593_solr
[junit4] 2> 2802842 INFO (OverseerAutoScalingTriggerThread-72485832250163205-127.0.0.1:39593_solr-n_0000000000) [ ] o.a.s.c.a.OverseerTriggerThread OverseerTriggerThread woken up but we are closed, exiting.
[junit4] 2> 2802845 INFO (closeThreadPool-17944-thread-1) [ ] o.a.s.c.Overseer Overseer (id=72485832250163205-127.0.0.1:39593_solr-n_0000000000) closing
[junit4] 2> 2802942 INFO (jetty-closer-17940-thread-1) [ ] o.a.s.c.Overseer Overseer (id=72485832250163205-127.0.0.1:39593_solr-n_0000000000) closing
[junit4] 2> 2803049 INFO (jetty-closer-17940-thread-1) [ ] o.e.j.s.AbstractConnector Stopped ServerConnector@5424dc37{HTTP/1.1,[http/1.1, h2c]}{127.0.0.1:0}
[junit4] 2> 2803050 INFO (jetty-closer-17940-thread-1) [ ] o.e.j.s.h.ContextHandler Stopped o.e.j.s.ServletContextHandler@30fdeb29{/solr,null,UNAVAILABLE}
[junit4] 2> 2803051 INFO (jetty-closer-17940-thread-1) [ ] o.e.j.s.session node0 Stopped scavenging
[junit4] 2> 2803051 INFO (TEST-AuditLoggerIntegrationTest.searchWithException-seed#[1CCC24AF0F462ADD]) [ ] o.a.s.c.ZkTestServer Shutting down ZkTestServer.
[junit4] 2> 2803257 WARN (ZkTestServer Run Thread) [ ] o.a.s.c.ZkTestServer Watch limit violations:
[junit4] 2> Maximum concurrent create/delete watches above limit:
[junit4] 2>
[junit4] 2> 3 /solr/aliases.json
[junit4] 2> 3 /solr/clusterprops.json
[junit4] 2> 2 /solr/collections/test/terms/shard1
[junit4] 2>
[junit4] 2> Maximum concurrent data watches above limit:
[junit4] 2>
[junit4] 2> 9 /solr/collections/test/state.json
[junit4] 2> 3 /solr/clusterstate.json
[junit4] 2>
[junit4] 2> Maximum concurrent children watches above limit:
[junit4] 2>
[junit4] 2> 11 /solr/overseer/queue
[junit4] 2> 6 /solr/collections
[junit4] 2> 5 /solr/live_nodes
[junit4] 2> 5 /solr/overseer/collection-queue-work
[junit4] 2>
[junit4] 2> 2803261 INFO (TEST-AuditLoggerIntegrationTest.searchWithException-seed#[1CCC24AF0F462ADD]) [ ] o.a.s.c.ZkTestServer waitForServerDown: 127.0.0.1:35949
[junit4] 2> 2803261 INFO (TEST-AuditLoggerIntegrationTest.searchWithException-seed#[1CCC24AF0F462ADD]) [ ] o.a.s.c.ZkTestServer parse host and port list: 127.0.0.1:35949
[junit4] 2> 2803261 INFO (TEST-AuditLoggerIntegrationTest.searchWithException-seed#[1CCC24AF0F462ADD]) [ ] o.a.s.c.ZkTestServer connecting to 127.0.0.1 35949
[junit4] 2> 2803261 INFO (TEST-AuditLoggerIntegrationTest.searchWithException-seed#[1CCC24AF0F462ADD]) [ ] o.a.s.SolrTestCaseJ4 ###Ending searchWithException
[junit4] 2> 2803266 INFO (TEST-AuditLoggerIntegrationTest.testSynchronous-seed#[1CCC24AF0F462ADD]) [ ] o.a.s.SolrTestCaseJ4 ###Starting testSynchronous
[junit4] 2> 2803267 INFO (auditTestCallback-13476-thread-1) [ ] o.a.s.s.AuditLoggerIntegrationTest Listening for audit callbacks on on port 35835
[junit4] 2> 2803268 INFO (TEST-AuditLoggerIntegrationTest.testSynchronous-seed#[1CCC24AF0F462ADD]) [ ] o.a.s.c.MiniSolrCloudCluster Starting cluster of 1 servers in /home/jenkins/jenkins-slave/workspace/Lucene-Solr-Tests-8.x/solr/build/solr-core/test/J1/temp/solr.security.AuditLoggerIntegrationTest_1CCC24AF0F462ADD-001/tempDir-002
[junit4] 2> 2803268 INFO (TEST-AuditLoggerIntegrationTest.testSynchronous-seed#[1CCC24AF0F462ADD]) [ ] o.a.s.c.ZkTestServer STARTING ZK TEST SERVER
[junit4] 2> 2803268 INFO (ZkTestServer Run Thread) [ ] o.a.s.c.ZkTestServer client port:0.0.0.0/0.0.0.0:0
[junit4] 2> 2803268 INFO (ZkTestServer Run Thread) [ ] o.a.s.c.ZkTestServer Starting server
[junit4] 2> 2803368 INFO (TEST-AuditLoggerIntegrationTest.testSynchronous-seed#[1CCC24AF0F462ADD]) [ ] o.a.s.c.ZkTestServer start zk server on port:43687
[junit4] 2> 2803368 INFO (TEST-AuditLoggerIntegrationTest.testSynchronous-seed#[1CCC24AF0F462ADD]) [ ] o.a.s.c.ZkTestServer waitForServerUp: 127.0.0.1:43687
[junit4] 2> 2803369 INFO (TEST-AuditLoggerIntegrationTest.testSynchronous-seed#[1CCC24AF0F462ADD]) [ ] o.a.s.c.ZkTestServer parse host and port list: 127.0.0.1:43687
[junit4] 2> 2803369 INFO (TEST-AuditLoggerIntegrationTest.testSynchronous-seed#[1CCC24AF0F462ADD]) [ ] o.a.s.c.ZkTestServer connecting to 127.0.0.1 43687
[junit4] 2> 2803371 INFO (TEST-AuditLoggerIntegrationTest.testSynchronous-seed#[1CCC24AF0F462ADD]) [ ] o.a.s.c.c.ConnectionManager Waiting for client to connect to ZooKeeper
[junit4] 2> 2803374 INFO (zkConnectionManagerCallback-17946-thread-1) [ ] o.a.s.c.c.ConnectionManager zkClient has connected
[junit4] 2> 2803374 INFO (TEST-AuditLoggerIntegrationTest.testSynchronous-seed#[1CCC24AF0F462ADD]) [ ] o.a.s.c.c.ConnectionManager Client is connected to ZooKeeper
[junit4] 2> 2803379 INFO (TEST-AuditLoggerIntegrationTest.testSynchronous-seed#[1CCC24AF0F462ADD]) [ ] o.a.s.c.c.ConnectionManager Waiting for client to connect to ZooKeeper
[junit4] 2> 2803380 INFO (zkConnectionManagerCallback-17948-thread-1) [ ] o.a.s.c.c.ConnectionManager zkClient has connected
[junit4] 2> 2803380 INFO (TEST-AuditLoggerIntegrationTest.testSynchronous-seed#[1CCC24AF0F462ADD]) [ ] o.a.s.c.c.ConnectionManager Client is connected to ZooKeeper
[junit4] 2> 2803381 INFO (TEST-AuditLoggerIntegrationTest.testSynchronous-seed#[1CCC24AF0F462ADD]) [ ] o.a.s.c.c.ConnectionManager Waiting for client to connect to ZooKeeper
[junit4] 2> 2803383 INFO (zkConnectionManagerCallback-17950-thread-1) [ ] o.a.s.c.c.ConnectionManager zkClient has connected
[junit4] 2> 2803383 INFO (TEST-AuditLoggerIntegrationTest.testSynchronous-seed#[1CCC24AF0F462ADD]) [ ] o.a.s.c.c.ConnectionManager Client is connected to ZooKeeper
[junit4] 2> 2803488 WARN (jetty-launcher-17951-thread-1) [ ] o.e.j.s.AbstractConnector Ignoring deprecated socket close linger time
[junit4] 2> 2803488 INFO (jetty-launcher-17951-thread-1) [ ] o.a.s.c.s.e.JettySolrRunner Start Jetty (configured port=0, binding port=0)
[junit4] 2> 2803488 INFO (jetty-launcher-17951-thread-1) [ ] o.a.s.c.s.e.JettySolrRunner Trying to start Jetty on port 0 try number 1 ...
[junit4] 2> 2803488 INFO (jetty-launcher-17951-thread-1) [ ] o.e.j.s.Server jetty-9.4.19.v20190610; built: 2019-06-10T16:30:51.723Z; git: afcf563148970e98786327af5e07c261fda175d3; jvm 1.8.0_191-b12
[junit4] 2> 2803500 INFO (jetty-launcher-17951-thread-1) [ ] o.e.j.s.session DefaultSessionIdManager workerName=node0
[junit4] 2> 2803500 INFO (jetty-launcher-17951-thread-1) [ ] o.e.j.s.session No SessionScavenger set, using defaults
[junit4] 2> 2803500 INFO (jetty-launcher-17951-thread-1) [ ] o.e.j.s.session node0 Scavenging every 600000ms
[junit4] 2> 2803501 INFO (jetty-launcher-17951-thread-1) [ ] o.e.j.s.h.ContextHandler Started o.e.j.s.ServletContextHandler@55fffa3f{/solr,null,AVAILABLE}
[junit4] 2> 2803502 INFO (jetty-launcher-17951-thread-1) [ ] o.e.j.s.AbstractConnector Started ServerConnector@16266c9e{HTTP/1.1,[http/1.1, h2c]}{127.0.0.1:36967}
[junit4] 2> 2803502 INFO (jetty-launcher-17951-thread-1) [ ] o.e.j.s.Server Started @2803574ms
[junit4] 2> 2803502 INFO (jetty-launcher-17951-thread-1) [ ] o.a.s.c.s.e.JettySolrRunner Jetty properties: {hostContext=/solr, hostPort=36967}
[junit4] 2> 2803502 ERROR (jetty-launcher-17951-thread-1) [ ] o.a.s.u.StartupLoggingUtils Missing Java Option solr.log.dir. Logging may be missing or incomplete.
[junit4] 2> 2803502 INFO (jetty-launcher-17951-thread-1) [ ] o.a.s.s.SolrDispatchFilter Using logger factory org.apache.logging.slf4j.Log4jLoggerFactory
[junit4] 2> 2803502 INFO (jetty-launcher-17951-thread-1) [ ] o.a.s.s.SolrDispatchFilter ___ _ Welcome to Apache Solr™ version 8.3.0
[junit4] 2> 2803502 INFO (jetty-launcher-17951-thread-1) [ ] o.a.s.s.SolrDispatchFilter / __| ___| |_ _ Starting in cloud mode on port null
[junit4] 2> 2803502 INFO (jetty-launcher-17951-thread-1) [ ] o.a.s.s.SolrDispatchFilter \__ \/ _ \ | '_| Install dir: null
[junit4] 2> 2803502 INFO (jetty-launcher-17951-thread-1) [ ] o.a.s.s.SolrDispatchFilter |___/\___/_|_| Start time: 2019-10-03T14:26:47.613Z
[junit4] 2> 2803507 INFO (jetty-launcher-17951-thread-1) [ ] o.a.s.c.c.ConnectionManager Waiting for client to connect to ZooKeeper
[junit4] 2> 2803515 INFO (zkConnectionManagerCallback-17953-thread-1) [ ] o.a.s.c.c.ConnectionManager zkClient has connected
[junit4] 2> 2803515 INFO (jetty-launcher-17951-thread-1) [ ] o.a.s.c.c.ConnectionManager Client is connected to ZooKeeper
[junit4] 2> 2803516 INFO (jetty-launcher-17951-thread-1) [ ] o.a.s.s.SolrDispatchFilter solr.xml found in ZooKeeper. Loading...
[junit4] 2> 2803789 INFO (jetty-launcher-17951-thread-1) [ ] o.a.s.h.c.HttpShardHandlerFactory Host whitelist initialized: WhitelistHostChecker [whitelistHosts=null, whitelistHostCheckingEnabled=true]
[junit4] 2> 2803790 WARN (jetty-launcher-17951-thread-1) [ ] o.e.j.u.s.S.config Trusting all certificates configured for Client@537f66ea[provider=null,keyStore=null,trustStore=null]
[junit4] 2> 2803790 WARN (jetty-launcher-17951-thread-1) [ ] o.e.j.u.s.S.config No Client EndPointIdentificationAlgorithm configured for Client@537f66ea[provider=null,keyStore=null,trustStore=null]
[junit4] 2> 2803793 WARN (jetty-launcher-17951-thread-1) [ ] o.e.j.u.s.S.config Trusting all certificates configured for Client@37259cbd[provider=null,keyStore=null,trustStore=null]
[junit4] 2> 2803793 WARN (jetty-launcher-17951-thread-1) [ ] o.e.j.u.s.S.config No Client EndPointIdentificationAlgorithm configured for Client@37259cbd[provider=null,keyStore=null,trustStore=null]
[junit4] 2> 2803794 INFO (jetty-launcher-17951-thread-1) [ ] o.a.s.c.ZkContainer Zookeeper client=127.0.0.1:43687/solr
[junit4] 2> 2803795 INFO (jetty-launcher-17951-thread-1) [ ] o.a.s.c.c.ConnectionManager Waiting for client to connect to ZooKeeper
[junit4] 2> 2803799 INFO (zkConnectionManagerCallback-17960-thread-1) [ ] o.a.s.c.c.ConnectionManager zkClient has connected
[junit4] 2> 2803800 INFO (jetty-launcher-17951-thread-1) [ ] o.a.s.c.c.ConnectionManager Client is connected to ZooKeeper
[junit4] 2> 2803904 INFO (jetty-launcher-17951-thread-1) [n:127.0.0.1:36967_solr ] o.a.s.c.c.ConnectionManager Waiting for client to connect to ZooKeeper
[junit4] 2> 2803906 INFO (zkConnectionManagerCallback-17962-thread-1) [ ] o.a.s.c.c.ConnectionManager zkClient has connected
[junit4] 2> 2803906 INFO (jetty-launcher-17951-thread-1) [n:127.0.0.1:36967_solr ] o.a.s.c.c.ConnectionManager Client is connected to ZooKeeper
[junit4] 2> 2804095 INFO (jetty-launcher-17951-thread-1) [n:127.0.0.1:36967_solr ] o.a.s.c.OverseerElectionContext I am going to be the leader 127.0.0.1:36967_solr
[junit4] 2> 2804097 INFO (jetty-launcher-17951-thread-1) [n:127.0.0.1:36967_solr ] o.a.s.c.Overseer Overseer (id=72485832517419013-127.0.0.1:36967_solr-n_0000000000) starting
[junit4] 2> 2804122 INFO (jetty-launcher-17951-thread-1) [n:127.0.0.1:36967_solr ] o.a.s.c.c.ConnectionManager Waiting for client to connect to ZooKeeper
[junit4] 2> 2804125 INFO (zkConnectionManagerCallback-17969-thread-1) [ ] o.a.s.c.c.ConnectionManager zkClient has connected
[junit4] 2> 2804125 INFO (jetty-launcher-17951-thread-1) [n:127.0.0.1:36967_solr ] o.a.s.c.c.ConnectionManager Client is connected to ZooKeeper
[junit4] 2> 2804130 INFO (jetty-launcher-17951-thread-1) [n:127.0.0.1:36967_solr ] o.a.s.c.s.i.ZkClientClusterStateProvider Cluster at 127.0.0.1:43687/solr ready
[junit4] 2> 2804137 INFO (OverseerStateUpdate-72485832517419013-127.0.0.1:36967_solr-n_0000000000) [n:127.0.0.1:36967_solr ] o.a.s.c.Overseer Starting to work on the main queue : 127.0.0.1:36967_solr
[junit4] 2> 2804145 INFO (jetty-launcher-17951-thread-1) [n:127.0.0.1:36967_solr ] o.a.s.c.ZkController Register node as live in ZooKeeper:/live_nodes/127.0.0.1:36967_solr
[junit4] 2> 2804156 INFO (jetty-launcher-17951-thread-1) [n:127.0.0.1:36967_solr ] o.a.s.c.PackageManager clusterprops.json changed , version -1
[junit4] 2> 2804156 INFO (jetty-launcher-17951-thread-1) [n:127.0.0.1:36967_solr ] o.a.s.c.CoreContainer Initializing auditlogger plugin: solr.CallbackAuditLoggerPlugin
[junit4] 2> 2804170 INFO (zkCallback-17968-thread-1) [ ] o.a.s.c.c.ZkStateReader Updated live nodes from ZooKeeper... (0) -> (1)
[junit4] 2> 2804170 INFO (zkCallback-17961-thread-1) [ ] o.a.s.c.c.ZkStateReader Updated live nodes from ZooKeeper... (0) -> (1)
[junit4] 2> 2804208 INFO (jetty-launcher-17951-thread-1) [n:127.0.0.1:36967_solr ] o.a.s.h.a.MetricsHistoryHandler No .system collection, keeping metrics history in memory.
[junit4] 2> 2804273 INFO (jetty-launcher-17951-thread-1) [n:127.0.0.1:36967_solr ] o.a.s.m.r.SolrJmxReporter JMX monitoring for 'solr_36967.solr.node' (registry 'solr.node') enabled at server: com.sun.jmx.mbeanserver.JmxMBeanServer@3427585c
[junit4] 2> 2804298 INFO (jetty-launcher-17951-thread-1) [n:127.0.0.1:36967_solr ] o.a.s.m.r.SolrJmxReporter JMX monitoring for 'solr_36967.solr.jvm' (registry 'solr.jvm') enabled at server: com.sun.jmx.mbeanserver.JmxMBeanServer@3427585c
[junit4] 2> 2804298 INFO (jetty-launcher-17951-thread-1) [n:127.0.0.1:36967_solr ] o.a.s.m.r.SolrJmxReporter JMX monitoring for 'solr_36967.solr.jetty' (registry 'solr.jetty') enabled at server: com.sun.jmx.mbeanserver.JmxMBeanServer@3427585c
[junit4] 2> 2804300 INFO (jetty-launcher-17951-thread-1) [n:127.0.0.1:36967_solr ] o.a.s.c.CorePropertiesLocator Found 0 core definitions underneath /home/jenkins/jenkins-slave/workspace/Lucene-Solr-Tests-8.x/solr/build/solr-core/test/J1/temp/solr.security.AuditLoggerIntegrationTest_1CCC24AF0F462ADD-001/tempDir-002/node1/.
[junit4] 2> 2804328 INFO (TEST-AuditLoggerIntegrationTest.testSynchronous-seed#[1CCC24AF0F462ADD]) [ ] o.a.s.c.MiniSolrCloudCluster waitForAllNodes: numServers=1
[junit4] 2> 2804338 INFO (TEST-AuditLoggerIntegrationTest.testSynchronous-seed#[1CCC24AF0F462ADD]) [ ] o.a.s.c.c.ConnectionManager Waiting for client to connect to ZooKeeper
[junit4] 2> 2804364 INFO (zkConnectionManagerCallback-17975-thread-1) [ ] o.a.s.c.c.ConnectionManager zkClient has connected
[junit4] 2> 2804364 INFO (TEST-AuditLoggerIntegrationTest.testSynchronous-seed#[1CCC24AF0F462ADD]) [ ] o.a.s.c.c.ConnectionManager Client is connected to ZooKeeper
[junit4] 2> 2804370 INFO (TEST-AuditLoggerIntegrationTest.testSynchronous-seed#[1CCC24AF0F462ADD]) [ ] o.a.s.c.c.ZkStateRe
[...truncated too long message...]
loading settings :: file = /home/jenkins/jenkins-slave/workspace/Lucene-Solr-Tests-8.x/lucene/top-level-ivy-settings.xml
resolve:
ivy-availability-check:
[loadresource] Do not set property disallowed.ivy.jars.list as its length is 0.
-ivy-fail-disallowed-ivy-version:
ivy-fail:
ivy-configure:
[ivy:configure] :: loading settings :: file = /home/jenkins/jenkins-slave/workspace/Lucene-Solr-Tests-8.x/lucene/top-level-ivy-settings.xml
resolve:
ivy-availability-check:
[loadresource] Do not set property disallowed.ivy.jars.list as its length is 0.
-ivy-fail-disallowed-ivy-version:
ivy-fail:
ivy-fail:
ivy-configure:
[ivy:configure] :: loading settings :: file = /home/jenkins/jenkins-slave/workspace/Lucene-Solr-Tests-8.x/lucene/top-level-ivy-settings.xml
resolve:
ivy-availability-check:
[loadresource] Do not set property disallowed.ivy.jars.list as its length is 0.
-ivy-fail-disallowed-ivy-version:
ivy-fail:
ivy-configure:
[ivy:configure] :: loading settings :: file = /home/jenkins/jenkins-slave/workspace/Lucene-Solr-Tests-8.x/lucene/top-level-ivy-settings.xml
resolve:
ivy-availability-check:
[loadresource] Do not set property disallowed.ivy.jars.list as its length is 0.
-ivy-fail-disallowed-ivy-version:
ivy-fail:
ivy-fail:
ivy-configure:
[ivy:configure] :: loading settings :: file = /home/jenkins/jenkins-slave/workspace/Lucene-Solr-Tests-8.x/lucene/top-level-ivy-settings.xml
resolve:
ivy-availability-check:
[loadresource] Do not set property disallowed.ivy.jars.list as its length is 0.
-ivy-fail-disallowed-ivy-version:
ivy-fail:
ivy-fail:
ivy-configure:
[ivy:configure] :: loading settings :: file = /home/jenkins/jenkins-slave/workspace/Lucene-Solr-Tests-8.x/lucene/top-level-ivy-settings.xml
resolve:
ivy-availability-check:
[loadresource] Do not set property disallowed.ivy.jars.list as its length is 0.
-ivy-fail-disallowed-ivy-version:
ivy-fail:
ivy-fail:
ivy-configure:
[ivy:configure] :: loading settings :: file = /home/jenkins/jenkins-slave/workspace/Lucene-Solr-Tests-8.x/lucene/top-level-ivy-settings.xml
resolve:
ivy-availability-check:
[loadresource] Do not set property disallowed.ivy.jars.list as its length is 0.
-ivy-fail-disallowed-ivy-version:
ivy-fail:
ivy-fail:
ivy-configure:
[ivy:configure] :: loading settings :: file = /home/jenkins/jenkins-slave/workspace/Lucene-Solr-Tests-8.x/lucene/top-level-ivy-settings.xml
resolve:
ivy-availability-check:
[loadresource] Do not set property disallowed.ivy.jars.list as its length is 0.
-ivy-fail-disallowed-ivy-version:
ivy-fail:
ivy-fail:
ivy-configure:
[ivy:configure] :: loading settings :: file = /home/jenkins/jenkins-slave/workspace/Lucene-Solr-Tests-8.x/lucene/top-level-ivy-settings.xml
resolve:
ivy-availability-check:
[loadresource] Do not set property disallowed.ivy.jars.list as its length is 0.
-ivy-fail-disallowed-ivy-version:
ivy-fail:
ivy-fail:
ivy-configure:
[ivy:configure] :: loading settings :: file = /home/jenkins/jenkins-slave/workspace/Lucene-Solr-Tests-8.x/lucene/top-level-ivy-settings.xml
resolve:
ivy-availability-check:
[loadresource] Do not set property disallowed.ivy.jars.list as its length is 0.
-ivy-fail-disallowed-ivy-version:
ivy-fail:
ivy-fail:
ivy-configure:
[ivy:configure] :: loading settings :: file = /home/jenkins/jenkins-slave/workspace/Lucene-Solr-Tests-8.x/lucene/top-level-ivy-settings.xml
resolve:
ivy-availability-check:
[loadresource] Do not set property disallowed.ivy.jars.list as its length is 0.
-ivy-fail-disallowed-ivy-version:
ivy-fail:
ivy-fail:
ivy-configure:
[ivy:configure] :: loading settings :: file = /home/jenkins/jenkins-slave/workspace/Lucene-Solr-Tests-8.x/lucene/top-level-ivy-settings.xml
resolve:
ivy-availability-check:
[loadresource] Do not set property disallowed.ivy.jars.list as its length is 0.
-ivy-fail-disallowed-ivy-version:
ivy-fail:
ivy-fail:
ivy-configure:
[ivy:configure] :: loading settings :: file = /home/jenkins/jenkins-slave/workspace/Lucene-Solr-Tests-8.x/lucene/top-level-ivy-settings.xml
resolve:
ivy-availability-check:
[loadresource] Do not set property disallowed.ivy.jars.list as its length is 0.
-ivy-fail-disallowed-ivy-version:
ivy-fail:
ivy-fail:
ivy-configure:
[ivy:configure] :: loading settings :: file = /home/jenkins/jenkins-slave/workspace/Lucene-Solr-Tests-8.x/lucene/top-level-ivy-settings.xml
resolve:
ivy-availability-check:
[loadresource] Do not set property disallowed.ivy.jars.list as its length is 0.
-ivy-fail-disallowed-ivy-version:
ivy-fail:
ivy-fail:
ivy-configure:
[ivy:configure] :: loading settings :: file = /home/jenkins/jenkins-slave/workspace/Lucene-Solr-Tests-8.x/lucene/top-level-ivy-settings.xml
resolve:
jar-checksums:
[mkdir] Created dir: /home/jenkins/jenkins-slave/workspace/Lucene-Solr-Tests-8.x/solr/null275311920
[copy] Copying 249 files to /home/jenkins/jenkins-slave/workspace/Lucene-Solr-Tests-8.x/solr/null275311920
[delete] Deleting directory /home/jenkins/jenkins-slave/workspace/Lucene-Solr-Tests-8.x/solr/null275311920
check-working-copy:
[ivy:cachepath] :: resolving dependencies :: #;working@lucene1-us-west
[ivy:cachepath] confs: [default]
[ivy:cachepath] found org.eclipse.jgit#org.eclipse.jgit;5.3.0.201903130848-r in public
[ivy:cachepath] found com.jcraft#jsch;0.1.54 in public
[ivy:cachepath] found com.jcraft#jzlib;1.1.1 in public
[ivy:cachepath] found com.googlecode.javaewah#JavaEWAH;1.1.6 in public
[ivy:cachepath] found org.slf4j#slf4j-api;1.7.2 in public
[ivy:cachepath] found org.bouncycastle#bcpg-jdk15on;1.60 in public
[ivy:cachepath] found org.bouncycastle#bcprov-jdk15on;1.60 in public
[ivy:cachepath] found org.bouncycastle#bcpkix-jdk15on;1.60 in public
[ivy:cachepath] found org.slf4j#slf4j-nop;1.7.2 in public
[ivy:cachepath] :: resolution report :: resolve 30ms :: artifacts dl 2ms
---------------------------------------------------------------------
| | modules || artifacts |
| conf | number| search|dwnlded|evicted|| number|dwnlded|
---------------------------------------------------------------------
| default | 9 | 0 | 0 | 0 || 9 | 0 |
---------------------------------------------------------------------
[wc-checker] Initializing working copy...
[wc-checker] Checking working copy status...
-jenkins-base:
BUILD SUCCESSFUL
Total time: 121 minutes 15 seconds
Archiving artifacts
java.lang.InterruptedException: no matches found within 10000
at hudson.FilePath$ValidateAntFileMask.hasMatch(FilePath.java:2805)
at hudson.FilePath$ValidateAntFileMask.invoke(FilePath.java:2684)
at hudson.FilePath$ValidateAntFileMask.invoke(FilePath.java:2665)
at hudson.FilePath$FileCallableWrapper.call(FilePath.java:3052)
Also: hudson.remoting.Channel$CallSiteStackTrace: Remote call to lucene
at hudson.remoting.Channel.attachCallSiteStackTrace(Channel.java:1743)
at hudson.remoting.UserRequest$ExceptionResponse.retrieve(UserRequest.java:357)
at hudson.remoting.Channel.call(Channel.java:957)
at hudson.FilePath.act(FilePath.java:1072)
at hudson.FilePath.act(FilePath.java:1061)
at hudson.FilePath.validateAntFileMask(FilePath.java:2663)
at hudson.tasks.ArtifactArchiver.perform(ArtifactArchiver.java:248)
at hudson.tasks.BuildStepCompatibilityLayer.perform(BuildStepCompatibilityLayer.java:79)
at hudson.tasks.BuildStepMonitor$1.perform(BuildStepMonitor.java:20)
at hudson.model.AbstractBuild$AbstractBuildExecution.perform(AbstractBuild.java:741)
at hudson.model.AbstractBuild$AbstractBuildExecution.performAllBuildSteps(AbstractBuild.java:690)
at hudson.model.Build$BuildExecution.post2(Build.java:186)
at hudson.model.AbstractBuild$AbstractBuildExecution.post(AbstractBuild.java:635)
at hudson.model.Run.execute(Run.java:1840)
at hudson.model.FreeStyleBuild.run(FreeStyleBuild.java:43)
at hudson.model.ResourceController.execute(ResourceController.java:97)
at hudson.model.Executor.run(Executor.java:429)
Caused: hudson.FilePath$TunneledInterruptedException
at hudson.FilePath$FileCallableWrapper.call(FilePath.java:3054)
at hudson.remoting.UserRequest.perform(UserRequest.java:212)
at hudson.remoting.UserRequest.perform(UserRequest.java:54)
at hudson.remoting.Request$2.run(Request.java:369)
at hudson.remoting.InterceptingExecutorService$1.call(InterceptingExecutorService.java:72)
at java.util.concurrent.FutureTask.run(FutureTask.java:266)
at java.util.concurrent.ThreadPoolExecutor.runWorker(ThreadPoolExecutor.java:1142)
at java.util.concurrent.ThreadPoolExecutor$Worker.run(ThreadPoolExecutor.java:617)
at java.lang.Thread.run(Thread.java:744)
Caused: java.lang.InterruptedException: java.lang.InterruptedException: no matches found within 10000
at hudson.FilePath.act(FilePath.java:1074)
at hudson.FilePath.act(FilePath.java:1061)
at hudson.FilePath.validateAntFileMask(FilePath.java:2663)
at hudson.tasks.ArtifactArchiver.perform(ArtifactArchiver.java:248)
at hudson.tasks.BuildStepCompatibilityLayer.perform(BuildStepCompatibilityLayer.java:79)
at hudson.tasks.BuildStepMonitor$1.perform(BuildStepMonitor.java:20)
at hudson.model.AbstractBuild$AbstractBuildExecution.perform(AbstractBuild.java:741)
at hudson.model.AbstractBuild$AbstractBuildExecution.performAllBuildSteps(AbstractBuild.java:690)
at hudson.model.Build$BuildExecution.post2(Build.java:186)
at hudson.model.AbstractBuild$AbstractBuildExecution.post(AbstractBuild.java:635)
at hudson.model.Run.execute(Run.java:1840)
at hudson.model.FreeStyleBuild.run(FreeStyleBuild.java:43)
at hudson.model.ResourceController.execute(ResourceController.java:97)
at hudson.model.Executor.run(Executor.java:429)
No artifacts found that match the file pattern "**/*.events,heapdumps/**,**/hs_err_pid*". Configuration error?
Recording test results
Build step 'Publish JUnit test result report' changed build result to UNSTABLE
Email was triggered for: Unstable (Test Failures)
Sending email for trigger: Unstable (Test Failures)