You are viewing a plain text version of this content. The canonical link for it is here.
Posted to dev@pdfbox.apache.org by Apache Jenkins Server <je...@builds.apache.org> on 2022/04/26 17:24:13 UTC

Jenkins build became unstable: PDFBox » PDFBox-sonar2 » Apache PDFBox #775

See <https://ci-builds.apache.org/job/PDFBox/job/PDFBox-sonar2/org.apache.pdfbox$pdfbox/775/display/redirect>


---------------------------------------------------------------------
To unsubscribe, e-mail: dev-unsubscribe@pdfbox.apache.org
For additional commands, e-mail: dev-help@pdfbox.apache.org


Jenkins build is back to normal : PDFBox » PDFBox-sonar2 » Apache PDFBox #777

Posted by Apache Jenkins Server <je...@builds.apache.org>.
See <https://ci-builds.apache.org/job/PDFBox/job/PDFBox-sonar2/org.apache.pdfbox$pdfbox/777/display/redirect?page=changes>


---------------------------------------------------------------------
To unsubscribe, e-mail: dev-unsubscribe@pdfbox.apache.org
For additional commands, e-mail: dev-help@pdfbox.apache.org


Build failed in Jenkins: PDFBox » PDFBox-sonar2 » Apache PDFBox #776

Posted by Apache Jenkins Server <je...@builds.apache.org>.
See <https://ci-builds.apache.org/job/PDFBox/job/PDFBox-sonar2/org.apache.pdfbox$pdfbox/776/display/redirect>

Changes:


------------------------------------------
[...truncated 40.16 KB...]
	at org.junit.jupiter.engine.execution.InvocationInterceptorChain$InterceptedInvocation.proceed(InvocationInterceptorChain.java:106)
	at org.junit.jupiter.engine.execution.InvocationInterceptorChain.proceed(InvocationInterceptorChain.java:64)
	at org.junit.jupiter.engine.execution.InvocationInterceptorChain.chainAndInvoke(InvocationInterceptorChain.java:45)
	at org.junit.jupiter.engine.execution.InvocationInterceptorChain.invoke(InvocationInterceptorChain.java:37)
	at org.junit.jupiter.engine.execution.ExecutableInvoker.invoke(ExecutableInvoker.java:104)
	at org.junit.jupiter.engine.execution.ExecutableInvoker.invoke(ExecutableInvoker.java:98)
	at org.junit.jupiter.engine.descriptor.TestMethodTestDescriptor.lambda$invokeTestMethod$7(TestMethodTestDescriptor.java:214)
	at org.junit.platform.engine.support.hierarchical.ThrowableCollector.execute(ThrowableCollector.java:73)
	at org.junit.jupiter.engine.descriptor.TestMethodTestDescriptor.invokeTestMethod(TestMethodTestDescriptor.java:210)
	at org.junit.jupiter.engine.descriptor.TestMethodTestDescriptor.execute(TestMethodTestDescriptor.java:135)
	at org.junit.jupiter.engine.descriptor.TestMethodTestDescriptor.execute(TestMethodTestDescriptor.java:66)
	at org.junit.platform.engine.support.hierarchical.NodeTestTask.lambda$executeRecursively$6(NodeTestTask.java:151)
	at org.junit.platform.engine.support.hierarchical.ThrowableCollector.execute(ThrowableCollector.java:73)
	at org.junit.platform.engine.support.hierarchical.NodeTestTask.lambda$executeRecursively$8(NodeTestTask.java:141)
	at org.junit.platform.engine.support.hierarchical.Node.around(Node.java:137)
	at org.junit.platform.engine.support.hierarchical.NodeTestTask.lambda$executeRecursively$9(NodeTestTask.java:139)
	at org.junit.platform.engine.support.hierarchical.ThrowableCollector.execute(ThrowableCollector.java:73)
	at org.junit.platform.engine.support.hierarchical.NodeTestTask.executeRecursively(NodeTestTask.java:138)
	at org.junit.platform.engine.support.hierarchical.NodeTestTask.execute(NodeTestTask.java:95)
	at org.junit.platform.engine.support.hierarchical.ForkJoinPoolHierarchicalTestExecutorService$ExclusiveTask.compute(ForkJoinPoolHierarchicalTestExecutorService.java:185)
	at java.base/java.util.concurrent.RecursiveAction.exec(RecursiveAction.java:189)
	at java.base/java.util.concurrent.ForkJoinTask.doExec(ForkJoinTask.java:290)
	at java.base/java.util.concurrent.ForkJoinTask.doJoin(ForkJoinTask.java:396)
	at java.base/java.util.concurrent.ForkJoinTask.join(ForkJoinTask.java:721)
	at org.junit.platform.engine.support.hierarchical.ForkJoinPoolHierarchicalTestExecutorService.joinConcurrentTasksInReverseOrderToEnableWorkStealing(ForkJoinPoolHierarchicalTestExecutorService.java:162)
	at org.junit.platform.engine.support.hierarchical.ForkJoinPoolHierarchicalTestExecutorService.invokeAll(ForkJoinPoolHierarchicalTestExecutorService.java:136)
	at org.junit.platform.engine.support.hierarchical.NodeTestTask.lambda$executeRecursively$6(NodeTestTask.java:155)
	at org.junit.platform.engine.support.hierarchical.ThrowableCollector.execute(ThrowableCollector.java:73)
	at org.junit.platform.engine.support.hierarchical.NodeTestTask.lambda$executeRecursively$8(NodeTestTask.java:141)
	at org.junit.platform.engine.support.hierarchical.Node.around(Node.java:137)
	at org.junit.platform.engine.support.hierarchical.NodeTestTask.lambda$executeRecursively$9(NodeTestTask.java:139)
	at org.junit.platform.engine.support.hierarchical.ThrowableCollector.execute(ThrowableCollector.java:73)
	at org.junit.platform.engine.support.hierarchical.NodeTestTask.executeRecursively(NodeTestTask.java:138)
	at org.junit.platform.engine.support.hierarchical.NodeTestTask.execute(NodeTestTask.java:95)
	at org.junit.platform.engine.support.hierarchical.ForkJoinPoolHierarchicalTestExecutorService$ExclusiveTask.compute(ForkJoinPoolHierarchicalTestExecutorService.java:185)
	at java.base/java.util.concurrent.RecursiveAction.exec(RecursiveAction.java:189)
	at java.base/java.util.concurrent.ForkJoinTask.doExec(ForkJoinTask.java:290)
	at java.base/java.util.concurrent.ForkJoinPool$WorkQueue.topLevelExec(ForkJoinPool.java:1020)
	at java.base/java.util.concurrent.ForkJoinPool.scan(ForkJoinPool.java:1656)
	at java.base/java.util.concurrent.ForkJoinPool.runWorker(ForkJoinPool.java:1594)
	at java.base/java.util.concurrent.ForkJoinWorkerThread.run(ForkJoinWorkerThread.java:183)
Caused by: java.lang.NumberFormatException: For input string: ".2-"
	at java.base/jdk.internal.math.FloatingDecimal.readJavaFormatString(FloatingDecimal.java:2054)
	at java.base/jdk.internal.math.FloatingDecimal.parseDouble(FloatingDecimal.java:110)
	at java.base/java.lang.Double.parseDouble(Double.java:543)
	at java.base/java.lang.Double.valueOf(Double.java:506)
	at org.apache.fontbox.cff.CFFParser.readRealNumber(CFFParser.java:419)
	... 63 more

[INFO] Tests run: 18, Failures: 0, Errors: 0, Skipped: 0, Time elapsed: 0.322 s - in org.apache.pdfbox.it.gsub.GsubWorkerForBengaliTest
[INFO] Running org.apache.pdfbox.pdfwriter.ContentStreamWriterTest
[INFO] Tests run: 4, Failures: 0, Errors: 0, Skipped: 0, Time elapsed: 0.054 s - in org.apache.pdfbox.pdmodel.fdf.FDFAnnotationTest
[INFO] Running org.apache.pdfbox.pdfwriter.COSWriterTest
[INFO] Tests run: 1, Failures: 0, Errors: 0, Skipped: 0, Time elapsed: 0.016 s - in org.apache.pdfbox.pdfwriter.COSWriterTest
[INFO] Running org.apache.pdfbox.pdfwriter.COSDocumentCompressionTest
[INFO] Tests run: 2, Failures: 0, Errors: 0, Skipped: 0, Time elapsed: 0.071 s - in org.apache.pdfbox.pdmodel.font.PDFontTest
[INFO] Running org.apache.pdfbox.cos.TestCOSUpdateInfo
[INFO] Tests run: 2, Failures: 0, Errors: 0, Skipped: 0, Time elapsed: 0.002 s - in org.apache.pdfbox.cos.TestCOSUpdateInfo
[INFO] Running org.apache.pdfbox.cos.COSObjectKeyTest
[INFO] Tests run: 8, Failures: 0, Errors: 0, Skipped: 0, Time elapsed: 0.009 s - in org.apache.pdfbox.cos.COSObjectKeyTest
[INFO] Running org.apache.pdfbox.cos.TestCOSName
[INFO] Tests run: 2, Failures: 0, Errors: 0, Skipped: 0, Time elapsed: 0.026 s - in org.apache.pdfbox.cos.TestCOSName
[INFO] Running org.apache.pdfbox.cos.UnmodifiableCOSDictionaryTest
[INFO] Tests run: 12, Failures: 0, Errors: 0, Skipped: 0, Time elapsed: 0.046 s - in org.apache.pdfbox.cos.UnmodifiableCOSDictionaryTest
[INFO] Running org.apache.pdfbox.cos.TestCOSStream
[INFO] Tests run: 9, Failures: 0, Errors: 0, Skipped: 0, Time elapsed: 0.047 s - in org.apache.pdfbox.cos.TestCOSStream
[INFO] Running org.apache.pdfbox.cos.TestCOSBoolean
[INFO] Tests run: 9, Failures: 0, Errors: 0, Skipped: 0, Time elapsed: 0.07 s - in org.apache.pdfbox.cos.TestCOSBoolean
[INFO] Running org.apache.pdfbox.cos.TestCOSIncrement
[INFO] Tests run: 2, Failures: 0, Errors: 0, Skipped: 0, Time elapsed: 0.135 s - in org.apache.pdfbox.pdfwriter.COSDocumentCompressionTest
[INFO] Running org.apache.pdfbox.cos.TestCOSFloat
[INFO] Tests run: 9, Failures: 0, Errors: 0, Skipped: 0, Time elapsed: 0.041 s - in org.apache.pdfbox.multipdf.OverlayTest
[INFO] Running org.apache.pdfbox.cos.TestCOSArray
[INFO] Tests run: 17, Failures: 0, Errors: 0, Skipped: 0, Time elapsed: 0.023 s - in org.apache.pdfbox.cos.TestCOSFloat
[INFO] Running org.apache.pdfbox.cos.COSDictionaryTest
[INFO] Tests run: 4, Failures: 0, Errors: 0, Skipped: 0, Time elapsed: 0 s - in org.apache.pdfbox.cos.COSDictionaryTest
[INFO] Tests run: 2, Failures: 0, Errors: 0, Skipped: 0, Time elapsed: 0.002 s - in org.apache.pdfbox.cos.TestCOSArray
[INFO] Running org.apache.pdfbox.cos.TestCOSInteger
[INFO] Running org.apache.pdfbox.cos.TestCOSString
[INFO] Tests run: 26, Failures: 0, Errors: 0, Skipped: 0, Time elapsed: 0.019 s - in org.apache.pdfbox.cos.TestCOSString
[INFO] Running org.apache.pdfbox.cos.PDFDocEncodingTest
[INFO] Tests run: 1, Failures: 0, Errors: 0, Skipped: 0, Time elapsed: 0 s - in org.apache.pdfbox.cos.TestCOSInteger
[INFO] Running org.apache.pdfbox.text.BidiTest
[INFO] Tests run: 2, Failures: 0, Errors: 0, Skipped: 0, Time elapsed: 0.001 s - in org.apache.pdfbox.cos.PDFDocEncodingTest
[INFO] Running org.apache.pdfbox.text.TestTextStripper
Files differ: <https://ci-builds.apache.org/job/PDFBox/job/PDFBox-sonar2/org.apache.pdfbox$pdfbox/ws/src/test/resources/org/apache/pdfbox/pdmodel/interactive/form/AcroFormsRotation.pdf-2.png>
              <https://ci-builds.apache.org/job/PDFBox/job/PDFBox-sonar2/org.apache.pdfbox$pdfbox/ws/target/test-output/AcroFormsRotation.pdf-2.png>
Files differ: <https://ci-builds.apache.org/job/PDFBox/job/PDFBox-sonar2/org.apache.pdfbox$pdfbox/ws/src/test/resources/org/apache/pdfbox/ttf/Bengali.pdf-1.png>
              <https://ci-builds.apache.org/job/PDFBox/job/PDFBox-sonar2/org.apache.pdfbox$pdfbox/ws/target/test-output/Bengali.pdf-1.png>
Rendering of target/test-output/Bengali.pdf failed or is not identical to expected rendering in src/test/resources/org/apache/pdfbox/ttf directory
[INFO] Tests run: 7, Failures: 0, Errors: 0, Skipped: 0, Time elapsed: 0.209 s - in org.apache.pdfbox.cos.TestCOSIncrement
[INFO] Running org.apache.pdfbox.io.ScratchFileBufferTest
[INFO] Tests run: 2, Failures: 0, Errors: 0, Skipped: 0, Time elapsed: 0.027 s - in org.apache.pdfbox.text.BidiTest
[INFO] Tests run: 0, Failures: 0, Errors: 0, Skipped: 0, Time elapsed: 0.029 s - in org.apache.pdfbox.io.ScratchFileBufferTest
[INFO] Running org.apache.pdfbox.filter.TestFilters
[INFO] Running org.apache.pdfbox.filter.PredictorTest
[INFO] Tests run: 3, Failures: 0, Errors: 0, Skipped: 0, Time elapsed: 0 s - in org.apache.pdfbox.filter.PredictorTest
[INFO] Running org.apache.pdfbox.pdfparser.EndstreamFilterStreamTest
[INFO] Tests run: 2, Failures: 0, Errors: 0, Skipped: 0, Time elapsed: 0.002 s - in org.apache.pdfbox.pdfparser.EndstreamFilterStreamTest
[INFO] Running org.apache.pdfbox.pdfparser.PDFObjectStreamParserTest
[INFO] Tests run: 2, Failures: 0, Errors: 0, Skipped: 0, Time elapsed: 0 s - in org.apache.pdfbox.pdfparser.PDFObjectStreamParserTest
[INFO] Running org.apache.pdfbox.pdfparser.PDFStreamParserTest
[INFO] Tests run: 3, Failures: 0, Errors: 0, Skipped: 0, Time elapsed: 0.046 s - in org.apache.pdfbox.pdfparser.PDFStreamParserTest
[INFO] Running org.apache.pdfbox.pdfparser.TestPDFParser
Files differ: <https://ci-builds.apache.org/job/PDFBox/job/PDFBox-sonar2/org.apache.pdfbox$pdfbox/ws/src/test/resources/org/apache/pdfbox/pdmodel/interactive/form/MultilineFields.pdf-1.png>
              <https://ci-builds.apache.org/job/PDFBox/job/PDFBox-sonar2/org.apache.pdfbox$pdfbox/ws/target/test-output/MultilineFields.pdf-1.png>
Rendering of target/test-output/MultilineFields.pdf failed or is not identical to expected rendering in src/test/resources/org/apache/pdfbox/pdmodel/interactive/form directory
[INFO] Tests run: 10, Failures: 0, Errors: 0, Skipped: 0, Time elapsed: 0.434 s - in org.apache.pdfbox.pdmodel.interactive.form.MultilineFieldsTest
Files differ: <https://ci-builds.apache.org/job/PDFBox/job/PDFBox-sonar2/org.apache.pdfbox$pdfbox/ws/src/test/resources/org/apache/pdfbox/pdmodel/interactive/form/AcroFormsRotation.pdf-1.png>
              <https://ci-builds.apache.org/job/PDFBox/job/PDFBox-sonar2/org.apache.pdfbox$pdfbox/ws/target/test-output/AcroFormsRotation.pdf-1.png>
Rendering of target/test-output/AcroFormsRotation.pdf failed or is not identical to expected rendering in src/test/resources/org/apache/pdfbox/pdmodel/interactive/form directory
[INFO] Tests run: 5, Failures: 0, Errors: 0, Skipped: 0, Time elapsed: 0.716 s - in org.apache.pdfbox.pdmodel.interactive.form.AcroFormsRotationTest
[INFO] Tests run: 6, Failures: 0, Errors: 0, Skipped: 0, Time elapsed: 0.833 s - in org.apache.pdfbox.pdmodel.interactive.form.TestRadioButtons
Files differ: <https://ci-builds.apache.org/job/PDFBox/job/PDFBox-sonar2/org.apache.pdfbox$pdfbox/ws/src/test/resources/org/apache/pdfbox/pdmodel/interactive/form/AlignmentTests.pdf-1.png>
              <https://ci-builds.apache.org/job/PDFBox/job/PDFBox-sonar2/org.apache.pdfbox$pdfbox/ws/target/test-output/AlignmentTests.pdf-1.png>
Rendering of target/test-output/AlignmentTests.pdf failed or is not identical to expected rendering in src/test/resources/org/apache/pdfbox/pdmodel/interactive/form directory
[INFO] Tests run: 3, Failures: 0, Errors: 0, Skipped: 0, Time elapsed: 1.363 s - in org.apache.pdfbox.pdmodel.interactive.form.AlignmentTest
[INFO] Tests run: 1, Failures: 0, Errors: 0, Skipped: 0, Time elapsed: 1.401 s - in org.apache.pdfbox.pdmodel.graphics.image.CCITTFactoryTest
[INFO] Tests run: 1, Failures: 0, Errors: 0, Skipped: 0, Time elapsed: 1.503 s - in org.apache.pdfbox.pdmodel.graphics.image.PNGConverterTest
[INFO] Tests run: 12, Failures: 0, Errors: 0, Skipped: 0, Time elapsed: 2.432 s - in org.apache.pdfbox.pdmodel.graphics.image.JPEGFactoryTest
Files differ: <https://ci-builds.apache.org/job/PDFBox/job/PDFBox-sonar2/org.apache.pdfbox$pdfbox/ws/src/test/resources/org/apache/pdfbox/pdmodel/interactive/form/AlignmentTests-flattened.pdf-1.png>
              <https://ci-builds.apache.org/job/PDFBox/job/PDFBox-sonar2/org.apache.pdfbox$pdfbox/ws/target/test-output/AlignmentTests-flattened.pdf-1.png>
Rendering of target/test-output/AlignmentTests-flattened.pdf failed or is not identical to expected rendering in src/test/resources/org/apache/pdfbox/pdmodel/interactive/form directory
Apr 26, 2022 6:12:27 PM org.apache.pdfbox.contentstream.PDFStreamEngine operatorException
SEVERE: Missing XObject: Fm0
[INFO] Tests run: 22, Failures: 0, Errors: 0, Skipped: 0, Time elapsed: 4.435 s - in org.apache.pdfbox.rendering.TestRendering
[INFO] Tests run: 3, Failures: 0, Errors: 0, Skipped: 0, Time elapsed: 4.805 s - in org.apache.pdfbox.pdmodel.interactive.form.PDAcroFormGenerateAppearancesTest
Files differ: <https://ci-builds.apache.org/job/PDFBox/job/PDFBox-sonar2/org.apache.pdfbox$pdfbox/ws/src/test/resources/org/apache/pdfbox/pdmodel/interactive/form/AlignmentTests-flattened-noRef.pdf-1.png>
              <https://ci-builds.apache.org/job/PDFBox/job/PDFBox-sonar2/org.apache.pdfbox$pdfbox/ws/target/test-output/AlignmentTests-flattened-noRef.pdf-1.png>
Rendering of target/test-output/AlignmentTests-flattened-noRef.pdf failed or is not identical to expected rendering in src/test/resources/org/apache/pdfbox/pdmodel/interactive/form directory
[INFO] Tests run: 16, Failures: 0, Errors: 0, Skipped: 0, Time elapsed: 6.144 s - in org.apache.pdfbox.pdmodel.interactive.form.PDAcroFormTest
[INFO] Tests run: 7, Failures: 0, Errors: 0, Skipped: 0, Time elapsed: 6.314 s - in org.apache.pdfbox.encryption.TestPublicKeyEncryption
[INFO] Tests run: 1, Failures: 0, Errors: 0, Skipped: 0, Time elapsed: 6.381 s - in org.apache.pdfbox.pdmodel.font.TestFontEmbedding
Apr 26, 2022 6:12:31 PM org.apache.pdfbox.contentstream.operator.state.SetGraphicsStateParameters process
SEVERE: name for 'gs' operator not found in resources: /GS7
[INFO] Tests run: 18, Failures: 0, Errors: 0, Skipped: 0, Time elapsed: 7.99 s - in org.apache.pdfbox.pdmodel.interactive.form.PDAcroFormFlattenTest
[INFO] Tests run: 2, Failures: 0, Errors: 0, Skipped: 0, Time elapsed: 8.04 s - in org.apache.pdfbox.pdmodel.graphics.image.PDImageXObjectTest
[INFO] Tests run: 1, Failures: 0, Errors: 0, Skipped: 0, Time elapsed: 8.056 s - in org.apache.pdfbox.pdmodel.graphics.image.LosslessFactoryTest
[INFO] Tests run: 8, Failures: 0, Errors: 0, Skipped: 0, Time elapsed: 8.418 s - in org.apache.pdfbox.pdfparser.TestPDFParser
[INFO] Tests run: 5, Failures: 0, Errors: 0, Skipped: 0, Time elapsed: 9.058 s - in org.apache.pdfbox.text.TestTextStripper
[INFO] Tests run: 1, Failures: 0, Errors: 0, Skipped: 0, Time elapsed: 9.262 s - in org.apache.pdfbox.pdmodel.interactive.form.PDAcroFormFromAnnotsTest
[INFO] Tests run: 2, Failures: 0, Errors: 0, Skipped: 0, Time elapsed: 9.325 s - in org.apache.pdfbox.pdfwriter.ContentStreamWriterTest
[INFO] Tests run: 6, Failures: 0, Errors: 0, Skipped: 0, Time elapsed: 9.589 s - in org.apache.pdfbox.util.TestNumberFormatUtil
[INFO] Tests run: 1, Failures: 0, Errors: 0, Skipped: 0, Time elapsed: 9.785 s - in org.apache.pdfbox.multipdf.PDFMergerUtilityTest
[INFO] Tests run: 1, Failures: 0, Errors: 0, Skipped: 0, Time elapsed: 10.043 s - in org.apache.pdfbox.rendering.TestQuality
[INFO] Tests run: 1, Failures: 0, Errors: 0, Skipped: 0, Time elapsed: 16.675 s - in org.apache.pdfbox.encryption.TestSymmetricKeyEncryption
[INFO] Tests run: 1, Failures: 0, Errors: 0, Skipped: 0, Time elapsed: 17.576 s - in org.apache.pdfbox.filter.TestFilters
[INFO] 
[INFO] Results:
[INFO] 
[WARNING] Tests run: 636, Failures: 0, Errors: 0, Skipped: 2
[INFO] 
[JENKINS] Recording test results
[INFO] 
[INFO] --- jacoco-maven-plugin:0.8.8:report (report) @ pdfbox ---
[INFO] Loading execution data file <https://ci-builds.apache.org/job/PDFBox/job/PDFBox-sonar2/org.apache.pdfbox$pdfbox/ws/target/jacoco.exec>
[INFO] Analyzed bundle 'Apache PDFBox' with 702 classes
[WARNING] Classes in bundle 'Apache PDFBox' do not match with execution data. For report generation the same class files must be used as at runtime.
[WARNING] Execution data for class org/apache/pdfbox/pdmodel/graphics/blend/BlendComposite$BlendCompositeContext does not match.
[INFO] 
[INFO] --- animal-sniffer-maven-plugin:1.21:check (check-java-version) @ pdfbox ---
[INFO] Checking unresolved references to org.codehaus.mojo.signature:java18:1.0
[INFO] 
[INFO] --- maven-bundle-plugin:5.1.2:bundle (default-bundle) @ pdfbox ---
[WARNING] Bundle org.apache.pdfbox:pdfbox:bundle:3.0.0-SNAPSHOT : Split package, multiple jars provide the same package:org/apache/pdfbox/io
Use Import/Export Package directive -split-package:=(merge-first|merge-last|error|first) to get rid of this warning
Package found in   [Jar:., Jar:io]
Class path         [Jar:., Jar:io, Jar:fontbox, Jar:commons-logging, Jar:bcmail-jdk15on, Jar:bcutil-jdk15on, Jar:bcpkix-jdk15on, Jar:bcprov-jdk15on]
[INFO] 
[INFO] --- maven-site-plugin:3.7.1:attach-descriptor (attach-descriptor) @ pdfbox ---
[INFO] Skipping because packaging 'bundle' is not pom.
[INFO] 
[INFO] >>> maven-source-plugin:3.2.1:jar (attach-sources) > generate-sources @ pdfbox >>>
[INFO] 
[INFO] --- maven-enforcer-plugin:3.0.0:enforce (default) @ pdfbox ---
[INFO] 
[INFO] --- maven-enforcer-plugin:3.0.0:enforce (enforce-maven-version) @ pdfbox ---
[INFO] 
[INFO] --- jacoco-maven-plugin:0.8.8:prepare-agent (default) @ pdfbox ---
[INFO] surefireArgLine set to -javaagent:/home/jenkins/.m2/repository/org/jacoco/org.jacoco.agent/0.8.8/org.jacoco.agent-0.8.8-runtime.jar=destfile=<https://ci-builds.apache.org/job/PDFBox/job/PDFBox-sonar2/org.apache.pdfbox$pdfbox/ws/target/jacoco.exec>
[WARNING] Failed to getClass for org.apache.maven.plugins.source.SourceJarMojo
[INFO] 
[INFO] <<< maven-source-plugin:3.2.1:jar (attach-sources) < generate-sources @ pdfbox <<<
[INFO] 
[INFO] 
[INFO] --- maven-source-plugin:3.2.1:jar (attach-sources) @ pdfbox ---
[INFO] Building jar: <https://ci-builds.apache.org/job/PDFBox/job/PDFBox-sonar2/org.apache.pdfbox$pdfbox/ws/target/pdfbox-3.0.0-SNAPSHOT-sources.jar>
[WARNING] Attempt to (de-)serialize anonymous class org.jfrog.hudson.maven2.MavenDependenciesRecorder$1; see: https://jenkins.io/redirect/serialization-of-anonymous-classes/
[INFO] 
[INFO] ----------------------< org.apache.pdfbox:pdfbox >----------------------
[INFO] Building Apache PDFBox 3.0.0-SNAPSHOT
[INFO] -------------------------------[ bundle ]-------------------------------
[INFO] 
[INFO] --- sonar-maven-plugin:3.9.1.2184:sonar (default-cli) @ pdfbox ---
[INFO] User cache: /home/jenkins/.sonar/cache
[INFO] SonarQube version: 9.0.1
[INFO] Default locale: "en_US", source code encoding: "UTF-8"
[INFO] Load global settings
[INFO] Load global settings (done) | time=970ms
[INFO] Server id: 1BD809FA-AWHW8ct9-T_TB3XqouNu
[INFO] User cache: /home/jenkins/.sonar/cache
[INFO] Load/download plugins
[INFO] Load plugins index
[INFO] Load plugins index (done) | time=253ms
[INFO] Load/download plugins (done) | time=442ms
[INFO] Loaded core extensions: developer-scanner
[INFO] Found an active CI vendor: 'Jenkins'
[INFO] Load project settings for component key: 'pdfbox-reactor'
[INFO] Load project settings for component key: 'pdfbox-reactor' (done) | time=171ms
[INFO] Process project properties
[INFO] Execute project builders
[INFO] Execute project builders (done) | time=2ms
[INFO] Project key: pdfbox-reactor
[INFO] Base dir: <https://ci-builds.apache.org/job/PDFBox/job/PDFBox-sonar2/org.apache.pdfbox$pdfbox/ws/>
[INFO] Working dir: <https://ci-builds.apache.org/job/PDFBox/job/PDFBox-sonar2/org.apache.pdfbox$pdfbox/ws/target/sonar>
[INFO] Load project branches
[INFO] Load project branches (done) | time=182ms
[INFO] Check ALM binding of project 'pdfbox-reactor'
[WARNING] Failed to check if project 'pdfbox-reactor' is bound
[INFO] Detected project binding: ERROR
[INFO] Check ALM binding of project 'pdfbox-reactor' (done) | time=169ms
[INFO] Load project pull requests
[INFO] Load project pull requests (done) | time=169ms
[INFO] Load branch configuration
[INFO] Load branch configuration (done) | time=2ms
[INFO] Load quality profiles
[INFO] Load quality profiles (done) | time=222ms
[INFO] Load active rules
[INFO] Load active rules (done) | time=6622ms
[INFO] Organization key: apache
[INFO] Load project repositories
[INFO] ------------------------------------------------------------------------
[INFO] BUILD FAILURE
[INFO] ------------------------------------------------------------------------
[INFO] Total time:  02:06 min
[INFO] Finished at: 2022-04-26T18:13:41Z
[INFO] ------------------------------------------------------------------------
Waiting for Jenkins to finish collecting data
[ERROR] Failed to execute goal org.sonarsource.scanner.maven:sonar-maven-plugin:3.9.1.2184:sonar (default-cli) on project pdfbox: You're not authorized to run analysis. No sonar.login or SONAR_TOKEN env variable was set -> [Help 1]
[ERROR] 
[ERROR] To see the full stack trace of the errors, re-run Maven with the -e switch.
[ERROR] Re-run Maven using the -X switch to enable full debug logging.
[ERROR] 
[ERROR] For more information about the errors and possible solutions, please read the following articles:
[ERROR] [Help 1] http://cwiki.apache.org/confluence/display/MAVEN/MojoExecutionException
[JENKINS] Archiving <https://ci-builds.apache.org/job/PDFBox/job/PDFBox-sonar2/org.apache.pdfbox$pdfbox/ws/pom.xml> to org.apache.pdfbox/pdfbox/3.0.0-SNAPSHOT/pdfbox-3.0.0-SNAPSHOT.pom
[JENKINS] Archiving <https://ci-builds.apache.org/job/PDFBox/job/PDFBox-sonar2/org.apache.pdfbox$pdfbox/ws/target/pdfbox-3.0.0-SNAPSHOT.jar> to org.apache.pdfbox/pdfbox/3.0.0-SNAPSHOT/pdfbox-3.0.0-SNAPSHOT.jar
[JENKINS] Archiving <https://ci-builds.apache.org/job/PDFBox/job/PDFBox-sonar2/org.apache.pdfbox$pdfbox/ws/target/pdfbox-3.0.0-SNAPSHOT-sources.jar> to org.apache.pdfbox/pdfbox/3.0.0-SNAPSHOT/pdfbox-3.0.0-SNAPSHOT-sources.jar
[Fast Archiver] Compressed 5.16 MB of artifacts by 74.5% relative to #775

---------------------------------------------------------------------
To unsubscribe, e-mail: dev-unsubscribe@pdfbox.apache.org
For additional commands, e-mail: dev-help@pdfbox.apache.org


Build failed in Jenkins: PDFBox » PDFBox-sonar2 » Apache PDFBox #776

Posted by Apache Jenkins Server <je...@builds.apache.org>.
See <https://ci-builds.apache.org/job/PDFBox/job/PDFBox-sonar2/org.apache.pdfbox$pdfbox/776/display/redirect>

Changes:


------------------------------------------
[...truncated 40.38 KB...]
	at org.junit.jupiter.engine.execution.InvocationInterceptorChain.chainAndInvoke(InvocationInterceptorChain.java:45)
	at org.junit.jupiter.engine.execution.InvocationInterceptorChain.invoke(InvocationInterceptorChain.java:37)
	at org.junit.jupiter.engine.execution.ExecutableInvoker.invoke(ExecutableInvoker.java:104)
	at org.junit.jupiter.engine.execution.ExecutableInvoker.invoke(ExecutableInvoker.java:98)
	at org.junit.jupiter.engine.descriptor.TestMethodTestDescriptor.lambda$invokeTestMethod$7(TestMethodTestDescriptor.java:214)
	at org.junit.platform.engine.support.hierarchical.ThrowableCollector.execute(ThrowableCollector.java:73)
	at org.junit.jupiter.engine.descriptor.TestMethodTestDescriptor.invokeTestMethod(TestMethodTestDescriptor.java:210)
	at org.junit.jupiter.engine.descriptor.TestMethodTestDescriptor.execute(TestMethodTestDescriptor.java:135)
	at org.junit.jupiter.engine.descriptor.TestMethodTestDescriptor.execute(TestMethodTestDescriptor.java:66)
	at org.junit.platform.engine.support.hierarchical.NodeTestTask.lambda$executeRecursively$6(NodeTestTask.java:151)
	at org.junit.platform.engine.support.hierarchical.ThrowableCollector.execute(ThrowableCollector.java:73)
	at org.junit.platform.engine.support.hierarchical.NodeTestTask.lambda$executeRecursively$8(NodeTestTask.java:141)
	at org.junit.platform.engine.support.hierarchical.Node.around(Node.java:137)
	at org.junit.platform.engine.support.hierarchical.NodeTestTask.lambda$executeRecursively$9(NodeTestTask.java:139)
	at org.junit.platform.engine.support.hierarchical.ThrowableCollector.execute(ThrowableCollector.java:73)
	at org.junit.platform.engine.support.hierarchical.NodeTestTask.executeRecursively(NodeTestTask.java:138)
	at org.junit.platform.engine.support.hierarchical.NodeTestTask.execute(NodeTestTask.java:95)
	at org.junit.platform.engine.support.hierarchical.ForkJoinPoolHierarchicalTestExecutorService$ExclusiveTask.compute(ForkJoinPoolHierarchicalTestExecutorService.java:185)
	at java.base/java.util.concurrent.RecursiveAction.exec(RecursiveAction.java:189)
	at java.base/java.util.concurrent.ForkJoinTask.doExec(ForkJoinTask.java:290)
	at java.base/java.util.concurrent.ForkJoinTask.doJoin(ForkJoinTask.java:396)
	at java.base/java.util.concurrent.ForkJoinTask.join(ForkJoinTask.java:721)
	at org.junit.platform.engine.support.hierarchical.ForkJoinPoolHierarchicalTestExecutorService.joinConcurrentTasksInReverseOrderToEnableWorkStealing(ForkJoinPoolHierarchicalTestExecutorService.java:162)
	at org.junit.platform.engine.support.hierarchical.ForkJoinPoolHierarchicalTestExecutorService.invokeAll(ForkJoinPoolHierarchicalTestExecutorService.java:136)
	at org.junit.platform.engine.support.hierarchical.NodeTestTask.lambda$executeRecursively$6(NodeTestTask.java:155)
	at org.junit.platform.engine.support.hierarchical.ThrowableCollector.execute(ThrowableCollector.java:73)
	at org.junit.platform.engine.support.hierarchical.NodeTestTask.lambda$executeRecursively$8(NodeTestTask.java:141)
	at org.junit.platform.engine.support.hierarchical.Node.around(Node.java:137)
	at org.junit.platform.engine.support.hierarchical.NodeTestTask.lambda$executeRecursively$9(NodeTestTask.java:139)
	at org.junit.platform.engine.support.hierarchical.ThrowableCollector.execute(ThrowableCollector.java:73)
	at org.junit.platform.engine.support.hierarchical.NodeTestTask.executeRecursively(NodeTestTask.java:138)
	at org.junit.platform.engine.support.hierarchical.NodeTestTask.execute(NodeTestTask.java:95)
	at org.junit.platform.engine.support.hierarchical.ForkJoinPoolHierarchicalTestExecutorService$ExclusiveTask.compute(ForkJoinPoolHierarchicalTestExecutorService.java:185)
	at java.base/java.util.concurrent.RecursiveAction.exec(RecursiveAction.java:189)
	at java.base/java.util.concurrent.ForkJoinTask.doExec(ForkJoinTask.java:290)
	at java.base/java.util.concurrent.ForkJoinPool$WorkQueue.topLevelExec(ForkJoinPool.java:1020)
	at java.base/java.util.concurrent.ForkJoinPool.scan(ForkJoinPool.java:1656)
	at java.base/java.util.concurrent.ForkJoinPool.runWorker(ForkJoinPool.java:1594)
	at java.base/java.util.concurrent.ForkJoinWorkerThread.run(ForkJoinWorkerThread.java:183)
Caused by: java.lang.NumberFormatException: For input string: ".2-"
	at java.base/jdk.internal.math.FloatingDecimal.readJavaFormatString(FloatingDecimal.java:2054)
	at java.base/jdk.internal.math.FloatingDecimal.parseDouble(FloatingDecimal.java:110)
	at java.base/java.lang.Double.parseDouble(Double.java:543)
	at java.base/java.lang.Double.valueOf(Double.java:506)
	at org.apache.fontbox.cff.CFFParser.readRealNumber(CFFParser.java:419)
	... 63 more

[INFO] Tests run: 18, Failures: 0, Errors: 0, Skipped: 0, Time elapsed: 0.322 s - in org.apache.pdfbox.it.gsub.GsubWorkerForBengaliTest
[INFO] Running org.apache.pdfbox.pdfwriter.ContentStreamWriterTest
[INFO] Tests run: 4, Failures: 0, Errors: 0, Skipped: 0, Time elapsed: 0.054 s - in org.apache.pdfbox.pdmodel.fdf.FDFAnnotationTest
[INFO] Running org.apache.pdfbox.pdfwriter.COSWriterTest
[INFO] Tests run: 1, Failures: 0, Errors: 0, Skipped: 0, Time elapsed: 0.016 s - in org.apache.pdfbox.pdfwriter.COSWriterTest
[INFO] Running org.apache.pdfbox.pdfwriter.COSDocumentCompressionTest
[INFO] Tests run: 2, Failures: 0, Errors: 0, Skipped: 0, Time elapsed: 0.071 s - in org.apache.pdfbox.pdmodel.font.PDFontTest
[INFO] Running org.apache.pdfbox.cos.TestCOSUpdateInfo
[INFO] Tests run: 2, Failures: 0, Errors: 0, Skipped: 0, Time elapsed: 0.002 s - in org.apache.pdfbox.cos.TestCOSUpdateInfo
[INFO] Running org.apache.pdfbox.cos.COSObjectKeyTest
[INFO] Tests run: 8, Failures: 0, Errors: 0, Skipped: 0, Time elapsed: 0.009 s - in org.apache.pdfbox.cos.COSObjectKeyTest
[INFO] Running org.apache.pdfbox.cos.TestCOSName
[INFO] Tests run: 2, Failures: 0, Errors: 0, Skipped: 0, Time elapsed: 0.026 s - in org.apache.pdfbox.cos.TestCOSName
[INFO] Running org.apache.pdfbox.cos.UnmodifiableCOSDictionaryTest
[INFO] Tests run: 12, Failures: 0, Errors: 0, Skipped: 0, Time elapsed: 0.046 s - in org.apache.pdfbox.cos.UnmodifiableCOSDictionaryTest
[INFO] Running org.apache.pdfbox.cos.TestCOSStream
[INFO] Tests run: 9, Failures: 0, Errors: 0, Skipped: 0, Time elapsed: 0.047 s - in org.apache.pdfbox.cos.TestCOSStream
[INFO] Running org.apache.pdfbox.cos.TestCOSBoolean
[INFO] Tests run: 9, Failures: 0, Errors: 0, Skipped: 0, Time elapsed: 0.07 s - in org.apache.pdfbox.cos.TestCOSBoolean
[INFO] Running org.apache.pdfbox.cos.TestCOSIncrement
[INFO] Tests run: 2, Failures: 0, Errors: 0, Skipped: 0, Time elapsed: 0.135 s - in org.apache.pdfbox.pdfwriter.COSDocumentCompressionTest
[INFO] Running org.apache.pdfbox.cos.TestCOSFloat
[INFO] Tests run: 9, Failures: 0, Errors: 0, Skipped: 0, Time elapsed: 0.041 s - in org.apache.pdfbox.multipdf.OverlayTest
[INFO] Running org.apache.pdfbox.cos.TestCOSArray
[INFO] Tests run: 17, Failures: 0, Errors: 0, Skipped: 0, Time elapsed: 0.023 s - in org.apache.pdfbox.cos.TestCOSFloat
[INFO] Running org.apache.pdfbox.cos.COSDictionaryTest
[INFO] Tests run: 4, Failures: 0, Errors: 0, Skipped: 0, Time elapsed: 0 s - in org.apache.pdfbox.cos.COSDictionaryTest
[INFO] Tests run: 2, Failures: 0, Errors: 0, Skipped: 0, Time elapsed: 0.002 s - in org.apache.pdfbox.cos.TestCOSArray
[INFO] Running org.apache.pdfbox.cos.TestCOSInteger
[INFO] Running org.apache.pdfbox.cos.TestCOSString
[INFO] Tests run: 26, Failures: 0, Errors: 0, Skipped: 0, Time elapsed: 0.019 s - in org.apache.pdfbox.cos.TestCOSString
[INFO] Running org.apache.pdfbox.cos.PDFDocEncodingTest
[INFO] Tests run: 1, Failures: 0, Errors: 0, Skipped: 0, Time elapsed: 0 s - in org.apache.pdfbox.cos.TestCOSInteger
[INFO] Running org.apache.pdfbox.text.BidiTest
[INFO] Tests run: 2, Failures: 0, Errors: 0, Skipped: 0, Time elapsed: 0.001 s - in org.apache.pdfbox.cos.PDFDocEncodingTest
[INFO] Running org.apache.pdfbox.text.TestTextStripper
Files differ: <https://ci-builds.apache.org/job/PDFBox/job/PDFBox-sonar2/org.apache.pdfbox$pdfbox/ws/src/test/resources/org/apache/pdfbox/pdmodel/interactive/form/AcroFormsRotation.pdf-2.png>
              <https://ci-builds.apache.org/job/PDFBox/job/PDFBox-sonar2/org.apache.pdfbox$pdfbox/ws/target/test-output/AcroFormsRotation.pdf-2.png>
Files differ: <https://ci-builds.apache.org/job/PDFBox/job/PDFBox-sonar2/org.apache.pdfbox$pdfbox/ws/src/test/resources/org/apache/pdfbox/ttf/Bengali.pdf-1.png>
              <https://ci-builds.apache.org/job/PDFBox/job/PDFBox-sonar2/org.apache.pdfbox$pdfbox/ws/target/test-output/Bengali.pdf-1.png>
Rendering of target/test-output/Bengali.pdf failed or is not identical to expected rendering in src/test/resources/org/apache/pdfbox/ttf directory
[INFO] Tests run: 7, Failures: 0, Errors: 0, Skipped: 0, Time elapsed: 0.209 s - in org.apache.pdfbox.cos.TestCOSIncrement
[INFO] Running org.apache.pdfbox.io.ScratchFileBufferTest
[INFO] Tests run: 2, Failures: 0, Errors: 0, Skipped: 0, Time elapsed: 0.027 s - in org.apache.pdfbox.text.BidiTest
[INFO] Tests run: 0, Failures: 0, Errors: 0, Skipped: 0, Time elapsed: 0.029 s - in org.apache.pdfbox.io.ScratchFileBufferTest
[INFO] Running org.apache.pdfbox.filter.TestFilters
[INFO] Running org.apache.pdfbox.filter.PredictorTest
[INFO] Tests run: 3, Failures: 0, Errors: 0, Skipped: 0, Time elapsed: 0 s - in org.apache.pdfbox.filter.PredictorTest
[INFO] Running org.apache.pdfbox.pdfparser.EndstreamFilterStreamTest
[INFO] Tests run: 2, Failures: 0, Errors: 0, Skipped: 0, Time elapsed: 0.002 s - in org.apache.pdfbox.pdfparser.EndstreamFilterStreamTest
[INFO] Running org.apache.pdfbox.pdfparser.PDFObjectStreamParserTest
[INFO] Tests run: 2, Failures: 0, Errors: 0, Skipped: 0, Time elapsed: 0 s - in org.apache.pdfbox.pdfparser.PDFObjectStreamParserTest
[INFO] Running org.apache.pdfbox.pdfparser.PDFStreamParserTest
[INFO] Tests run: 3, Failures: 0, Errors: 0, Skipped: 0, Time elapsed: 0.046 s - in org.apache.pdfbox.pdfparser.PDFStreamParserTest
[INFO] Running org.apache.pdfbox.pdfparser.TestPDFParser
Files differ: <https://ci-builds.apache.org/job/PDFBox/job/PDFBox-sonar2/org.apache.pdfbox$pdfbox/ws/src/test/resources/org/apache/pdfbox/pdmodel/interactive/form/MultilineFields.pdf-1.png>
              <https://ci-builds.apache.org/job/PDFBox/job/PDFBox-sonar2/org.apache.pdfbox$pdfbox/ws/target/test-output/MultilineFields.pdf-1.png>
Rendering of target/test-output/MultilineFields.pdf failed or is not identical to expected rendering in src/test/resources/org/apache/pdfbox/pdmodel/interactive/form directory
[INFO] Tests run: 10, Failures: 0, Errors: 0, Skipped: 0, Time elapsed: 0.434 s - in org.apache.pdfbox.pdmodel.interactive.form.MultilineFieldsTest
Files differ: <https://ci-builds.apache.org/job/PDFBox/job/PDFBox-sonar2/org.apache.pdfbox$pdfbox/ws/src/test/resources/org/apache/pdfbox/pdmodel/interactive/form/AcroFormsRotation.pdf-1.png>
              <https://ci-builds.apache.org/job/PDFBox/job/PDFBox-sonar2/org.apache.pdfbox$pdfbox/ws/target/test-output/AcroFormsRotation.pdf-1.png>
Rendering of target/test-output/AcroFormsRotation.pdf failed or is not identical to expected rendering in src/test/resources/org/apache/pdfbox/pdmodel/interactive/form directory
[INFO] Tests run: 5, Failures: 0, Errors: 0, Skipped: 0, Time elapsed: 0.716 s - in org.apache.pdfbox.pdmodel.interactive.form.AcroFormsRotationTest
[INFO] Tests run: 6, Failures: 0, Errors: 0, Skipped: 0, Time elapsed: 0.833 s - in org.apache.pdfbox.pdmodel.interactive.form.TestRadioButtons
Files differ: <https://ci-builds.apache.org/job/PDFBox/job/PDFBox-sonar2/org.apache.pdfbox$pdfbox/ws/src/test/resources/org/apache/pdfbox/pdmodel/interactive/form/AlignmentTests.pdf-1.png>
              <https://ci-builds.apache.org/job/PDFBox/job/PDFBox-sonar2/org.apache.pdfbox$pdfbox/ws/target/test-output/AlignmentTests.pdf-1.png>
Rendering of target/test-output/AlignmentTests.pdf failed or is not identical to expected rendering in src/test/resources/org/apache/pdfbox/pdmodel/interactive/form directory
[INFO] Tests run: 3, Failures: 0, Errors: 0, Skipped: 0, Time elapsed: 1.363 s - in org.apache.pdfbox.pdmodel.interactive.form.AlignmentTest
[INFO] Tests run: 1, Failures: 0, Errors: 0, Skipped: 0, Time elapsed: 1.401 s - in org.apache.pdfbox.pdmodel.graphics.image.CCITTFactoryTest
[INFO] Tests run: 1, Failures: 0, Errors: 0, Skipped: 0, Time elapsed: 1.503 s - in org.apache.pdfbox.pdmodel.graphics.image.PNGConverterTest
[INFO] Tests run: 12, Failures: 0, Errors: 0, Skipped: 0, Time elapsed: 2.432 s - in org.apache.pdfbox.pdmodel.graphics.image.JPEGFactoryTest
Files differ: <https://ci-builds.apache.org/job/PDFBox/job/PDFBox-sonar2/org.apache.pdfbox$pdfbox/ws/src/test/resources/org/apache/pdfbox/pdmodel/interactive/form/AlignmentTests-flattened.pdf-1.png>
              <https://ci-builds.apache.org/job/PDFBox/job/PDFBox-sonar2/org.apache.pdfbox$pdfbox/ws/target/test-output/AlignmentTests-flattened.pdf-1.png>
Rendering of target/test-output/AlignmentTests-flattened.pdf failed or is not identical to expected rendering in src/test/resources/org/apache/pdfbox/pdmodel/interactive/form directory
Apr 26, 2022 6:12:27 PM org.apache.pdfbox.contentstream.PDFStreamEngine operatorException
SEVERE: Missing XObject: Fm0
[INFO] Tests run: 22, Failures: 0, Errors: 0, Skipped: 0, Time elapsed: 4.435 s - in org.apache.pdfbox.rendering.TestRendering
[INFO] Tests run: 3, Failures: 0, Errors: 0, Skipped: 0, Time elapsed: 4.805 s - in org.apache.pdfbox.pdmodel.interactive.form.PDAcroFormGenerateAppearancesTest
Files differ: <https://ci-builds.apache.org/job/PDFBox/job/PDFBox-sonar2/org.apache.pdfbox$pdfbox/ws/src/test/resources/org/apache/pdfbox/pdmodel/interactive/form/AlignmentTests-flattened-noRef.pdf-1.png>
              <https://ci-builds.apache.org/job/PDFBox/job/PDFBox-sonar2/org.apache.pdfbox$pdfbox/ws/target/test-output/AlignmentTests-flattened-noRef.pdf-1.png>
Rendering of target/test-output/AlignmentTests-flattened-noRef.pdf failed or is not identical to expected rendering in src/test/resources/org/apache/pdfbox/pdmodel/interactive/form directory
[INFO] Tests run: 16, Failures: 0, Errors: 0, Skipped: 0, Time elapsed: 6.144 s - in org.apache.pdfbox.pdmodel.interactive.form.PDAcroFormTest
[INFO] Tests run: 7, Failures: 0, Errors: 0, Skipped: 0, Time elapsed: 6.314 s - in org.apache.pdfbox.encryption.TestPublicKeyEncryption
[INFO] Tests run: 1, Failures: 0, Errors: 0, Skipped: 0, Time elapsed: 6.381 s - in org.apache.pdfbox.pdmodel.font.TestFontEmbedding
Apr 26, 2022 6:12:31 PM org.apache.pdfbox.contentstream.operator.state.SetGraphicsStateParameters process
SEVERE: name for 'gs' operator not found in resources: /GS7
[INFO] Tests run: 18, Failures: 0, Errors: 0, Skipped: 0, Time elapsed: 7.99 s - in org.apache.pdfbox.pdmodel.interactive.form.PDAcroFormFlattenTest
[INFO] Tests run: 2, Failures: 0, Errors: 0, Skipped: 0, Time elapsed: 8.04 s - in org.apache.pdfbox.pdmodel.graphics.image.PDImageXObjectTest
[INFO] Tests run: 1, Failures: 0, Errors: 0, Skipped: 0, Time elapsed: 8.056 s - in org.apache.pdfbox.pdmodel.graphics.image.LosslessFactoryTest
[INFO] Tests run: 8, Failures: 0, Errors: 0, Skipped: 0, Time elapsed: 8.418 s - in org.apache.pdfbox.pdfparser.TestPDFParser
[INFO] Tests run: 5, Failures: 0, Errors: 0, Skipped: 0, Time elapsed: 9.058 s - in org.apache.pdfbox.text.TestTextStripper
[INFO] Tests run: 1, Failures: 0, Errors: 0, Skipped: 0, Time elapsed: 9.262 s - in org.apache.pdfbox.pdmodel.interactive.form.PDAcroFormFromAnnotsTest
[INFO] Tests run: 2, Failures: 0, Errors: 0, Skipped: 0, Time elapsed: 9.325 s - in org.apache.pdfbox.pdfwriter.ContentStreamWriterTest
[INFO] Tests run: 6, Failures: 0, Errors: 0, Skipped: 0, Time elapsed: 9.589 s - in org.apache.pdfbox.util.TestNumberFormatUtil
[INFO] Tests run: 1, Failures: 0, Errors: 0, Skipped: 0, Time elapsed: 9.785 s - in org.apache.pdfbox.multipdf.PDFMergerUtilityTest
[INFO] Tests run: 1, Failures: 0, Errors: 0, Skipped: 0, Time elapsed: 10.043 s - in org.apache.pdfbox.rendering.TestQuality
[INFO] Tests run: 1, Failures: 0, Errors: 0, Skipped: 0, Time elapsed: 16.675 s - in org.apache.pdfbox.encryption.TestSymmetricKeyEncryption
[INFO] Tests run: 1, Failures: 0, Errors: 0, Skipped: 0, Time elapsed: 17.576 s - in org.apache.pdfbox.filter.TestFilters
[INFO] 
[INFO] Results:
[INFO] 
[WARNING] Tests run: 636, Failures: 0, Errors: 0, Skipped: 2
[INFO] 
[JENKINS] Recording test results
[INFO] 
[INFO] --- jacoco-maven-plugin:0.8.8:report (report) @ pdfbox ---
[INFO] Loading execution data file <https://ci-builds.apache.org/job/PDFBox/job/PDFBox-sonar2/org.apache.pdfbox$pdfbox/ws/target/jacoco.exec>
[INFO] Analyzed bundle 'Apache PDFBox' with 702 classes
[WARNING] Classes in bundle 'Apache PDFBox' do not match with execution data. For report generation the same class files must be used as at runtime.
[WARNING] Execution data for class org/apache/pdfbox/pdmodel/graphics/blend/BlendComposite$BlendCompositeContext does not match.
[INFO] 
[INFO] --- animal-sniffer-maven-plugin:1.21:check (check-java-version) @ pdfbox ---
[INFO] Checking unresolved references to org.codehaus.mojo.signature:java18:1.0
[INFO] 
[INFO] --- maven-bundle-plugin:5.1.2:bundle (default-bundle) @ pdfbox ---
[WARNING] Bundle org.apache.pdfbox:pdfbox:bundle:3.0.0-SNAPSHOT : Split package, multiple jars provide the same package:org/apache/pdfbox/io
Use Import/Export Package directive -split-package:=(merge-first|merge-last|error|first) to get rid of this warning
Package found in   [Jar:., Jar:io]
Class path         [Jar:., Jar:io, Jar:fontbox, Jar:commons-logging, Jar:bcmail-jdk15on, Jar:bcutil-jdk15on, Jar:bcpkix-jdk15on, Jar:bcprov-jdk15on]
[INFO] 
[INFO] --- maven-site-plugin:3.7.1:attach-descriptor (attach-descriptor) @ pdfbox ---
[INFO] Skipping because packaging 'bundle' is not pom.
[INFO] 
[INFO] >>> maven-source-plugin:3.2.1:jar (attach-sources) > generate-sources @ pdfbox >>>
[INFO] 
[INFO] --- maven-enforcer-plugin:3.0.0:enforce (default) @ pdfbox ---
[INFO] 
[INFO] --- maven-enforcer-plugin:3.0.0:enforce (enforce-maven-version) @ pdfbox ---
[INFO] 
[INFO] --- jacoco-maven-plugin:0.8.8:prepare-agent (default) @ pdfbox ---
[INFO] surefireArgLine set to -javaagent:/home/jenkins/.m2/repository/org/jacoco/org.jacoco.agent/0.8.8/org.jacoco.agent-0.8.8-runtime.jar=destfile=<https://ci-builds.apache.org/job/PDFBox/job/PDFBox-sonar2/org.apache.pdfbox$pdfbox/ws/target/jacoco.exec>
[WARNING] Failed to getClass for org.apache.maven.plugins.source.SourceJarMojo
[INFO] 
[INFO] <<< maven-source-plugin:3.2.1:jar (attach-sources) < generate-sources @ pdfbox <<<
[INFO] 
[INFO] 
[INFO] --- maven-source-plugin:3.2.1:jar (attach-sources) @ pdfbox ---
[INFO] Building jar: <https://ci-builds.apache.org/job/PDFBox/job/PDFBox-sonar2/org.apache.pdfbox$pdfbox/ws/target/pdfbox-3.0.0-SNAPSHOT-sources.jar>
[WARNING] Attempt to (de-)serialize anonymous class org.jfrog.hudson.maven2.MavenDependenciesRecorder$1; see: https://jenkins.io/redirect/serialization-of-anonymous-classes/
[INFO] 
[INFO] ----------------------< org.apache.pdfbox:pdfbox >----------------------
[INFO] Building Apache PDFBox 3.0.0-SNAPSHOT
[INFO] -------------------------------[ bundle ]-------------------------------
[INFO] 
[INFO] --- sonar-maven-plugin:3.9.1.2184:sonar (default-cli) @ pdfbox ---
[INFO] User cache: /home/jenkins/.sonar/cache
[INFO] SonarQube version: 9.0.1
[INFO] Default locale: "en_US", source code encoding: "UTF-8"
[INFO] Load global settings
[INFO] Load global settings (done) | time=970ms
[INFO] Server id: 1BD809FA-AWHW8ct9-T_TB3XqouNu
[INFO] User cache: /home/jenkins/.sonar/cache
[INFO] Load/download plugins
[INFO] Load plugins index
[INFO] Load plugins index (done) | time=253ms
[INFO] Load/download plugins (done) | time=442ms
[INFO] Loaded core extensions: developer-scanner
[INFO] Found an active CI vendor: 'Jenkins'
[INFO] Load project settings for component key: 'pdfbox-reactor'
[INFO] Load project settings for component key: 'pdfbox-reactor' (done) | time=171ms
[INFO] Process project properties
[INFO] Execute project builders
[INFO] Execute project builders (done) | time=2ms
[INFO] Project key: pdfbox-reactor
[INFO] Base dir: <https://ci-builds.apache.org/job/PDFBox/job/PDFBox-sonar2/org.apache.pdfbox$pdfbox/ws/>
[INFO] Working dir: <https://ci-builds.apache.org/job/PDFBox/job/PDFBox-sonar2/org.apache.pdfbox$pdfbox/ws/target/sonar>
[INFO] Load project branches
[INFO] Load project branches (done) | time=182ms
[INFO] Check ALM binding of project 'pdfbox-reactor'
[WARNING] Failed to check if project 'pdfbox-reactor' is bound
[INFO] Detected project binding: ERROR
[INFO] Check ALM binding of project 'pdfbox-reactor' (done) | time=169ms
[INFO] Load project pull requests
[INFO] Load project pull requests (done) | time=169ms
[INFO] Load branch configuration
[INFO] Load branch configuration (done) | time=2ms
[INFO] Load quality profiles
[INFO] Load quality profiles (done) | time=222ms
[INFO] Load active rules
[INFO] Load active rules (done) | time=6622ms
[INFO] Organization key: apache
[INFO] Load project repositories
[INFO] ------------------------------------------------------------------------
[INFO] BUILD FAILURE
[INFO] ------------------------------------------------------------------------
[INFO] Total time:  02:06 min
[INFO] Finished at: 2022-04-26T18:13:41Z
[INFO] ------------------------------------------------------------------------
Waiting for Jenkins to finish collecting data
[ERROR] Failed to execute goal org.sonarsource.scanner.maven:sonar-maven-plugin:3.9.1.2184:sonar (default-cli) on project pdfbox: You're not authorized to run analysis. No sonar.login or SONAR_TOKEN env variable was set -> [Help 1]
[ERROR] 
[ERROR] To see the full stack trace of the errors, re-run Maven with the -e switch.
[ERROR] Re-run Maven using the -X switch to enable full debug logging.
[ERROR] 
[ERROR] For more information about the errors and possible solutions, please read the following articles:
[ERROR] [Help 1] http://cwiki.apache.org/confluence/display/MAVEN/MojoExecutionException
Sending e-mails to: dev@pdfbox.apache.org
agent/workspace/PDFBox/PDFBox-sonar2/pdfbox/pom.xml to org.apache.pdfbox/pdfbox/3.0.0-SNAPSHOT/pdfbox-3.0.0-SNAPSHOT.pom
[JENKINS] Archiving <https://ci-builds.apache.org/job/PDFBox/job/PDFBox-sonar2/org.apache.pdfbox$pdfbox/ws/target/pdfbox-3.0.0-SNAPSHOT.jar> to org.apache.pdfbox/pdfbox/3.0.0-SNAPSHOT/pdfbox-3.0.0-SNAPSHOT.jar
[JENKINS] Archiving <https://ci-builds.apache.org/job/PDFBox/job/PDFBox-sonar2/org.apache.pdfbox$pdfbox/ws/target/pdfbox-3.0.0-SNAPSHOT-sources.jar> to org.apache.pdfbox/pdfbox/3.0.0-SNAPSHOT/pdfbox-3.0.0-SNAPSHOT-sources.jar
[Fast Archiver] Compressed 5.16 MB of artifacts by 74.5% relative to #775
Sending e-mails to: dev@pdfbox.apache.org

---------------------------------------------------------------------
To unsubscribe, e-mail: dev-unsubscribe@pdfbox.apache.org
For additional commands, e-mail: dev-help@pdfbox.apache.org