You are viewing a plain text version of this content. The canonical link for it is here.
Posted to dev@lucene.apache.org by Policeman Jenkins Server <je...@thetaphi.de> on 2014/04/11 16:16:19 UTC
[JENKINS] Lucene-Solr-trunk-MacOSX (64bit/jdk1.7.0) - Build # 1485
- Failure!
Build: http://jenkins.thetaphi.de/job/Lucene-Solr-trunk-MacOSX/1485/
Java: 64bit/jdk1.7.0 -XX:+UseCompressedOops -XX:+UseG1GC -XX:-UseSuperWord
2 tests failed.
REGRESSION: org.apache.solr.cloud.CollectionsAPIDistributedZkTest.testDistribSearch
Error Message:
deletealias the collection time out:180s
Stack Trace:
org.apache.solr.client.solrj.impl.HttpSolrServer$RemoteSolrException: deletealias the collection time out:180s
at __randomizedtesting.SeedInfo.seed([2CA84FADD31C1010:AD4EC1B5A443702C]:0)
at org.apache.solr.client.solrj.impl.HttpSolrServer.executeMethod(HttpSolrServer.java:554)
at org.apache.solr.client.solrj.impl.HttpSolrServer.request(HttpSolrServer.java:210)
at org.apache.solr.client.solrj.impl.HttpSolrServer.request(HttpSolrServer.java:206)
at org.apache.solr.client.solrj.request.CollectionAdminRequest.process(CollectionAdminRequest.java:300)
at org.apache.solr.client.solrj.request.CollectionAdminRequest.deleteAlias(CollectionAdminRequest.java:512)
at org.apache.solr.cloud.CollectionsAPIDistributedZkTest.testSolrJAPICalls(CollectionsAPIDistributedZkTest.java:307)
at org.apache.solr.cloud.CollectionsAPIDistributedZkTest.doTest(CollectionsAPIDistributedZkTest.java:200)
at org.apache.solr.BaseDistributedSearchTestCase.testDistribSearch(BaseDistributedSearchTestCase.java:865)
at sun.reflect.NativeMethodAccessorImpl.invoke0(Native Method)
at sun.reflect.NativeMethodAccessorImpl.invoke(NativeMethodAccessorImpl.java:57)
at sun.reflect.DelegatingMethodAccessorImpl.invoke(DelegatingMethodAccessorImpl.java:43)
at java.lang.reflect.Method.invoke(Method.java:606)
at com.carrotsearch.randomizedtesting.RandomizedRunner.invoke(RandomizedRunner.java:1618)
at com.carrotsearch.randomizedtesting.RandomizedRunner$6.evaluate(RandomizedRunner.java:827)
at com.carrotsearch.randomizedtesting.RandomizedRunner$7.evaluate(RandomizedRunner.java:863)
at com.carrotsearch.randomizedtesting.RandomizedRunner$8.evaluate(RandomizedRunner.java:877)
at com.carrotsearch.randomizedtesting.rules.SystemPropertiesRestoreRule$1.evaluate(SystemPropertiesRestoreRule.java:53)
at org.apache.lucene.util.TestRuleSetupTeardownChained$1.evaluate(TestRuleSetupTeardownChained.java:50)
at org.apache.lucene.util.TestRuleFieldCacheSanity$1.evaluate(TestRuleFieldCacheSanity.java:51)
at org.apache.lucene.util.AbstractBeforeAfterRule$1.evaluate(AbstractBeforeAfterRule.java:46)
at com.carrotsearch.randomizedtesting.rules.SystemPropertiesInvariantRule$1.evaluate(SystemPropertiesInvariantRule.java:55)
at org.apache.lucene.util.TestRuleThreadAndTestName$1.evaluate(TestRuleThreadAndTestName.java:49)
at org.apache.lucene.util.TestRuleIgnoreAfterMaxFailures$1.evaluate(TestRuleIgnoreAfterMaxFailures.java:65)
at org.apache.lucene.util.TestRuleMarkFailure$1.evaluate(TestRuleMarkFailure.java:48)
at com.carrotsearch.randomizedtesting.rules.StatementAdapter.evaluate(StatementAdapter.java:36)
at com.carrotsearch.randomizedtesting.ThreadLeakControl$StatementRunner.run(ThreadLeakControl.java:360)
at com.carrotsearch.randomizedtesting.ThreadLeakControl.forkTimeoutingTask(ThreadLeakControl.java:793)
at com.carrotsearch.randomizedtesting.ThreadLeakControl$3.evaluate(ThreadLeakControl.java:453)
at com.carrotsearch.randomizedtesting.RandomizedRunner.runSingleTest(RandomizedRunner.java:836)
at com.carrotsearch.randomizedtesting.RandomizedRunner$3.evaluate(RandomizedRunner.java:738)
at com.carrotsearch.randomizedtesting.RandomizedRunner$4.evaluate(RandomizedRunner.java:772)
at com.carrotsearch.randomizedtesting.RandomizedRunner$5.evaluate(RandomizedRunner.java:783)
at com.carrotsearch.randomizedtesting.rules.StatementAdapter.evaluate(StatementAdapter.java:36)
at com.carrotsearch.randomizedtesting.rules.SystemPropertiesRestoreRule$1.evaluate(SystemPropertiesRestoreRule.java:53)
at org.apache.lucene.util.AbstractBeforeAfterRule$1.evaluate(AbstractBeforeAfterRule.java:46)
at org.apache.lucene.util.TestRuleStoreClassName$1.evaluate(TestRuleStoreClassName.java:42)
at com.carrotsearch.randomizedtesting.rules.SystemPropertiesInvariantRule$1.evaluate(SystemPropertiesInvariantRule.java:55)
at com.carrotsearch.randomizedtesting.rules.NoShadowingOrOverridesOnMethodsRule$1.evaluate(NoShadowingOrOverridesOnMethodsRule.java:39)
at com.carrotsearch.randomizedtesting.rules.NoShadowingOrOverridesOnMethodsRule$1.evaluate(NoShadowingOrOverridesOnMethodsRule.java:39)
at com.carrotsearch.randomizedtesting.rules.StatementAdapter.evaluate(StatementAdapter.java:36)
at com.carrotsearch.randomizedtesting.rules.StatementAdapter.evaluate(StatementAdapter.java:36)
at org.apache.lucene.util.TestRuleAssertionsRequired$1.evaluate(TestRuleAssertionsRequired.java:43)
at org.apache.lucene.util.TestRuleMarkFailure$1.evaluate(TestRuleMarkFailure.java:48)
at org.apache.lucene.util.TestRuleIgnoreAfterMaxFailures$1.evaluate(TestRuleIgnoreAfterMaxFailures.java:65)
at org.apache.lucene.util.TestRuleIgnoreTestSuites$1.evaluate(TestRuleIgnoreTestSuites.java:55)
at com.carrotsearch.randomizedtesting.rules.StatementAdapter.evaluate(StatementAdapter.java:36)
at com.carrotsearch.randomizedtesting.ThreadLeakControl$StatementRunner.run(ThreadLeakControl.java:360)
at java.lang.Thread.run(Thread.java:744)
REGRESSION: org.apache.solr.cloud.OverseerTest.testOverseerFailure
Error Message:
Could not register as the leader because creating the ephemeral registration node in ZooKeeper failed
Stack Trace:
org.apache.solr.common.SolrException: Could not register as the leader because creating the ephemeral registration node in ZooKeeper failed
at __randomizedtesting.SeedInfo.seed([2CA84FADD31C1010:28A0C05EC1B9FF31]:0)
at org.apache.solr.cloud.ShardLeaderElectionContextBase.runLeaderProcess(ElectionContext.java:136)
at org.apache.solr.cloud.LeaderElector.runIamLeaderProcess(LeaderElector.java:142)
at org.apache.solr.cloud.LeaderElector.checkIfIamLeader(LeaderElector.java:110)
at org.apache.solr.cloud.LeaderElector.checkIfIamLeader(LeaderElector.java:134)
at org.apache.solr.cloud.LeaderElector.joinElection(LeaderElector.java:267)
at org.apache.solr.cloud.OverseerTest$MockZKController.publishState(OverseerTest.java:155)
at org.apache.solr.cloud.OverseerTest.testOverseerFailure(OverseerTest.java:661)
at sun.reflect.NativeMethodAccessorImpl.invoke0(Native Method)
at sun.reflect.NativeMethodAccessorImpl.invoke(NativeMethodAccessorImpl.java:57)
at sun.reflect.DelegatingMethodAccessorImpl.invoke(DelegatingMethodAccessorImpl.java:43)
at java.lang.reflect.Method.invoke(Method.java:606)
at com.carrotsearch.randomizedtesting.RandomizedRunner.invoke(RandomizedRunner.java:1618)
at com.carrotsearch.randomizedtesting.RandomizedRunner$6.evaluate(RandomizedRunner.java:827)
at com.carrotsearch.randomizedtesting.RandomizedRunner$7.evaluate(RandomizedRunner.java:863)
at com.carrotsearch.randomizedtesting.RandomizedRunner$8.evaluate(RandomizedRunner.java:877)
at com.carrotsearch.randomizedtesting.rules.SystemPropertiesRestoreRule$1.evaluate(SystemPropertiesRestoreRule.java:53)
at org.apache.lucene.util.TestRuleSetupTeardownChained$1.evaluate(TestRuleSetupTeardownChained.java:50)
at org.apache.lucene.util.TestRuleFieldCacheSanity$1.evaluate(TestRuleFieldCacheSanity.java:51)
at org.apache.lucene.util.AbstractBeforeAfterRule$1.evaluate(AbstractBeforeAfterRule.java:46)
at com.carrotsearch.randomizedtesting.rules.SystemPropertiesInvariantRule$1.evaluate(SystemPropertiesInvariantRule.java:55)
at org.apache.lucene.util.TestRuleThreadAndTestName$1.evaluate(TestRuleThreadAndTestName.java:49)
at org.apache.lucene.util.TestRuleIgnoreAfterMaxFailures$1.evaluate(TestRuleIgnoreAfterMaxFailures.java:65)
at org.apache.lucene.util.TestRuleMarkFailure$1.evaluate(TestRuleMarkFailure.java:48)
at com.carrotsearch.randomizedtesting.rules.StatementAdapter.evaluate(StatementAdapter.java:36)
at com.carrotsearch.randomizedtesting.ThreadLeakControl$StatementRunner.run(ThreadLeakControl.java:360)
at com.carrotsearch.randomizedtesting.ThreadLeakControl.forkTimeoutingTask(ThreadLeakControl.java:793)
at com.carrotsearch.randomizedtesting.ThreadLeakControl$3.evaluate(ThreadLeakControl.java:453)
at com.carrotsearch.randomizedtesting.RandomizedRunner.runSingleTest(RandomizedRunner.java:836)
at com.carrotsearch.randomizedtesting.RandomizedRunner$3.evaluate(RandomizedRunner.java:738)
at com.carrotsearch.randomizedtesting.RandomizedRunner$4.evaluate(RandomizedRunner.java:772)
at com.carrotsearch.randomizedtesting.RandomizedRunner$5.evaluate(RandomizedRunner.java:783)
at com.carrotsearch.randomizedtesting.rules.StatementAdapter.evaluate(StatementAdapter.java:36)
at com.carrotsearch.randomizedtesting.rules.SystemPropertiesRestoreRule$1.evaluate(SystemPropertiesRestoreRule.java:53)
at org.apache.lucene.util.AbstractBeforeAfterRule$1.evaluate(AbstractBeforeAfterRule.java:46)
at org.apache.lucene.util.TestRuleStoreClassName$1.evaluate(TestRuleStoreClassName.java:42)
at com.carrotsearch.randomizedtesting.rules.SystemPropertiesInvariantRule$1.evaluate(SystemPropertiesInvariantRule.java:55)
at com.carrotsearch.randomizedtesting.rules.NoShadowingOrOverridesOnMethodsRule$1.evaluate(NoShadowingOrOverridesOnMethodsRule.java:39)
at com.carrotsearch.randomizedtesting.rules.NoShadowingOrOverridesOnMethodsRule$1.evaluate(NoShadowingOrOverridesOnMethodsRule.java:39)
at com.carrotsearch.randomizedtesting.rules.StatementAdapter.evaluate(StatementAdapter.java:36)
at com.carrotsearch.randomizedtesting.rules.StatementAdapter.evaluate(StatementAdapter.java:36)
at org.apache.lucene.util.TestRuleAssertionsRequired$1.evaluate(TestRuleAssertionsRequired.java:43)
at org.apache.lucene.util.TestRuleMarkFailure$1.evaluate(TestRuleMarkFailure.java:48)
at org.apache.lucene.util.TestRuleIgnoreAfterMaxFailures$1.evaluate(TestRuleIgnoreAfterMaxFailures.java:65)
at org.apache.lucene.util.TestRuleIgnoreTestSuites$1.evaluate(TestRuleIgnoreTestSuites.java:55)
at com.carrotsearch.randomizedtesting.rules.StatementAdapter.evaluate(StatementAdapter.java:36)
at com.carrotsearch.randomizedtesting.ThreadLeakControl$StatementRunner.run(ThreadLeakControl.java:360)
at java.lang.Thread.run(Thread.java:744)
Caused by: org.apache.zookeeper.KeeperException$NodeExistsException: KeeperErrorCode = NodeExists for /collections/collection1/leaders/shard1
at org.apache.zookeeper.KeeperException.create(KeeperException.java:119)
at org.apache.zookeeper.KeeperException.create(KeeperException.java:51)
at org.apache.zookeeper.ZooKeeper.create(ZooKeeper.java:783)
at org.apache.solr.common.cloud.SolrZkClient$10.execute(SolrZkClient.java:432)
at org.apache.solr.common.cloud.ZkCmdExecutor.retryOperation(ZkCmdExecutor.java:73)
at org.apache.solr.common.cloud.SolrZkClient.makePath(SolrZkClient.java:429)
at org.apache.solr.common.cloud.SolrZkClient.makePath(SolrZkClient.java:386)
at org.apache.solr.common.cloud.SolrZkClient.makePath(SolrZkClient.java:373)
at org.apache.solr.cloud.ShardLeaderElectionContextBase$1.execute(ElectionContext.java:128)
at org.apache.solr.common.util.RetryUtil.retryOnThrowable(RetryUtil.java:31)
at org.apache.solr.cloud.ShardLeaderElectionContextBase.runLeaderProcess(ElectionContext.java:123)
... 46 more
Build Log:
[...truncated 10662 lines...]
[junit4] Suite: org.apache.solr.cloud.CollectionsAPIDistributedZkTest
[junit4] 2> Creating dataDir: /Users/jenkins/workspace/Lucene-Solr-trunk-MacOSX/solr/build/solr-core/test/J0/./solr.cloud.CollectionsAPIDistributedZkTest-2CA84FADD31C1010-001/init-core-data-001
[junit4] 2> 591728 T1950 oas.SolrTestCaseJ4.buildSSLConfig Randomized ssl (false) and clientAuth (false)
[junit4] 2> 591729 T1950 oas.BaseDistributedSearchTestCase.initHostContext Setting hostContext system property: /
[junit4] 2> 591735 T1950 oas.SolrTestCaseJ4.setUp ###Starting testDistribSearch
[junit4] 2> 591737 T1950 oasc.ZkTestServer.run STARTING ZK TEST SERVER
[junit4] 2> 591739 T1951 oasc.ZkTestServer$ZKServerMain.runFromConfig Starting server
[junit4] 2> 591840 T1950 oasc.ZkTestServer.run start zk server on port:49804
[junit4] 2> 591842 T1950 oascc.ConnectionManager.waitForConnected Waiting for client to connect to ZooKeeper
[junit4] 2> 591849 T1957 oascc.ConnectionManager.process Watcher org.apache.solr.common.cloud.ConnectionManager@266d842f name:ZooKeeperConnection Watcher:127.0.0.1:49804 got event WatchedEvent state:SyncConnected type:None path:null path:null type:None
[junit4] 2> 591849 T1950 oascc.ConnectionManager.waitForConnected Client is connected to ZooKeeper
[junit4] 2> 591850 T1950 oascc.SolrZkClient.makePath makePath: /solr
[junit4] 2> 591863 T1950 oascc.ConnectionManager.waitForConnected Waiting for client to connect to ZooKeeper
[junit4] 2> 591867 T1959 oascc.ConnectionManager.process Watcher org.apache.solr.common.cloud.ConnectionManager@2611abf8 name:ZooKeeperConnection Watcher:127.0.0.1:49804/solr got event WatchedEvent state:SyncConnected type:None path:null path:null type:None
[junit4] 2> 591868 T1950 oascc.ConnectionManager.waitForConnected Client is connected to ZooKeeper
[junit4] 2> 591868 T1950 oascc.SolrZkClient.makePath makePath: /collections/collection1
[junit4] 2> 591878 T1950 oascc.SolrZkClient.makePath makePath: /collections/collection1/shards
[junit4] 2> 591888 T1950 oascc.SolrZkClient.makePath makePath: /collections/control_collection
[junit4] 2> 591895 T1950 oascc.SolrZkClient.makePath makePath: /collections/control_collection/shards
[junit4] 2> 591903 T1950 oasc.AbstractZkTestCase.putConfig put /Users/jenkins/workspace/Lucene-Solr-trunk-MacOSX/solr/core/src/test-files/solr/collection1/conf/solrconfig-tlog.xml to /configs/conf1/solrconfig.xml
[junit4] 2> 591904 T1950 oascc.SolrZkClient.makePath makePath: /configs/conf1/solrconfig.xml
[junit4] 2> 591917 T1950 oasc.AbstractZkTestCase.putConfig put /Users/jenkins/workspace/Lucene-Solr-trunk-MacOSX/solr/core/src/test-files/solr/collection1/conf/schema.xml to /configs/conf1/schema.xml
[junit4] 2> 591918 T1950 oascc.SolrZkClient.makePath makePath: /configs/conf1/schema.xml
[junit4] 2> 591928 T1950 oasc.AbstractZkTestCase.putConfig put /Users/jenkins/workspace/Lucene-Solr-trunk-MacOSX/solr/core/src/test-files/solr/collection1/conf/solrconfig.snippet.randomindexconfig.xml to /configs/conf1/solrconfig.snippet.randomindexconfig.xml
[junit4] 2> 591930 T1950 oascc.SolrZkClient.makePath makePath: /configs/conf1/solrconfig.snippet.randomindexconfig.xml
[junit4] 2> 591939 T1950 oasc.AbstractZkTestCase.putConfig put /Users/jenkins/workspace/Lucene-Solr-trunk-MacOSX/solr/core/src/test-files/solr/collection1/conf/stopwords.txt to /configs/conf1/stopwords.txt
[junit4] 2> 591940 T1950 oascc.SolrZkClient.makePath makePath: /configs/conf1/stopwords.txt
[junit4] 2> 591951 T1950 oasc.AbstractZkTestCase.putConfig put /Users/jenkins/workspace/Lucene-Solr-trunk-MacOSX/solr/core/src/test-files/solr/collection1/conf/protwords.txt to /configs/conf1/protwords.txt
[junit4] 2> 591952 T1950 oascc.SolrZkClient.makePath makePath: /configs/conf1/protwords.txt
[junit4] 2> 591961 T1950 oasc.AbstractZkTestCase.putConfig put /Users/jenkins/workspace/Lucene-Solr-trunk-MacOSX/solr/core/src/test-files/solr/collection1/conf/currency.xml to /configs/conf1/currency.xml
[junit4] 2> 591962 T1950 oascc.SolrZkClient.makePath makePath: /configs/conf1/currency.xml
[junit4] 2> 591974 T1950 oasc.AbstractZkTestCase.putConfig put /Users/jenkins/workspace/Lucene-Solr-trunk-MacOSX/solr/core/src/test-files/solr/collection1/conf/enumsConfig.xml to /configs/conf1/enumsConfig.xml
[junit4] 2> 591975 T1950 oascc.SolrZkClient.makePath makePath: /configs/conf1/enumsConfig.xml
[junit4] 2> 591984 T1950 oasc.AbstractZkTestCase.putConfig put /Users/jenkins/workspace/Lucene-Solr-trunk-MacOSX/solr/core/src/test-files/solr/collection1/conf/open-exchange-rates.json to /configs/conf1/open-exchange-rates.json
[junit4] 2> 591985 T1950 oascc.SolrZkClient.makePath makePath: /configs/conf1/open-exchange-rates.json
[junit4] 2> 591993 T1950 oasc.AbstractZkTestCase.putConfig put /Users/jenkins/workspace/Lucene-Solr-trunk-MacOSX/solr/core/src/test-files/solr/collection1/conf/mapping-ISOLatin1Accent.txt to /configs/conf1/mapping-ISOLatin1Accent.txt
[junit4] 2> 591994 T1950 oascc.SolrZkClient.makePath makePath: /configs/conf1/mapping-ISOLatin1Accent.txt
[junit4] 2> 592003 T1950 oasc.AbstractZkTestCase.putConfig put /Users/jenkins/workspace/Lucene-Solr-trunk-MacOSX/solr/core/src/test-files/solr/collection1/conf/old_synonyms.txt to /configs/conf1/old_synonyms.txt
[junit4] 2> 592004 T1950 oascc.SolrZkClient.makePath makePath: /configs/conf1/old_synonyms.txt
[junit4] 2> 592013 T1950 oasc.AbstractZkTestCase.putConfig put /Users/jenkins/workspace/Lucene-Solr-trunk-MacOSX/solr/core/src/test-files/solr/collection1/conf/synonyms.txt to /configs/conf1/synonyms.txt
[junit4] 2> 592014 T1950 oascc.SolrZkClient.makePath makePath: /configs/conf1/synonyms.txt
[junit4] 2> Using old style solr.xml
[junit4] 2> 593517 T1950 oejs.Server.doStart jetty-8.1.10.v20130312
[junit4] 2> 593543 T1950 oejs.AbstractConnector.doStart Started SelectChannelConnector@127.0.0.1:49807
[junit4] 2> 593544 T1950 oass.SolrDispatchFilter.init SolrDispatchFilter.init()
[junit4] 2> 593544 T1950 oasc.SolrResourceLoader.locateSolrHome JNDI not configured for solr (NoInitialContextEx)
[junit4] 2> 593545 T1950 oasc.SolrResourceLoader.locateSolrHome using system property solr.solr.home: ../../../../../../../../../Users/jenkins/workspace/Lucene-Solr-trunk-MacOSX/solr/build/solr-core/test/J0/./solr.cloud.CollectionsAPIDistributedZkTest-2CA84FADD31C1010-001/tempDir-002
[junit4] 2> 593545 T1950 oasc.SolrResourceLoader.<init> new SolrResourceLoader for directory: '../../../../../../../../../Users/jenkins/workspace/Lucene-Solr-trunk-MacOSX/solr/build/solr-core/test/J0/./solr.cloud.CollectionsAPIDistributedZkTest-2CA84FADD31C1010-001/tempDir-002/'
[junit4] 2> 593588 T1950 oasc.ConfigSolr.fromFile Loading container configuration from /Users/jenkins/workspace/Lucene-Solr-trunk-MacOSX/solr/build/solr-core/test/J0/../../../../../../../../../Users/jenkins/workspace/Lucene-Solr-trunk-MacOSX/solr/build/solr-core/test/J0/./solr.cloud.CollectionsAPIDistributedZkTest-2CA84FADD31C1010-001/tempDir-002/solr.xml
[junit4] 2> 593689 T1950 oasc.CoreContainer.<init> New CoreContainer 650024145
[junit4] 2> 593689 T1950 oasc.CoreContainer.load Loading cores into CoreContainer [instanceDir=../../../../../../../../../Users/jenkins/workspace/Lucene-Solr-trunk-MacOSX/solr/build/solr-core/test/J0/./solr.cloud.CollectionsAPIDistributedZkTest-2CA84FADD31C1010-001/tempDir-002/]
[junit4] 2> 593691 T1950 oashc.HttpShardHandlerFactory.getParameter Setting socketTimeout to: 120000
[junit4] 2> 593691 T1950 oashc.HttpShardHandlerFactory.getParameter Setting urlScheme to: null
[junit4] 2> 593692 T1950 oashc.HttpShardHandlerFactory.getParameter Setting connTimeout to: 15000
[junit4] 2> 593692 T1950 oashc.HttpShardHandlerFactory.getParameter Setting maxConnectionsPerHost to: 20
[junit4] 2> 593693 T1950 oashc.HttpShardHandlerFactory.getParameter Setting corePoolSize to: 0
[junit4] 2> 593693 T1950 oashc.HttpShardHandlerFactory.getParameter Setting maximumPoolSize to: 2147483647
[junit4] 2> 593693 T1950 oashc.HttpShardHandlerFactory.getParameter Setting maxThreadIdleTime to: 5
[junit4] 2> 593694 T1950 oashc.HttpShardHandlerFactory.getParameter Setting sizeOfQueue to: -1
[junit4] 2> 593694 T1950 oashc.HttpShardHandlerFactory.getParameter Setting fairnessPolicy to: false
[junit4] 2> 593695 T1950 oasl.LogWatcher.createWatcher SLF4J impl is org.slf4j.impl.Log4jLoggerFactory
[junit4] 2> 593695 T1950 oasl.LogWatcher.newRegisteredLogWatcher Registering Log Listener [Log4j (org.slf4j.impl.Log4jLoggerFactory)]
[junit4] 2> 593695 T1950 oasc.CoreContainer.load Host Name: 127.0.0.1
[junit4] 2> 593696 T1950 oasc.ZkContainer.initZooKeeper Zookeeper client=127.0.0.1:49804/solr
[junit4] 2> 593697 T1950 oasc.ZkController.checkChrootPath zkHost includes chroot
[junit4] 2> 593698 T1950 oascc.ConnectionManager.waitForConnected Waiting for client to connect to ZooKeeper
[junit4] 2> 593701 T1970 oascc.ConnectionManager.process Watcher org.apache.solr.common.cloud.ConnectionManager@2a1c3936 name:ZooKeeperConnection Watcher:127.0.0.1:49804 got event WatchedEvent state:SyncConnected type:None path:null path:null type:None
[junit4] 2> 593702 T1950 oascc.ConnectionManager.waitForConnected Client is connected to ZooKeeper
[junit4] 2> 593708 T1950 oascc.ConnectionManager.waitForConnected Waiting for client to connect to ZooKeeper
[junit4] 2> 593711 T1972 oascc.ConnectionManager.process Watcher org.apache.solr.common.cloud.ConnectionManager@42c0dab3 name:ZooKeeperConnection Watcher:127.0.0.1:49804/solr got event WatchedEvent state:SyncConnected type:None path:null path:null type:None
[junit4] 2> 593712 T1950 oascc.ConnectionManager.waitForConnected Client is connected to ZooKeeper
[junit4] 2> 593716 T1950 oascc.SolrZkClient.makePath makePath: /overseer/queue
[junit4] 2> 593728 T1950 oascc.SolrZkClient.makePath makePath: /overseer/collection-queue-work
[junit4] 2> 593741 T1950 oascc.SolrZkClient.makePath makePath: /overseer/collection-map-running
[junit4] 2> 593751 T1950 oascc.SolrZkClient.makePath makePath: /overseer/collection-map-completed
[junit4] 2> 593761 T1950 oascc.SolrZkClient.makePath makePath: /overseer/collection-map-failure
[junit4] 2> 593771 T1950 oascc.SolrZkClient.makePath makePath: /live_nodes
[junit4] 2> 593775 T1950 oasc.ZkController.createEphemeralLiveNode Register node as live in ZooKeeper:/live_nodes/127.0.0.1:49807_
[junit4] 2> 593777 T1950 oascc.SolrZkClient.makePath makePath: /live_nodes/127.0.0.1:49807_
[junit4] 2> 593786 T1950 oascc.SolrZkClient.makePath makePath: /overseer_elect
[junit4] 2> 593793 T1950 oascc.SolrZkClient.makePath makePath: /overseer_elect/election
[junit4] 2> 593804 T1950 oasc.OverseerElectionContext.runLeaderProcess I am going to be the leader 127.0.0.1:49807_
[junit4] 2> 593804 T1950 oascc.SolrZkClient.makePath makePath: /overseer_elect/leader
[junit4] 2> 593811 T1950 oasc.Overseer.start Overseer (id=91568349061840899-127.0.0.1:49807_-n_0000000000) starting
[junit4] 2> 593821 T1950 oascc.SolrZkClient.makePath makePath: /overseer/queue-work
[junit4] 2> 593853 T1974 oasc.OverseerCollectionProcessor.run Process current queue of collection creations
[junit4] 2> 593854 T1950 oascc.SolrZkClient.makePath makePath: /clusterstate.json
[junit4] 2> 593856 T1974 oasc.OverseerCollectionProcessor.prioritizeOverseerNodes prioritizing overseer nodes at 127.0.0.1:49807_
[junit4] 2> 593862 T1950 oascc.SolrZkClient.makePath makePath: /aliases.json
[junit4] 2> 593869 T1950 oascc.ZkStateReader.createClusterStateWatchersAndUpdate Updating cluster state from ZooKeeper...
[junit4] 2> 593878 T1973 oasc.Overseer$ClusterStateUpdater.run Starting to work on the main queue
[junit4] 2> 593886 T1950 oass.SolrDispatchFilter.init user.dir=/Users/jenkins/workspace/Lucene-Solr-trunk-MacOSX/solr/build/solr-core/test/J0
[junit4] 2> 593886 T1950 oass.SolrDispatchFilter.init SolrDispatchFilter.init() done
[junit4] 2> 593888 T1950 oascc.ConnectionManager.waitForConnected Waiting for client to connect to ZooKeeper
[junit4] 2> 593891 T1977 oascc.ConnectionManager.process Watcher org.apache.solr.common.cloud.ConnectionManager@2f0d8680 name:ZooKeeperConnection Watcher:127.0.0.1:49804/solr got event WatchedEvent state:SyncConnected type:None path:null path:null type:None
[junit4] 2> 593892 T1950 oascc.ConnectionManager.waitForConnected Client is connected to ZooKeeper
[junit4] 2> 593895 T1950 oascc.ZkStateReader.createClusterStateWatchersAndUpdate Updating cluster state from ZooKeeper...
[junit4] 2> 593901 T1950 oasc.ChaosMonkey.monkeyLog monkey: init - expire sessions:false cause connection loss:false
[junit4] 2> 595462 T1950 oasc.AbstractFullDistribZkTestBase.createJettys create jetty 1
[junit4] 2> 595464 T1950 oejs.Server.doStart jetty-8.1.10.v20130312
[junit4] 2> 595469 T1950 oejs.AbstractConnector.doStart Started SelectChannelConnector@127.0.0.1:49811
[junit4] 2> 595470 T1950 oass.SolrDispatchFilter.init SolrDispatchFilter.init()
[junit4] 2> 595470 T1950 oasc.SolrResourceLoader.locateSolrHome JNDI not configured for solr (NoInitialContextEx)
[junit4] 2> 595471 T1950 oasc.SolrResourceLoader.locateSolrHome using system property solr.solr.home: ../../../../../../../../../Users/jenkins/workspace/Lucene-Solr-trunk-MacOSX/solr/build/solr-core/test/J0/./solr.cloud.CollectionsAPIDistributedZkTest-2CA84FADD31C1010-001/tempDir-003
[junit4] 2> 595471 T1950 oasc.SolrResourceLoader.<init> new SolrResourceLoader for directory: '../../../../../../../../../Users/jenkins/workspace/Lucene-Solr-trunk-MacOSX/solr/build/solr-core/test/J0/./solr.cloud.CollectionsAPIDistributedZkTest-2CA84FADD31C1010-001/tempDir-003/'
[junit4] 2> 595514 T1950 oasc.ConfigSolr.fromFile Loading container configuration from /Users/jenkins/workspace/Lucene-Solr-trunk-MacOSX/solr/build/solr-core/test/J0/../../../../../../../../../Users/jenkins/workspace/Lucene-Solr-trunk-MacOSX/solr/build/solr-core/test/J0/./solr.cloud.CollectionsAPIDistributedZkTest-2CA84FADD31C1010-001/tempDir-003/solr.xml
[junit4] 2> 595657 T1950 oasc.CoreContainer.<init> New CoreContainer 1748203571
[junit4] 2> 595658 T1950 oasc.CoreContainer.load Loading cores into CoreContainer [instanceDir=../../../../../../../../../Users/jenkins/workspace/Lucene-Solr-trunk-MacOSX/solr/build/solr-core/test/J0/./solr.cloud.CollectionsAPIDistributedZkTest-2CA84FADD31C1010-001/tempDir-003/]
[junit4] 2> 595660 T1950 oashc.HttpShardHandlerFactory.getParameter Setting socketTimeout to: 120000
[junit4] 2> 595660 T1950 oashc.HttpShardHandlerFactory.getParameter Setting urlScheme to: null
[junit4] 2> 595660 T1950 oashc.HttpShardHandlerFactory.getParameter Setting connTimeout to: 15000
[junit4] 2> 595661 T1950 oashc.HttpShardHandlerFactory.getParameter Setting maxConnectionsPerHost to: 20
[junit4] 2> 595661 T1950 oashc.HttpShardHandlerFactory.getParameter Setting corePoolSize to: 0
[junit4] 2> 595661 T1950 oashc.HttpShardHandlerFactory.getParameter Setting maximumPoolSize to: 2147483647
[junit4] 2> 595662 T1950 oashc.HttpShardHandlerFactory.getParameter Setting maxThreadIdleTime to: 5
[junit4] 2> 595662 T1950 oashc.HttpShardHandlerFactory.getParameter Setting sizeOfQueue to: -1
[junit4] 2> 595663 T1950 oashc.HttpShardHandlerFactory.getParameter Setting fairnessPolicy to: false
[junit4] 2> 595664 T1950 oasl.LogWatcher.createWatcher SLF4J impl is org.slf4j.impl.Log4jLoggerFactory
[junit4] 2> 595664 T1950 oasl.LogWatcher.newRegisteredLogWatcher Registering Log Listener [Log4j (org.slf4j.impl.Log4jLoggerFactory)]
[junit4] 2> 595664 T1950 oasc.CoreContainer.load Host Name: 127.0.0.1
[junit4] 2> 595664 T1950 oasc.ZkContainer.initZooKeeper Zookeeper client=127.0.0.1:49804/solr
[junit4] 2> 595665 T1950 oasc.ZkController.checkChrootPath zkHost includes chroot
[junit4] 2> 595667 T1950 oascc.ConnectionManager.waitForConnected Waiting for client to connect to ZooKeeper
[junit4] 2> 595671 T1988 oascc.ConnectionManager.process Watcher org.apache.solr.common.cloud.ConnectionManager@b1891b7 name:ZooKeeperConnection Watcher:127.0.0.1:49804 got event WatchedEvent state:SyncConnected type:None path:null path:null type:None
[junit4] 2> 595672 T1950 oascc.ConnectionManager.waitForConnected Client is connected to ZooKeeper
[junit4] 2> 595678 T1950 oascc.ConnectionManager.waitForConnected Waiting for client to connect to ZooKeeper
[junit4] 2> 595681 T1990 oascc.ConnectionManager.process Watcher org.apache.solr.common.cloud.ConnectionManager@3c6d5289 name:ZooKeeperConnection Watcher:127.0.0.1:49804/solr got event WatchedEvent state:SyncConnected type:None path:null path:null type:None
[junit4] 2> 595682 T1950 oascc.ConnectionManager.waitForConnected Client is connected to ZooKeeper
[junit4] 2> 595704 T1950 oascc.ZkStateReader.createClusterStateWatchersAndUpdate Updating cluster state from ZooKeeper...
[junit4] 2> 596714 T1950 oasc.ZkController.createEphemeralLiveNode Register node as live in ZooKeeper:/live_nodes/127.0.0.1:49811_
[junit4] 2> 596717 T1950 oascc.SolrZkClient.makePath makePath: /live_nodes/127.0.0.1:49811_
[junit4] 2> 596726 T1972 oascc.ZkStateReader$3.process Updating live nodes... (2)
[junit4] 2> 596726 T1990 oascc.ZkStateReader$3.process Updating live nodes... (2)
[junit4] 2> 596726 T1977 oascc.ZkStateReader$3.process Updating live nodes... (2)
[junit4] 2> 596743 T1950 oass.SolrDispatchFilter.init user.dir=/Users/jenkins/workspace/Lucene-Solr-trunk-MacOSX/solr/build/solr-core/test/J0
[junit4] 2> 596743 T1950 oass.SolrDispatchFilter.init SolrDispatchFilter.init() done
[junit4] 2> 598339 T1950 oasc.AbstractFullDistribZkTestBase.createJettys create jetty 2
[junit4] 2> 598339 T1950 oejs.Server.doStart jetty-8.1.10.v20130312
[junit4] 2> 598344 T1950 oejs.AbstractConnector.doStart Started SelectChannelConnector@127.0.0.1:49814
[junit4] 2> 598346 T1950 oass.SolrDispatchFilter.init SolrDispatchFilter.init()
[junit4] 2> 598347 T1950 oasc.SolrResourceLoader.locateSolrHome JNDI not configured for solr (NoInitialContextEx)
[junit4] 2> 598347 T1950 oasc.SolrResourceLoader.locateSolrHome using system property solr.solr.home: ../../../../../../../../../Users/jenkins/workspace/Lucene-Solr-trunk-MacOSX/solr/build/solr-core/test/J0/./solr.cloud.CollectionsAPIDistributedZkTest-2CA84FADD31C1010-001/tempDir-004
[junit4] 2> 598347 T1950 oasc.SolrResourceLoader.<init> new SolrResourceLoader for directory: '../../../../../../../../../Users/jenkins/workspace/Lucene-Solr-trunk-MacOSX/solr/build/solr-core/test/J0/./solr.cloud.CollectionsAPIDistributedZkTest-2CA84FADD31C1010-001/tempDir-004/'
[junit4] 2> 598390 T1950 oasc.ConfigSolr.fromFile Loading container configuration from /Users/jenkins/workspace/Lucene-Solr-trunk-MacOSX/solr/build/solr-core/test/J0/../../../../../../../../../Users/jenkins/workspace/Lucene-Solr-trunk-MacOSX/solr/build/solr-core/test/J0/./solr.cloud.CollectionsAPIDistributedZkTest-2CA84FADD31C1010-001/tempDir-004/solr.xml
[junit4] 2> 598491 T1950 oasc.CoreContainer.<init> New CoreContainer 1455582875
[junit4] 2> 598491 T1950 oasc.CoreContainer.load Loading cores into CoreContainer [instanceDir=../../../../../../../../../Users/jenkins/workspace/Lucene-Solr-trunk-MacOSX/solr/build/solr-core/test/J0/./solr.cloud.CollectionsAPIDistributedZkTest-2CA84FADD31C1010-001/tempDir-004/]
[junit4] 2> 598494 T1950 oashc.HttpShardHandlerFactory.getParameter Setting socketTimeout to: 120000
[junit4] 2> 598494 T1950 oashc.HttpShardHandlerFactory.getParameter Setting urlScheme to: null
[junit4] 2> 598495 T1950 oashc.HttpShardHandlerFactory.getParameter Setting connTimeout to: 15000
[junit4] 2> 598495 T1950 oashc.HttpShardHandlerFactory.getParameter Setting maxConnectionsPerHost to: 20
[junit4] 2> 598496 T1950 oashc.HttpShardHandlerFactory.getParameter Setting corePoolSize to: 0
[junit4] 2> 598496 T1950 oashc.HttpShardHandlerFactory.getParameter Setting maximumPoolSize to: 2147483647
[junit4] 2> 598496 T1950 oashc.HttpShardHandlerFactory.getParameter Setting maxThreadIdleTime to: 5
[junit4] 2> 598497 T1950 oashc.HttpShardHandlerFactory.getParameter Setting sizeOfQueue to: -1
[junit4] 2> 598497 T1950 oashc.HttpShardHandlerFactory.getParameter Setting fairnessPolicy to: false
[junit4] 2> 598498 T1950 oasl.LogWatcher.createWatcher SLF4J impl is org.slf4j.impl.Log4jLoggerFactory
[junit4] 2> 598499 T1950 oasl.LogWatcher.newRegisteredLogWatcher Registering Log Listener [Log4j (org.slf4j.impl.Log4jLoggerFactory)]
[junit4] 2> 598499 T1950 oasc.CoreContainer.load Host Name: 127.0.0.1
[junit4] 2> 598499 T1950 oasc.ZkContainer.initZooKeeper Zookeeper client=127.0.0.1:49804/solr
[junit4] 2> 598500 T1950 oasc.ZkController.checkChrootPath zkHost includes chroot
[junit4] 2> 598501 T1950 oascc.ConnectionManager.waitForConnected Waiting for client to connect to ZooKeeper
[junit4] 2> 598506 T2002 oascc.ConnectionManager.process Watcher org.apache.solr.common.cloud.ConnectionManager@76ebae9c name:ZooKeeperConnection Watcher:127.0.0.1:49804 got event WatchedEvent state:SyncConnected type:None path:null path:null type:None
[junit4] 2> 598508 T1950 oascc.ConnectionManager.waitForConnected Client is connected to ZooKeeper
[junit4] 2> 598514 T1950 oascc.ConnectionManager.waitForConnected Waiting for client to connect to ZooKeeper
[junit4] 2> 598519 T2004 oascc.ConnectionManager.process Watcher org.apache.solr.common.cloud.ConnectionManager@5b999f7b name:ZooKeeperConnection Watcher:127.0.0.1:49804/solr got event WatchedEvent state:SyncConnected type:None path:null path:null type:None
[junit4] 2> 598520 T1950 oascc.ConnectionManager.waitForConnected Client is connected to ZooKeeper
[junit4] 2> 598546 T1950 oascc.ZkStateReader.createClusterStateWatchersAndUpdate Updating cluster state from ZooKeeper...
[junit4] 2> 599557 T1950 oasc.ZkController.createEphemeralLiveNode Register node as live in ZooKeeper:/live_nodes/127.0.0.1:49814_
[junit4] 2> 599560 T1950 oascc.SolrZkClient.makePath makePath: /live_nodes/127.0.0.1:49814_
[junit4] 2> 599570 T1972 oascc.ZkStateReader$3.process Updating live nodes... (3)
[junit4] 2> 599570 T2004 oascc.ZkStateReader$3.process Updating live nodes... (3)
[junit4] 2> 599570 T1977 oascc.ZkStateReader$3.process Updating live nodes... (3)
[junit4] 2> 599572 T1990 oascc.ZkStateReader$3.process Updating live nodes... (3)
[junit4] 2> 599592 T1950 oass.SolrDispatchFilter.init user.dir=/Users/jenkins/workspace/Lucene-Solr-trunk-MacOSX/solr/build/solr-core/test/J0
[junit4] 2> 599592 T1950 oass.SolrDispatchFilter.init SolrDispatchFilter.init() done
[junit4] 2> 601397 T1950 oasc.AbstractFullDistribZkTestBase.createJettys create jetty 3
[junit4] 2> 601398 T1950 oejs.Server.doStart jetty-8.1.10.v20130312
[junit4] 2> 601406 T1950 oejs.AbstractConnector.doStart Started SelectChannelConnector@127.0.0.1:49817
[junit4] 2> 601408 T1950 oass.SolrDispatchFilter.init SolrDispatchFilter.init()
[junit4] 2> 601409 T1950 oasc.SolrResourceLoader.locateSolrHome JNDI not configured for solr (NoInitialContextEx)
[junit4] 2> 601410 T1950 oasc.SolrResourceLoader.locateSolrHome using system property solr.solr.home: ./solr.cloud.CollectionsAPIDistributedZkTest-2CA84FADD31C1010-001/tempDir-005
[junit4] 2> 601410 T1950 oasc.SolrResourceLoader.<init> new SolrResourceLoader for directory: './solr.cloud.CollectionsAPIDistributedZkTest-2CA84FADD31C1010-001/tempDir-005/'
[junit4] 2> 601459 T1950 oasc.ConfigSolr.fromFile Loading container configuration from /Users/jenkins/workspace/Lucene-Solr-trunk-MacOSX/solr/build/solr-core/test/J0/./solr.cloud.CollectionsAPIDistributedZkTest-2CA84FADD31C1010-001/tempDir-005/solr.xml
[junit4] 2> 601581 T1950 oasc.CoreContainer.<init> New CoreContainer 2118834191
[junit4] 2> 601582 T1950 oasc.CoreContainer.load Loading cores into CoreContainer [instanceDir=./solr.cloud.CollectionsAPIDistributedZkTest-2CA84FADD31C1010-001/tempDir-005/]
[junit4] 2> 601585 T1950 oashc.HttpShardHandlerFactory.getParameter Setting socketTimeout to: 120000
[junit4] 2> 601587 T1950 oashc.HttpShardHandlerFactory.getParameter Setting urlScheme to: null
[junit4] 2> 601587 T1950 oashc.HttpShardHandlerFactory.getParameter Setting connTimeout to: 15000
[junit4] 2> 601588 T1950 oashc.HttpShardHandlerFactory.getParameter Setting maxConnectionsPerHost to: 20
[junit4] 2> 601588 T1950 oashc.HttpShardHandlerFactory.getParameter Setting corePoolSize to: 0
[junit4] 2> 601588 T1950 oashc.HttpShardHandlerFactory.getParameter Setting maximumPoolSize to: 2147483647
[junit4] 2> 601589 T1950 oashc.HttpShardHandlerFactory.getParameter Setting maxThreadIdleTime to: 5
[junit4] 2> 601589 T1950 oashc.HttpShardHandlerFactory.getParameter Setting sizeOfQueue to: -1
[junit4] 2> 601590 T1950 oashc.HttpShardHandlerFactory.getParameter Setting fairnessPolicy to: false
[junit4] 2> 601591 T1950 oasl.LogWatcher.createWatcher SLF4J impl is org.slf4j.impl.Log4jLoggerFactory
[junit4] 2> 601591 T1950 oasl.LogWatcher.newRegisteredLogWatcher Registering Log Listener [Log4j (org.slf4j.impl.Log4jLoggerFactory)]
[junit4] 2> 601591 T1950 oasc.CoreContainer.load Host Name: 127.0.0.1
[junit4] 2> 601592 T1950 oasc.ZkContainer.initZooKeeper Zookeeper client=127.0.0.1:49804/solr
[junit4] 2> 601593 T1950 oasc.ZkController.checkChrootPath zkHost includes chroot
[junit4] 2> 601595 T1950 oascc.ConnectionManager.waitForConnected Waiting for client to connect to ZooKeeper
[junit4] 2> 601601 T2016 oascc.ConnectionManager.process Watcher org.apache.solr.common.cloud.ConnectionManager@63af018f name:ZooKeeperConnection Watcher:127.0.0.1:49804 got event WatchedEvent state:SyncConnected type:None path:null path:null type:None
[junit4] 2> 601603 T1950 oascc.ConnectionManager.waitForConnected Client is connected to ZooKeeper
[junit4] 2> 601611 T1950 oascc.ConnectionManager.waitForConnected Waiting for client to connect to ZooKeeper
[junit4] 2> 601616 T2018 oascc.ConnectionManager.process Watcher org.apache.solr.common.cloud.ConnectionManager@8aa185 name:ZooKeeperConnection Watcher:127.0.0.1:49804/solr got event WatchedEvent state:SyncConnected type:None path:null path:null type:None
[junit4] 2> 601617 T1950 oascc.ConnectionManager.waitForConnected Client is connected to ZooKeeper
[junit4] 2> 601642 T1950 oascc.ZkStateReader.createClusterStateWatchersAndUpdate Updating cluster state from ZooKeeper...
[junit4] 2> 602653 T1950 oasc.ZkController.createEphemeralLiveNode Register node as live in ZooKeeper:/live_nodes/127.0.0.1:49817_
[junit4] 2> 602656 T1950 oascc.SolrZkClient.makePath makePath: /live_nodes/127.0.0.1:49817_
[junit4] 2> 602667 T2018 oascc.ZkStateReader$3.process Updating live nodes... (4)
[junit4] 2> 602668 T1990 oascc.ZkStateReader$3.process Updating live nodes... (4)
[junit4] 2> 602668 T1972 oascc.ZkStateReader$3.process Updating live nodes... (4)
[junit4] 2> 602668 T2004 oascc.ZkStateReader$3.process Updating live nodes... (4)
[junit4] 2> 602668 T1977 oascc.ZkStateReader$3.process Updating live nodes... (4)
[junit4] 2> 602687 T1950 oass.SolrDispatchFilter.init user.dir=/Users/jenkins/workspace/Lucene-Solr-trunk-MacOSX/solr/build/solr-core/test/J0
[junit4] 2> 602687 T1950 oass.SolrDispatchFilter.init SolrDispatchFilter.init() done
[junit4] 2> 604429 T1950 oasc.AbstractFullDistribZkTestBase.createJettys create jetty 4
[junit4] 2> 604432 T1950 oejs.Server.doStart jetty-8.1.10.v20130312
[junit4] 2> 604438 T1950 oejs.AbstractConnector.doStart Started SelectChannelConnector@127.0.0.1:49820
[junit4] 2> 604439 T1950 oass.SolrDispatchFilter.init SolrDispatchFilter.init()
[junit4] 2> 604440 T1950 oasc.SolrResourceLoader.locateSolrHome JNDI not configured for solr (NoInitialContextEx)
[junit4] 2> 604440 T1950 oasc.SolrResourceLoader.locateSolrHome using system property solr.solr.home: ./solr.cloud.CollectionsAPIDistributedZkTest-2CA84FADD31C1010-001/tempDir-006
[junit4] 2> 604440 T1950 oasc.SolrResourceLoader.<init> new SolrResourceLoader for directory: './solr.cloud.CollectionsAPIDistributedZkTest-2CA84FADD31C1010-001/tempDir-006/'
[junit4] 2> 604487 T1950 oasc.ConfigSolr.fromFile Loading container configuration from /Users/jenkins/workspace/Lucene-Solr-trunk-MacOSX/solr/build/solr-core/test/J0/./solr.cloud.CollectionsAPIDistributedZkTest-2CA84FADD31C1010-001/tempDir-006/solr.xml
[junit4] 2> 604596 T1950 oasc.CoreContainer.<init> New CoreContainer 1397317200
[junit4] 2> 604596 T1950 oasc.CoreContainer.load Loading cores into CoreContainer [instanceDir=./solr.cloud.CollectionsAPIDistributedZkTest-2CA84FADD31C1010-001/tempDir-006/]
[junit4] 2> 604599 T1950 oashc.HttpShardHandlerFactory.getParameter Setting socketTimeout to: 120000
[junit4] 2> 604599 T1950 oashc.HttpShardHandlerFactory.getParameter Setting urlScheme to: null
[junit4] 2> 604600 T1950 oashc.HttpShardHandlerFactory.getParameter Setting connTimeout to: 15000
[junit4] 2> 604600 T1950 oashc.HttpShardHandlerFactory.getParameter Setting maxConnectionsPerHost to: 20
[junit4] 2> 604601 T1950 oashc.HttpShardHandlerFactory.getParameter Setting corePoolSize to: 0
[junit4] 2> 604601 T1950 oashc.HttpShardHandlerFactory.getParameter Setting maximumPoolSize to: 2147483647
[junit4] 2> 604601 T1950 oashc.HttpShardHandlerFactory.getParameter Setting maxThreadIdleTime to: 5
[junit4] 2> 604602 T1950 oashc.HttpShardHandlerFactory.getParameter Setting sizeOfQueue to: -1
[junit4] 2> 604602 T1950 oashc.HttpShardHandlerFactory.getParameter Setting fairnessPolicy to: false
[junit4] 2> 604603 T1950 oasl.LogWatcher.createWatcher SLF4J impl is org.slf4j.impl.Log4jLoggerFactory
[junit4] 2> 604604 T1950 oasl.LogWatcher.newRegisteredLogWatcher Registering Log Listener [Log4j (org.slf4j.impl.Log4jLoggerFactory)]
[junit4] 2> 604605 T1950 oasc.CoreContainer.load Host Name: 127.0.0.1
[junit4] 2> 604605 T1950 oasc.ZkContainer.initZooKeeper Zookeeper client=127.0.0.1:49804/solr
[junit4] 2> 604606 T1950 oasc.ZkController.checkChrootPath zkHost includes chroot
[junit4] 2> 604608 T1950 oascc.ConnectionManager.waitForConnected Waiting for client to connect to ZooKeeper
[junit4] 2> 604614 T2030 oascc.ConnectionManager.process Watcher org.apache.solr.common.cloud.ConnectionManager@75cf00e7 name:ZooKeeperConnection Watcher:127.0.0.1:49804 got event WatchedEvent state:SyncConnected type:None path:null path:null type:None
[junit4] 2> 604616 T1950 oascc.ConnectionManager.waitForConnected Client is connected to ZooKeeper
[junit4] 2> 604623 T1950 oascc.ConnectionManager.waitForConnected Waiting for client to connect to ZooKeeper
[junit4] 2> 604630 T2032 oascc.ConnectionManager.process Watcher org.apache.solr.common.cloud.ConnectionManager@1ba38c8c name:ZooKeeperConnection Watcher:127.0.0.1:49804/solr got event WatchedEvent state:SyncConnected type:None path:null path:null type:None
[junit4] 2> 604630 T1950 oascc.ConnectionManager.waitForConnected Client is connected to ZooKeeper
[junit4] 2> 604660 T1950 oascc.ZkStateReader.createClusterStateWatchersAndUpdate Updating cluster state from ZooKeeper...
[junit4] 2> 605672 T1950 oasc.ZkController.createEphemeralLiveNode Register node as live in ZooKeeper:/live_nodes/127.0.0.1:49820_
[junit4] 2> 605675 T1950 oascc.SolrZkClient.makePath makePath: /live_nodes/127.0.0.1:49820_
[junit4] 2> 605685 T2018 oascc.ZkStateReader$3.process Updating live nodes... (5)
[junit4] 2> 605686 T2004 oascc.ZkStateReader$3.process Updating live nodes... (5)
[junit4] 2> 605685 T1990 oascc.ZkStateReader$3.process Updating live nodes... (5)
[junit4] 2> 605685 T1977 oascc.ZkStateReader$3.process Updating live nodes... (5)
[junit4] 2> 605687 T2032 oascc.ZkStateReader$3.process Updating live nodes... (5)
[junit4] 2> 605686 T1972 oascc.ZkStateReader$3.process Updating live nodes... (5)
[junit4] 2> 605706 T1950 oass.SolrDispatchFilter.init user.dir=/Users/jenkins/workspace/Lucene-Solr-trunk-MacOSX/solr/build/solr-core/test/J0
[junit4] 2> 605707 T1950 oass.SolrDispatchFilter.init SolrDispatchFilter.init() done
[junit4] 2> 605717 T1981 oasha.CollectionsHandler.handleCreateAction Creating Collection : collection.configName=conf1&router.name=compositeId&wt=javabin&numShards=2&version=2&router.field=myOwnField&action=CREATE&replicationFactor=2&name=solrj_collection
[junit4] 2> 605720 T1972 oasc.DistributedQueue$LatchChildWatcher.process LatchChildWatcher fired on path: /overseer/collection-queue-work state: SyncConnected type NodeChildrenChanged
[junit4] 2> 605723 T1974 oasc.OverseerCollectionProcessor.run Overseer Collection Processor: Get the message id:/overseer/collection-queue-work/qn-0000000000 message:{
[junit4] 2> "operation":"createcollection",
[junit4] 2> "fromApi":"true",
[junit4] 2> "name":"solrj_collection",
[junit4] 2> "replicationFactor":"2",
[junit4] 2> "collection.configName":"conf1",
[junit4] 2> "numShards":"2",
[junit4] 2> "router.name":"compositeId",
[junit4] 2> "router.field":"myOwnField"}
[junit4] 2> 605724 T1974 oasc.OverseerCollectionProcessor.processMessage WARN OverseerCollectionProcessor.processMessage : createcollection , {
[junit4] 2> "operation":"createcollection",
[junit4] 2> "fromApi":"true",
[junit4] 2> "name":"solrj_collection",
[junit4] 2> "replicationFactor":"2",
[junit4] 2> "collection.configName":"conf1",
[junit4] 2> "numShards":"2",
[junit4] 2> "router.name":"compositeId",
[junit4] 2> "router.field":"myOwnField"}
[junit4] 2> 605725 T1974 oasc.OverseerCollectionProcessor.createConfNode creating collections conf node /collections/solrj_collection
[junit4] 2> 605726 T1974 oascc.SolrZkClient.makePath makePath: /collections/solrj_collection
[junit4] 2> 605738 T1972 oasc.DistributedQueue$LatchChildWatcher.process LatchChildWatcher fired on path: /overseer/queue state: SyncConnected type NodeChildrenChanged
[junit4] 2> 605743 T1973 oascc.ZkStateReader.updateClusterState Updating cloud state from ZooKeeper...
[junit4] 2> 605744 T1973 oasc.Overseer$ClusterStateUpdater.buildCollection building a new collection: solrj_collection
[junit4] 2> 605745 T1973 oasc.Overseer$ClusterStateUpdater.createCollection Create collection solrj_collection with shards [shard1, shard2]
[junit4] 2> 605752 T1972 oasc.DistributedQueue$LatchChildWatcher.process LatchChildWatcher fired on path: /overseer/queue state: SyncConnected type NodeChildrenChanged
[junit4] 2> 605756 T2018 oascc.ZkStateReader$2.process A cluster state change: WatchedEvent state:SyncConnected type:NodeDataChanged path:/clusterstate.json, has occurred - updating... (live nodes size: 5)
[junit4] 2> 605756 T1972 oascc.ZkStateReader$2.process A cluster state change: WatchedEvent state:SyncConnected type:NodeDataChanged path:/clusterstate.json, has occurred - updating... (live nodes size: 5)
[junit4] 2> 605756 T1977 oascc.ZkStateReader$2.process A cluster state change: WatchedEvent state:SyncConnected type:NodeDataChanged path:/clusterstate.json, has occurred - updating... (live nodes size: 5)
[junit4] 2> 605756 T2032 oascc.ZkStateReader$2.process A cluster state change: WatchedEvent state:SyncConnected type:NodeDataChanged path:/clusterstate.json, has occurred - updating... (live nodes size: 5)
[junit4] 2> 605756 T1990 oascc.ZkStateReader$2.process A cluster state change: WatchedEvent state:SyncConnected type:NodeDataChanged path:/clusterstate.json, has occurred - updating... (live nodes size: 5)
[junit4] 2> 605757 T2004 oascc.ZkStateReader$2.process A cluster state change: WatchedEvent state:SyncConnected type:NodeDataChanged path:/clusterstate.json, has occurred - updating... (live nodes size: 5)
[junit4] 2> 605840 T1974 oasc.OverseerCollectionProcessor.createCollection Creating SolrCores for new collection, shardNames [shard1, shard2] , replicationFactor : 2
[junit4] 2> 605840 T1974 oasc.OverseerCollectionProcessor.createCollection Creating shard solrj_collection_shard1_replica1 as part of slice shard1 of collection solrj_collection on 127.0.0.1:49814_
[junit4] 2> 605843 T1974 oasc.OverseerCollectionProcessor.createCollection Creating shard solrj_collection_shard1_replica2 as part of slice shard1 of collection solrj_collection on 127.0.0.1:49817_
[junit4] 2> 605846 T1974 oasc.OverseerCollectionProcessor.createCollection Creating shard solrj_collection_shard2_replica1 as part of slice shard2 of collection solrj_collection on 127.0.0.1:49811_
[junit4] 2> 605848 T1995 oasha.CoreAdminHandler.handleCreateAction core create command collection=solrj_collection&collection.configName=conf1&wt=javabin&numShards=2&version=2&qt=/admin/cores&action=CREATE&shard=shard1&name=solrj_collection_shard1_replica1
[junit4] 2> 605850 T2014 oasha.CoreAdminHandler.handleCreateAction core create command collection=solrj_collection&collection.configName=conf1&wt=javabin&numShards=2&version=2&qt=/admin/cores&action=CREATE&shard=shard1&name=solrj_collection_shard1_replica2
[junit4] 2> 605852 T1974 oasc.OverseerCollectionProcessor.createCollection Creating shard solrj_collection_shard2_replica2 as part of slice shard2 of collection solrj_collection on 127.0.0.1:49807_
[junit4] 2> 605856 T2014 oasc.ZkController.publish publishing core=solrj_collection_shard1_replica2 state=down collection=solrj_collection
[junit4] 2> 605856 T1982 oasha.CoreAdminHandler.handleCreateAction core create command collection=solrj_collection&collection.configName=conf1&wt=javabin&numShards=2&version=2&qt=/admin/cores&action=CREATE&shard=shard2&name=solrj_collection_shard2_replica1
[junit4] 2> 605857 T1995 oasc.ZkController.publish publishing core=solrj_collection_shard1_replica1 state=down collection=solrj_collection
[junit4] 2> 605860 T2014 oasc.ZkController.waitForCoreNodeName look for our core node name
[junit4] 2> 605861 T1972 oasc.DistributedQueue$LatchChildWatcher.process LatchChildWatcher fired on path: /overseer/queue state: SyncConnected type NodeChildrenChanged
[junit4] 2> 605862 T1995 oasc.ZkController.waitForCoreNodeName look for our core node name
[junit4] 2> 605864 T1982 oasc.ZkController.publish publishing core=solrj_collection_shard2_replica1 state=down collection=solrj_collection
[junit4] 2> 605868 T1968 oasha.CoreAdminHandler.handleCreateAction core create command collection=solrj_collection&collection.configName=conf1&wt=javabin&numShards=2&version=2&qt=/admin/cores&action=CREATE&shard=shard2&name=solrj_collection_shard2_replica2
[junit4] 2> 605868 T1972 oasc.DistributedQueue$LatchChildWatcher.process LatchChildWatcher fired on path: /overseer/queue state: SyncConnected type NodeChildrenChanged
[junit4] 2> 605870 T1982 oasc.ZkController.waitForCoreNodeName look for our core node name
[junit4] 2> 605870 T1973 oascc.ZkStateReader.updateClusterState Updating cloud state from ZooKeeper...
[junit4] 2> 605873 T1968 oasc.ZkController.publish publishing core=solrj_collection_shard2_replica2 state=down collection=solrj_collection
[junit4] 2> 605875 T1973 oasc.Overseer$ClusterStateUpdater.updateState Update state numShards=2 message={
[junit4] 2> "operation":"state",
[junit4] 2> "state":"down",
[junit4] 2> "base_url":"http://127.0.0.1:49817",
[junit4] 2> "core":"solrj_collection_shard1_replica2",
[junit4] 2> "roles":null,
[junit4] 2> "node_name":"127.0.0.1:49817_",
[junit4] 2> "shard":"shard1",
[junit4] 2> "collection":"solrj_collection",
[junit4] 2> "numShards":"2",
[junit4] 2> "core_node_name":null}
[junit4] 2> 605877 T1968 oasc.ZkController.waitForCoreNodeName look for our core node name
[junit4] 2> 605884 T1973 oasc.Overseer$ClusterStateUpdater.updateState Update state numShards=2 message={
[junit4] 2> "operation":"state",
[junit4] 2> "state":"down",
[junit4] 2> "base_url":"http://127.0.0.1:49814",
[junit4] 2> "core":"solrj_collection_shard1_replica1",
[junit4] 2> "roles":null,
[junit4] 2> "node_name":"127.0.0.1:49814_",
[junit4] 2> "shard":"shard1",
[junit4] 2> "collection":"solrj_collection",
[junit4] 2> "numShards":"2",
[junit4] 2> "core_node_name":null}
[junit4] 2> 605893 T1972 oasc.DistributedQueue$LatchChildWatcher.process LatchChildWatcher fired on path: /overseer/queue state: SyncConnected type NodeChildrenChanged
[junit4] 2> 605895 T1973 oasc.Overseer$ClusterStateUpdater.updateState Update state numShards=2 message={
[junit4] 2> "operation":"state",
[junit4] 2> "state":"down",
[junit4] 2> "base_url":"http://127.0.0.1:49811",
[junit4] 2> "core":"solrj_collection_shard2_replica1",
[junit4] 2> "roles":null,
[junit4] 2> "node_name":"127.0.0.1:49811_",
[junit4] 2> "shard":"shard2",
[junit4] 2> "collection":"solrj_collection",
[junit4] 2> "numShards":"2",
[junit4] 2> "core_node_name":null}
[junit4] 2> 605903 T1972 oasc.DistributedQueue$LatchChildWatcher.process LatchChildWatcher fired on path: /overseer/queue state: SyncConnected type NodeChildrenChanged
[junit4] 2> 605907 T1973 oasc.Overseer$ClusterStateUpdater.updateState Update state numShards=2 message={
[junit4] 2> "operation":"state",
[junit4] 2> "state":"down",
[junit4] 2> "base_url":"http://127.0.0.1:49807",
[junit4] 2> "core":"solrj_collection_shard2_replica2",
[junit4] 2> "roles":null,
[junit4] 2> "node_name":"127.0.0.1:49807_",
[junit4] 2> "shard":"shard2",
[junit4] 2> "collection":"solrj_collection",
[junit4] 2> "numShards":"2",
[junit4] 2> "core_node_name":null}
[junit4] 2> 605917 T1972 oasc.DistributedQueue$LatchChildWatcher.process LatchChildWatcher fired on path: /overseer/queue state: SyncConnected type NodeChildrenChanged
[junit4] 2> 606025 T2032 oascc.ZkStateReader$2.process A cluster state change: WatchedEvent state:SyncConnected type:NodeDataChanged path:/clusterstate.json, has occurred - updating... (live nodes size: 5)
[junit4] 2> 606026 T1977 oascc.ZkStateReader$2.process A cluster state change: WatchedEvent state:SyncConnected type:NodeDataChanged path:/clusterstate.json, has occurred - updating... (live nodes size: 5)
[junit4] 2> 606026 T2018 oascc.ZkStateReader$2.process A cluster state change: WatchedEvent state:SyncConnected type:NodeDataChanged path:/clusterstate.json, has occurred - updating... (live nodes size: 5)
[junit4] 2> 606025 T1972 oascc.ZkStateReader$2.process A cluster state change: WatchedEvent state:SyncConnected type:NodeDataChanged path:/clusterstate.json, has occurred - updating... (live nodes size: 5)
[junit4] 2> 606025 T1990 oascc.ZkStateReader$2.process A cluster state change: WatchedEvent state:SyncConnected type:NodeDataChanged path:/clusterstate.json, has occurred - updating... (live nodes size: 5)
[junit4] 2> 606026 T2004 oascc.ZkStateReader$2.process A cluster state change: WatchedEvent state:SyncConnected type:NodeDataChanged path:/clusterstate.json, has occurred - updating... (live nodes size: 5)
[junit4] 2> 606862 T2014 oasc.ZkController.waitForShardId waiting to find shard id in clusterstate for solrj_collection_shard1_replica2
[junit4] 2> 606863 T1995 oasc.ZkController.waitForShardId waiting to find shard id in clusterstate for solrj_collection_shard1_replica1
[junit4] 2> 606865 T2014 oasc.SolrXMLCoresLocator.doPersist Persisted core descriptions to /Users/jenkins/workspace/Lucene-Solr-trunk-MacOSX/solr/build/solr-core/test/J0/./solr.cloud.CollectionsAPIDistributedZkTest-2CA84FADD31C1010-001/tempDir-005/solr.xml
[junit4] 2> 606865 T2014 oasc.ZkController.createCollectionZkNode Check for collection zkNode:solrj_collection
[junit4] 2> 606865 T1995 oasc.SolrXMLCoresLocator.doPersist Persisted core descriptions to /Users/jenkins/workspace/Lucene-Solr-trunk-MacOSX/solr/build/solr-core/test/J0/../../../../../../../../../Users/jenkins/workspace/Lucene-Solr-trunk-MacOSX/solr/build/solr-core/test/J0/./solr.cloud.CollectionsAPIDistributedZkTest-2CA84FADD31C1010-001/tempDir-004/solr.xml
[junit4] 2> 606867 T1995 oasc.ZkController.createCollectionZkNode Check for collection zkNode:solrj_collection
[junit4] 2> 606868 T2014 oasc.ZkController.createCollectionZkNode Collection zkNode exists
[junit4] 2> 606869 T2014 oascc.ZkStateReader.readConfigName Load collection config from:/collections/solrj_collection
[junit4] 2> 606869 T1995 oasc.ZkController.createCollectionZkNode Collection zkNode exists
[junit4] 2> 606871 T1995 oascc.ZkStateReader.readConfigName Load collection config from:/collections/solrj_collection
[junit4] 2> 606872 T1982 oasc.ZkController.waitForShardId waiting to find shard id in clusterstate for solrj_collection_shard2_replica1
[junit4] 2> 606874 T1982 oasc.SolrXMLCoresLocator.doPersist Persisted core descriptions to /Users/jenkins/workspace/Lucene-Solr-trunk-MacOSX/solr/build/solr-core/test/J0/../../../../../../../../../Users/jenkins/workspace/Lucene-Solr-trunk-MacOSX/solr/build/solr-core/test/J0/./solr.cloud.CollectionsAPIDistributedZkTest-2CA84FADD31C1010-001/tempDir-003/solr.xml
[junit4] 2> 606874 T1982 oasc.ZkController.createCollectionZkNode Check for collection zkNode:solrj_collection
[junit4] 2> 606876 T1995 oascc.ZkStateReader.readConfigName path=/collections/solrj_collection configName=conf1 specified config exists in ZooKeeper
[junit4] 2> 606876 T1995 oasc.SolrResourceLoader.<init> new SolrResourceLoader for directory: '../../../../../../../../../Users/jenkins/workspace/Lucene-Solr-trunk-MacOSX/solr/build/solr-core/test/J0/./solr.cloud.CollectionsAPIDistributedZkTest-2CA84FADD31C1010-001/tempDir-004/solrj_collection_shard1_replica1/'
[junit4] 2> 606877 T2014 oascc.ZkStateReader.readConfigName path=/collections/solrj_collection configName=conf1 specified config exists in ZooKeeper
[junit4] 2> 606877 T2014 oasc.SolrResourceLoader.<init> new SolrResourceLoader for directory: './solr.cloud.CollectionsAPIDistributedZkTest-2CA84FADD31C1010-001/tempDir-005/solrj_collection_shard1_replica2/'
[junit4] 2> 606879 T1982 oasc.ZkController.createCollectionZkNode Collection zkNode exists
[junit4] 2> 606880 T1982 oascc.ZkStateReader.readConfigName Load collection config from:/collections/solrj_collection
[junit4] 2> 606882 T1968 oasc.ZkController.waitForShardId waiting to find shard id in clusterstate for solrj_collection_shard2_replica2
[junit4] 2> 606883 T1968 oasc.SolrXMLCoresLocator.doPersist Persisted core descriptions to /Users/jenkins/workspace/Lucene-Solr-trunk-MacOSX/solr/build/solr-core/test/J0/../../../../../../../../../Users/jenkins/workspace/Lucene-Solr-trunk-MacOSX/solr/build/solr-core/test/J0/./solr.cloud.CollectionsAPIDistributedZkTest-2CA84FADD31C1010-001/tempDir-002/solr.xml
[junit4] 2> 606884 T1968 oasc.ZkController.createCollectionZkNode Check for collection zkNode:solrj_collection
[junit4] 2> 606886 T1968 oasc.ZkController.createCollectionZkNode Collection zkNode exists
[junit4] 2> 606887 T1968 oascc.ZkStateReader.readConfigName Load collection config from:/collections/solrj_collection
[junit4] 2> 606892 T1968 oascc.ZkStateReader.readConfigName path=/collections/solrj_collection configName=conf1 specified config exists in ZooKeeper
[junit4] 2> 606893 T1968 oasc.SolrResourceLoader.<init> new SolrResourceLoader for directory: '../../../../../../../../../Users/jenkins/workspace/Lucene-Solr-trunk-MacOSX/solr/build/solr-core/test/J0/./solr.cloud.CollectionsAPIDistributedZkTest-2CA84FADD31C1010-001/tempDir-002/solrj_collection_shard2_replica2/'
[junit4] 2> 606908 T1982 oascc.ZkStateReader.readConfigName path=/collections/solrj_collection configName=conf1 specified config exists in ZooKeeper
[junit4] 2> 606908 T1982 oasc.SolrResourceLoader.<init> new SolrResourceLoader for directory: '../../../../../../../../../Users/jenkins/workspace/Lucene-Solr-trunk-MacOSX/solr/build/solr-core/test/J0/./solr.cloud.CollectionsAPIDistributedZkTest-2CA84FADD31C1010-001/tempDir-003/solrj_collection_shard2_replica1/'
[junit4] 2> 607028 T1968 oasc.SolrConfig.<init> Using Lucene MatchVersion: LUCENE_50
[junit4] 2> 607029 T2014 oasc.SolrConfig.<init> Using Lucene MatchVersion: LUCENE_50
[junit4] 2> 607047 T1995 oasc.SolrConfig.<init> Using Lucene MatchVersion: LUCENE_50
[junit4] 2> 607111 T1982 oasc.SolrConfig.<init> Using Lucene MatchVersion: LUCENE_50
[junit4] 2> 607308 T1982 oasc.SolrConfig.<init> Loaded SolrConfig: solrconfig.xml
[junit4] 2> 607312 T1968 oasc.SolrConfig.<init> Loaded SolrConfig: solrconfig.xml
[junit4] 2> 607315 T1982 oass.IndexSchema.readSchema Reading Solr Schema from schema.xml
[junit4] 2> 607317 T1968 oass.IndexSchema.readSchema Reading Solr Schema from schema.xml
[junit4] 2> 607319 T1995 oasc.SolrConfig.<init> Loaded SolrConfig: solrconfig.xml
[junit4] 2> 607333 T1982 oass.IndexSchema.readSchema [solrj_collection_shard2_replica1] Schema name=test
[junit4] 2> 607337 T1968 oass.IndexSchema.readSchema [solrj_collection_shard2_replica2] Schema name=test
[junit4] 2> 607350 T2014 oasc.SolrConfig.<init> Loaded SolrConfig: solrconfig.xml
[junit4] 2> 607358 T2014 oass.IndexSchema.readSchema Reading Solr Schema from schema.xml
[junit4] 2> 607365 T1995 oass.IndexSchema.readSchema Reading Solr Schema from schema.xml
[junit4] 2> 607386 T1995 oass.IndexSchema.readSchema [solrj_collection_shard1_replica1] Schema name=test
[junit4] 2> 607410 T2014 oass.IndexSchema.readSchema [solrj_collection_shard1_replica2] Schema name=test
[junit4] 2> 608906 T1995 oass.OpenExchangeRatesOrgProvider.init Initialized with rates=open-exchange-rates.json, refreshInterval=1440.
[junit4] 2> 608917 T1982 oass.OpenExchangeRatesOrgProvider.init Initialized with rates=open-exchange-rates.json, refreshInterval=1440.
[junit4] 2> 608932 T1982 oass.IndexSchema.readSchema default search field in schema is text
[junit4] 2> 608937 T1982 oass.IndexSchema.readSchema unique key field: id
[junit4] 2> 608942 T1995 oass.IndexSchema.readSchema default search field in schema is text
[junit4] 2> 608947 T1995 oass.IndexSchema.readSchema unique key field: id
[junit4] 2> 608959 T1968 oass.OpenExchangeRatesOrgProvider.init Initialized with rates=open-exchange-rates.json, refreshInterval=1440.
[junit4] 2> 608970 T1968 oass.IndexSchema.readSchema default search field in schema is text
[junit4] 2> 608985 T1968 oass.IndexSchema.readSchema unique key field: id
[junit4] 2> 609020 T1982 oass.FileExchangeRateProvider.reload Reloading exchange rates from file currency.xml
[junit4] 2> 609031 T1982 oass.FileExchangeRateProvider.reload Reloading exchange rates from file currency.xml
[junit4] 2> 609032 T1995 oass.FileExchangeRateProvider.reload Reloading exchange rates from file currency.xml
[junit4] 2> 609040 T1982 oass.OpenExchangeRatesOrgProvider.reload Reloading exchange rates from open-exchange-rates.json
[junit4] 2> 609049 T1995 oass.FileExchangeRateProvider.reload Reloading exchange rates from file currency.xml
[junit4] 2> 609056 T1968 oass.FileExchangeRateProvider.reload Reloading exchange rates from file currency.xml
[junit4] 2> 609057 T1982 oass.OpenExchangeRatesOrgProvider$OpenExchangeRates.<init> WARN Unknown key IMPORTANT NOTE
[junit4] 2> 609067 T1982 oass.OpenExchangeRatesOrgProvider$OpenExchangeRates.<init> WARN Expected key, got STRING
[junit4] 2> 609067 T1982 oass.OpenExchangeRatesOrgProvider.reload Reloading exchange rates from open-exchange-rates.json
[junit4] 2> 609070 T1995 oass.OpenExchangeRatesOrgProvider.reload Reloading exchange rates from open-exchange-rates.json
[junit4] 2> 609072 T1982 oass.OpenExchangeRatesOrgProvider$OpenExchangeRates.<init> WARN Unknown key IMPORTANT NOTE
[junit4] 2> 609073 T1982 oass.OpenExchangeRatesOrgProvider$OpenExchangeRates.<init> WARN Expected key, got STRING
[junit4] 2> 609073 T1982 oasc.CoreContainer.create Creating SolrCore 'solrj_collection_shard2_replica1' using configuration from collection solrj_collection
[junit4] 2> 609074 T1982 oasc.SolrCore.initDirectoryFactory org.apache.solr.core.MockDirectoryFactory
[junit4] 2> 609074 T1982 oasc.SolrCore.<init> [solrj_collection_shard2_replica1] Opening new SolrCore at ../../../../../../../../../Users/jenkins/workspace/Lucene-Solr-trunk-MacOSX/solr/build/solr-core/test/J0/./solr.cloud.CollectionsAPIDistributedZkTest-2CA84FADD31C1010-001/tempDir-003/solrj_collection_shard2_replica1/, dataDir=../../../../../../../../../Users/jenkins/workspace/Lucene-Solr-trunk-MacOSX/solr/build/solr-core/test/J0/./solr.cloud.CollectionsAPIDistributedZkTest-2CA84FADD31C1010-001/tempDir-003/solrj_collection_shard2_replica1/data/
[junit4] 2> 609075 T1982 oasc.JmxMonitoredMap.<init> JMX monitoring is enabled. Adding Solr mbeans to JMX Server: com.sun.jmx.mbeanserver.JmxMBeanServer@7f3858b1
[junit4] 2> 609076 T1982 oasc.CachingDirectoryFactory.get return new directory for ../../../../../../../../../Users/jenkins/workspace/Lucene-Solr-trunk-MacOSX/solr/build/solr-core/test/J0/./solr.cloud.CollectionsAPIDistributedZkTest-2CA84FADD31C1010-001/tempDir-003/solrj_collection_shard2_replica1/data
[junit4] 2> 609076 T1982 oasc.SolrCore.getNewIndexDir New index directory detected: old=null new=../../../../../../../../../Users/jenkins/workspace/Lucene-Solr-trunk-MacOSX/solr/build/solr-core/test/J0/./solr.cloud.CollectionsAPIDistributedZkTest-2CA84FADD31C1010-001/tempDir-003/solrj_collection_shard2_replica1/data/index/
[junit4] 2> 609076 T1982 oasc.SolrCore.initIndex WARN [solrj_collection_shard2_replica1] Solr index directory '../../../../../../../../../Users/jenkins/workspace/Lucene-Solr-trunk-MacOSX/solr/build/solr-core/test/J0/./solr.cloud.CollectionsAPIDistributedZkTest-2CA84FADD31C1010-001/tempDir-003/solrj_collection_shard2_replica1/data/index' doesn't exist. Creating new index...
[junit4] 2> 609077 T1982 oasc.CachingDirectoryFactory.get return new directory for ../../../../../../../../../Users/jenkins/workspace/Lucene-Solr-trunk-MacOSX/solr/build/solr-core/test/J0/./solr.cloud.CollectionsAPIDistributedZkTest-2CA84FADD31C1010-001/tempDir-003/solrj_collection_shard2_replica1/data/index
[junit4] 2> 609078 T1982 oasu.RandomMergePolicy.<init> RandomMergePolicy wrapping class org.apache.lucene.index.TieredMergePolicy: [TieredMergePolicy: maxMergeAtOnce=29, maxMergeAtOnceExplicit=17, maxMergedSegmentMB=43.3193359375, floorSegmentMB=1.2568359375, forceMergeDeletesPctAllowed=27.230214879943595, segmentsPerTier=18.0, maxCFSSegmentSizeMB=8.796093022207999E12, noCFSRatio=0.0
[junit4] 2> 609079 T1982 oasc.SolrDeletionPolicy.onCommit SolrDeletionPolicy.onCommit: commits: num=1
[junit4] 2> commit{dir=MockDirectoryWrapper(RAMDirectory@7d412947 lockFactory=org.apache.lucene.store.SingleInstanceLockFactory@745d4c71),segFN=segments_1,generation=1}
[junit4] 2> 609080 T1982 oasc.SolrDeletionPolicy.updateCommits newest commit generation = 1
[junit4] 2> 609073 T1968 oass.FileExchangeRateProvider.reload Reloading exchange rates from file currency.xml
[junit4] 2> 609085 T1995 oass.OpenExchangeRatesOrgProvider$OpenExchangeRates.<init> WARN Unknown key IMPORTANT NOTE
[junit4] 2> 609085 T1995 oass.OpenExchangeRatesOrgProvider$OpenExchangeRates.<init> WARN Expected key, got STRING
[junit4] 2> 609085 T1995 oass.OpenExchangeRatesOrgProvider.reload Reloading exchange rates from open-exchange-rates.json
[junit4] 2> 609091 T1995 oass.OpenExchangeRatesOrgProvider$OpenExchangeRates.<init> WARN Unknown key IMPORTANT NOTE
[junit4] 2> 609092 T1995 oass.OpenExchangeRatesOrgProvider$OpenExchangeRates.<init> WARN Expected key, got STRING
[junit4] 2> 609092 T1995 oasc.CoreContainer.create Creating SolrCore 'solrj_collection_shard1_replica1' using configuration from collection solrj_collection
[junit4] 2> 609093 T1995 oasc.SolrCore.initDirectoryFactory org.apache.solr.core.MockDirectoryFactory
[junit4] 2> 609093 T1995 oasc.SolrCore.<init> [solrj_collection_shard1_replica1] Opening new SolrCore at ../../../../../../../../../Users/jenkins/workspace/Lucene-Solr-trunk-MacOSX/solr/build/solr-core/test/J0/./solr.cloud.CollectionsAPIDistributedZkTest-2CA84FADD31C1010-001/tempDir-004/solrj_collection_shard1_replica1/, dataDir=../../../../../../../../../Users/jenkins/workspace/Lucene-Solr-trunk-MacOSX/solr/build/solr-core/test/J0/./solr.cloud.CollectionsAPIDistributedZkTest-2CA84FADD31C1010-001/tempDir-004/solrj_collection_shard1_replica1/data/
[junit4] 2> 609094 T1995 oasc.JmxMonitoredMap.<init> JMX monitoring is enabled. Adding Solr mbeans to JMX Server: com.sun.jmx.mbeanserver.JmxMBeanServer@7f3858b1
[junit4] 2> 609095 T1995 oasc.CachingDirectoryFactory.get return new directory for ../../../../../../../../../Users/jenkins/workspace/Lucene-Solr-trunk-MacOSX/solr/build/solr-core/test/J0/./solr.cloud.CollectionsAPIDistributedZkTest-2CA84FADD31C1010-001/tempDir-004/solrj_collection_shard1_replica1/data
[junit4] 2> 609095 T1995 oasc.SolrCore.getNewIndexDir New index directory detected: old=null new=../../../../../../../../../Users/jenkins/workspace/Lucene-Solr-trunk-MacOSX/solr/build/solr-core/test/J0/./solr.cloud.CollectionsAPIDistributedZkTest-2CA84FADD31C1010-001/tempDir-004/solrj_collection_shard1_replica1/data/index/
[junit4] 2> 609096 T1995 oasc.SolrCore.initIndex WARN [solrj_collection_shard1_replica1] Solr index directory '../../../../../../../../../Users/jenkins/workspace/Lucene-Solr-trunk-MacOSX/solr/build/solr-core/test/J0/./solr.cloud.CollectionsAPIDistributedZkTest-2CA84FADD31C1010-001/tempDir-004/solrj_collection_shard1_replica1/data/index' doesn't exist. Creating new index...
[junit4] 2> 609099 T1982 oasup.UpdateRequestProcessorChain.init creating updateRequestProcessorChain "nodistrib"
[junit4] 2> 609100 T1982 oasup.UpdateRequestProcessorChain.init creating updateRequestProcessorChain "dedupe"
[junit4] 2> 609100 T1982 oasup.UpdateRequestProcessorChain.init inserting DistributedUpdateProcessorFactory into updateRequestProcessorChain "dedupe"
[junit4] 2> 609101 T1982 oasup.UpdateRequestProcessorChain.init creating updateRequestProcessorChain "stored_sig"
[junit4] 2> 609102 T1982 oasup.UpdateRequestProcessorChain.init inserting DistributedUpdateProcessorFactory into updateRequestProcessorChain "stored_sig"
[junit4] 2> 609103 T1982 oasup.UpdateRequestProcessorChain.init creating updateRequestProcessorChain "distrib-dup-test-chain-explicit"
[junit4] 2> 609104 T1982 oasup.UpdateRequestProcessorChain.init creating updateRequestProcessorChain "distrib-dup-test-chain-implicit"
[junit4] 2> 609104 T1982 oasup.UpdateRequestProcessorChain.init inserting DistributedUpdateProcessorFactory into updateRequestProcessorChain "distrib-dup-test-chain-implicit"
[junit4] 2> 609104 T1982 oasc.SolrCore.loadUpdateProcessorChains no updateRequestProcessorChain defined as default, creating implicit default
[junit4] 2> 609107 T1982 oasc.RequestHandlers.initHandlersFromConfig created standard: solr.StandardRequestHandler
[junit4] 2> 609107 T1968 oass.OpenExchangeRatesOrgProvider.reload Reloading exchange rates from open-exchange-rates.json
[junit4] 2> 609108 T1995 oasc.CachingDirectoryFactory.get return new directory for ../../../../../../../../../Users/jenkins/workspace/Lucene-Solr-trunk-MacOSX/solr/build/solr-core/test/J0/./solr.cloud.CollectionsAPIDistributedZkTest-2CA84FADD31C1010-001/tempDir-004/solrj_collection_shard1_replica1/data/index
[junit4] 2> 609109 T1995 oasu.RandomMergePolicy.<init> RandomMergePolicy wrapping class org.apache.lucene.index.TieredMergePolicy: [TieredMergePolicy: maxMergeAtOnce=29, maxMergeAtOnceExplicit=17, maxMergedSegmentMB=43.3193359375, floorSegmentMB=1.2568359375, forceMergeDeletesPctAllowed=27.230214879943595, segmentsPerTier=18.0, maxCFSSegmentSizeMB=8.796093022207999E12, noCFSRatio=0.0
[junit4] 2> 609110 T1995 oasc.SolrDeletionPolicy.onCommit SolrDeletionPolicy.onCommit: commits: num=1
[junit4] 2> commit{dir=MockDirectoryWrapper(RAMDirectory@18cd9a6e lockFactory=org.apache.lucene.store.SingleInstanceLockFactory@6611ea2a),segFN=segments_1,generation=1}
[junit4] 2> 609110 T1995 oasc.SolrDeletionPolicy.updateCommits newest commit generation = 1
[junit4] 2> 609111 T2014 oass.OpenExchangeRatesOrgProvider.init Initialized with rates=open-exchange-rates.json, refreshInterval=1440.
[junit4] 2> 609107 T1982 oasc.RequestHandlers.initHandlersFromConfig created /get: solr.RealTimeGetHandler
[junit4] 2> 609113 T1982 oasc.RequestHandlers.initHandlersFromConfig adding lazy requestHandler: solr.ReplicationHandler
[junit4] 2> 609114 T1982 oasc.RequestHandlers.initHandlersFromConfig created /replication: solr.ReplicationHandler
[junit4] 2> 609115 T1982 oasc.RequestHandlers.initHandlersFromConfig created /update: solr.UpdateRequestHandler
[junit4] 2> 609116 T1982 oasc.RequestHandlers.initHandlersFromConfig created /admin/: org.apache.solr.handler.admin.AdminHandlers
[junit4] 2> 609117 T1982 oasc.RequestHandlers.initHandlersFromConfig created /admin/file: solr.admin.ShowFileRequestHandler
[junit4] 2> 609118 T1982 oasc.RequestHandlers.initHandlersFromConfig created /admin/fileedit: solr.admin.EditFileRequestHandler
[junit4] 2> 609118 T1995 oasup.UpdateRequestProcessorChain.init creating updateRequestProcessorChain "nodistrib"
[junit4] 2> 609119 T1995 oasup.UpdateRequestProcessorChain.init creating updateRequestProcessorChain "dedupe"
[junit4] 2> 609120 T1995 oasup.UpdateRequestProcessorChain.init inserting DistributedUpdateProcessorFactory into updateRequestProcessorChain "dedupe"
[junit4] 2> 609121 T1995 oasup.UpdateRequestProcessorChain.init creating updateRequestProcessorChain "stored_sig"
[junit4] 2> 609123 T1995 oasup.UpdateRequestProcessorChain.init inserting DistributedUpdateProcessorFactory into updateRequestProcessorChain "stored_sig"
[junit4] 2> 609123 T1995 oasup.UpdateRequestProcessorChain.init creating updateRequestProcessorChain "distrib-dup-test-chain-explicit"
[junit4] 2> 609124 T1995 oasup.UpdateRequestProcessorChain.init creating updateRequestProcessorChain "distrib-dup-test-chain-implicit"
[junit4] 2> 609125 T1995 oasup.UpdateRequestProcessorChain.init inserting DistributedUpdateProcessorFactory into updateRequestProcessorChain "distrib-dup-test-chain-implicit"
[junit4] 2> 609125 T1995 oasc.SolrCore.loadUpdateProcessorChains no updateRequestProcessorChain defined as default, creating implicit default
[junit4] 2> 609126 T1995 oasc.RequestHandlers.initHandlersFromConfig created standard: solr.StandardRequestHandler
[junit4] 2> 609126 T1995 oasc.RequestHandlers.initHandlersFromConfig created /get: solr.RealTimeGetHandler
[junit4] 2> 609127 T1995 oasc.RequestHandlers.initHandlersFromConfig adding lazy requestHandler: solr.ReplicationHandler
[junit4] 2> 609127 T1995 oasc.RequestHandlers.initHandlersFromConfig created /replication: solr.ReplicationHandler
[junit4] 2> 609128 T1995 oasc.RequestHandlers.initHandlersFromConfig created /update: solr.UpdateRequestHandler
[junit4] 2> 609129 T1995 oasc.RequestHandlers.initHandlersFromConfig created /admin/: org.apache.solr.handler.admin.AdminHandlers
[junit4] 2> 609130 T1995 oasc.RequestHandlers.initHandlersFromConfig created /admin/file: solr.admin.ShowFileRequestHandler
[junit4] 2> 609132 T1995 oasc.RequestHandlers.initHandlersFromConfig created /admin/fileedit: solr.admin.EditFileRequestHandler
[junit4] 2> 609122 T1968 oass.OpenExchangeRatesOrgProvider$OpenExchangeRates.<init> WARN Unknown key IMPORTANT NOTE
[junit4] 2> 609135 T1968 oass.OpenExchangeRatesOrgProvider$OpenExchangeRates.<init> WARN Expected key, got STRING
[junit4] 2> 609135 T1968 oass.OpenExchangeRatesOrgProvider.reload Reloading exchange rates from open-exchange-rates.json
[junit4] 2> 609140 T1982 oashl.XMLLoader.init xsltCacheLifetimeSeconds=60
[junit4] 2> 609140 T1995 oashl.XMLLoader.init xsltCacheLifetimeSeconds=60
[junit4] 2> 609147 T2014 oass.IndexSchema.readSchema default search field in schema is text
[junit4] 2> 609152 T2014 oass.IndexSchema.readSchema unique key field: id
[junit4] 2> 609154 T1982 oasu.CommitTracker.<init> Hard AutoCommit: disabled
[junit4] 2> 609154 T1982 oasu.CommitTracker.<init> Soft AutoCommit: disabled
[junit4] 2> 609155 T1982 oasu.RandomMergePolicy.<init> RandomMergePolicy wrapping class org.apache.lucene.index.TieredMergePolicy: [TieredMergePolicy: maxMergeAtOnce=15, maxMergeAtOnceExplicit=24, maxMergedSegmentMB=54.5029296875, floorSegmentMB=2.021484375, forceMergeDeletesPctAllowed=22.747804672034544, segmentsPerTier=25.0, maxCFSSegmentSizeMB=8.796093022207999E12, noCFSRatio=0.0
[junit4] 2> 609158 T1982 oasc.SolrDeletionPolicy.onInit SolrDeletionPolicy.onInit: commits: num=1
[junit4] 2> commit{dir=MockDirectoryWrapper(RAMDirectory@7d412947 lockFactory=org.apache.lucene.store.SingleInstanceLockFactory@745d4c71),segFN=segments_1,generation=1}
[junit4] 2> 609159 T1982 oasc.SolrDeletionPolicy.updateCommits newest commit generation = 1
[junit4] 2> 609159 T1982 oass.SolrIndexSearcher.<init> Opening Searcher@a29f368[solrj_collection_shard2_replica1] main
[junit4] 2> 609160 T1982 oascc.ZkStateReader.readConfigName Load collection config from:/collections/solrj_collection
[junit4] 2> 609168 T1995 oasu.CommitTracker.<init> Hard AutoCommit: disabled
[junit4] 2> 609170 T1995 oasu.CommitTracker.<init> Soft AutoCommit: disabled
[junit4] 2> 609169 T1968 oass.OpenExchangeRatesOrgProvider$OpenExchangeRates.<init> WARN Unknown key IMPORTANT NOTE
[junit4] 2> 609172 T1968 oass.OpenExchangeRatesOrgProvider$OpenExchangeRates.<init> WARN Expected key, got STRING
[junit4] 2> 609170 T1982 oascc.ZkStateReader.readConfigName path=/collections/solrj_collection configName=conf1 specified config exists in ZooKeeper
[junit4] 2> 609173 T1982 oasr.ManagedResourceStorage.newStorageIO Setting up ZooKeeper-based storage for the RestManager with znodeBase: /configs/conf1
[junit4] 2> 609172 T1968 oasc.CoreContainer.create Creating SolrCore 'solrj_collection_shard2_replica2' using configuration from collection solrj_collection
[junit4] 2> 609173 T1995 oasu.RandomMergePolicy.<init> RandomMergePolicy wrapping class org.apache.lucene.index.TieredMergePolicy: [TieredMergePolicy: maxMergeAtOnce=15, maxMergeAtOnceExplicit=24, maxMergedSegmentMB=54.5029296875, floorSegmentMB=2.021484375, forceMergeDeletesPctAllowed=22.747804672034544, segmentsPerTier=25.0, maxCFSSegmentSizeMB=8.796093022207999E12, noCFSRatio=0.0
[junit4] 2> 609174 T1968 oasc.SolrCore.initDirectoryFactory org.apache.solr.core.MockDirectoryFactory
[junit4] 2> 609177 T1968 oasc.SolrCore.<init> [solrj_collection_shard2_replica2] Opening new SolrCore at ../../../../../../../../../Users/jenkins/workspace/Lucene-Solr-trunk-MacOSX/solr/build/solr-core/test/J0/./solr.cloud.CollectionsAPIDistributedZkTest-2CA84FADD31C1010-001/tempDir-002/solrj_collection_shard2_replica2/, dataDir=../../../../../../../../../Users/jenkins/workspace/Lucene-Solr-trunk-MacOSX/solr/build/solr-core/test/J0/./solr.cloud.CollectionsAPIDistributedZkTest-2CA84FADD31C1010-001/tempDir-002/solrj_collection_shard2_replica2/data/
[junit4] 2> 609178 T1968 oasc.JmxMonitoredMap.<init> JMX monitoring is enabled. Adding Solr mbeans to JMX Server: com.sun.jmx.mbeanserver.JmxMBeanServer@7f3858b1
[junit4] 2> 609177 T1995 oasc.SolrDeletionPolicy.onInit SolrDeletionPolicy.onInit: commits: num=1
[junit4] 2> commit{dir=MockDirectoryWrapper(RAMDirectory@18cd9a6e lockFactory=org.apache.lucene.store.SingleInstanceLockFactory@6611ea2a),segFN=segments_1,generation=1}
[junit4] 2> 609181 T1995 oasc.SolrDeletionPolicy.updateCommits newest commit generation = 1
[junit4] 2> 609179 T1982 oasr.ManagedResourceStorage$ZooKeeperStorageIO.configure Configured ZooKeeperStorageIO with znodeBase: /configs/conf1
[junit4] 2> 609181 T1995 oass.SolrIndexSearcher.<init> Opening Searcher@68bdcaa[solrj_collection_shard1_replica1] main
[junit4] 2> 609182 T1995 oascc.ZkStateReader.readConfigName Load collection config from:/collections/solrj_collection
[junit4] 2> 609179 T1968 oasc.CachingDirectoryFactory.get return new directory for ../../../../../../../../../Users/jenkins/workspace/Lucene-Solr-trunk-MacOSX/solr/build/solr-core/test/J0/./solr.cloud.CollectionsAPIDistributedZkTest-2CA84FADD31C1010-001/tempDir-002/solrj_collection_shard2_replica2/data
[junit4] 2> 609184 T1968 oasc.SolrCore.getNewIndexDir New index directory detected: old=null new=../../../../../../../../../Users/jenkins/workspace/Lucene-Solr-trunk-MacOSX/solr/build/solr-core/test/J0/./solr.cloud.CollectionsAPIDistributedZkTest-2CA84FADD31C1010-001/tempDir-002/solrj_collection_shard2_replica2/data/index/
[junit4] 2> 609185 T1968 oasc.SolrCore.initIndex WARN [solrj_collection_shard2_replica2] Solr index directory '../../../../../../../../../Users/jenkins/workspace/Lucene-Solr-trunk-MacOSX/solr/build/solr-core/test/J0/./solr.cloud.CollectionsAPIDistributedZkTest-2CA84FADD31C1010-001/tempDir-002/solrj_collection_shard2_replica2/data/index' doesn't exist. Creating new index...
[junit4] 2> 609181 T1982 oasr.RestManager.init Initializing RestManager with initArgs: {}
[junit4] 2> 609186 T1982 oasr.ManagedResourceStorage.load Reading _rest_managed.json using ZooKeeperStorageIO:path=/configs/conf1
[junit4] 2> 609186 T1995 oascc.ZkStateReader.readConfigName path=/collections/solrj_collection configName=conf1 specified config exists in ZooKeeper
[junit4] 2> 609188 T1995 oasr.ManagedResourceStorage.newStorageIO Setting up ZooKeeper-based storage for the RestManager with znodeBase: /configs/conf1
[junit4] 2> 609187 T1968 oasc.CachingDirectoryFactory.get return new directory for ../../../../../../../../../Users/jenkins/workspace/Lucene-Solr-trunk-MacOSX/solr/build/solr-core/test/J0/./solr.cloud.CollectionsAPIDistributedZkTest-2CA84FADD31C1010-001/tempDir-002/solrj_collection_shard2_replica2/data/index
[junit4] 2> 609189 T1982 oasr.ManagedResourceStorage$ZooKeeperStorageIO.openInputStream No data found for znode /configs/conf1/_rest_managed.json
[junit4] 2> 609190 T1982 oasr.ManagedResourceStorage.load Loaded null at path _rest_managed.json using ZooKeeperStorageIO:path=/configs/conf1
[junit4] 2> 609190 T1982 oasr.ManagedResource.notifyObserversDuringInit WARN No registered observers for /rest/managed
[junit4] 2> 609191 T1982 oasr.RestManager.init Initializing 0 registered ManagedResources
[junit4] 2> 609189 T1968 oasu.RandomMergePolicy.<init> RandomMergePolicy wrapping class org.apache.lucene.index.TieredMergePolicy: [TieredMergePolicy: maxMergeAtOnce=29, maxMergeAtOnceExplicit=17, maxMergedSegmentMB=43.3193359375, floorSegmentMB=1.2568359375, forceMergeDeletesPctAllowed=27.230214879943595, segmentsPerTier=18.0, maxCFSSegmentSizeMB=8.796093022207999E12, noCFSRatio=0.0
[junit4] 2> 609191 T1995 oasr.ManagedResourceStorage$ZooKeeperStorageIO.configure Configured ZooKeeperStorageIO with znodeBase: /configs/conf1
[junit4] 2> 609193 T1995 oasr.RestManager.init Initializing RestManager with initArgs: {}
[junit4] 2> 609194 T1995 oasr.ManagedResourceStorage.load Reading _rest_managed.json using ZooKeeperStorageIO:path=/configs/conf1
[junit4] 2> 609196 T1995 oasr.ManagedResourceStorage$ZooKeeperStorageIO.openInputStream No data found for znode /configs/conf1/_rest_managed.json
[junit4] 2> 609196 T1995 oasr.ManagedResourceStorage.load Loaded null at path _rest_managed.json using ZooKeeperStorageIO:path=/configs/conf1
[junit4] 2> 609197 T2038 oasc.SolrCore.registerSearcher [solrj_collection_shard2_replica1] Registered new searcher Searcher@a29f368[solrj_collection_shard2_replica1] main{StandardDirectoryReader(segments_1:1:nrt)}
[junit4] 2> 609197 T1995 oasr.ManagedResource.notifyObserversDuringInit WARN No registered observers for /rest/managed
[junit4] 2> 609198 T1995 oasr.RestManager.init Initializing 0 registered ManagedResources
[junit4] 2> 609199 T1968 oasc.SolrDeletionPolicy.onCommit SolrDeletionPolicy.onCommit: commits: num=1
[junit4] 2> commit{dir=MockDirectoryWrapper(RAMDirectory@48442041 lockFactory=org.apache.lucene.store.SingleInstanceLockFactory@7d333645),segFN=segments_1,generation=1}
[junit4] 2> 609201 T1968 oasc.SolrDeletionPolicy.updateCommits newest commit generation = 1
[junit4] 2> 609202 T1982 oasc.CoreContainer.registerCore registering core: solrj_collection_shard2_replica1
[junit4] 2> 609204 T2039 oasc.SolrCore.registerSearcher [solrj_collection_shard1_replica1] Registered new searcher Searcher@68bdcaa[solrj_collection_shard1_replica1] main{StandardDirectoryReader(segments_1:1:nrt)}
[junit4] 2> 609205 T1982 oasc.ZkController.register Register replica - core:solrj_collection_shard2_replica1 address:http://127.0.0.1:49811 collection:solrj_collection shard:shard2
[junit4] 2> 609211 T1995 oasc.CoreContainer.registerCore registering core: solrj_collection_shard1_replica1
[junit4] 2> 609211 T1995 oasc.ZkController.register Register replica - core:solrj_collection_shard1_replica1 address:http://127.0.0.1:49814 collection:solrj_collection shard:shard1
[junit4] 2> 609212 T1982 oascc.SolrZkClient.makePath makePath: /collections/solrj_collection/leader_elect/shard2/election
[junit4] 2> 609217 T1995 oascc.SolrZkClient.makePath makePath: /collections/solrj_collection/leader_elect/shard1/election
[junit4] 2> 609218 T1968 oasup.UpdateRequestProcessorChain.init creating updateRequestProcessorChain "nodistrib"
[junit4] 2> 609219 T1968 oasup.UpdateRequestProcessorChain.init creating updateRequestProcessorChain "dedupe"
[junit4] 2> 609220 T1968 oasup.UpdateRequestProcessorChain.init inserting DistributedUpdateProcessorFactory into updateRequestProcessorChain "dedupe"
[junit4] 2> 609222 T1968 oasup.UpdateRequestProcessorChain.init creating updateRequestProcessorChain "stored_sig"
[junit4] 2> 609223 T1968 oasup.UpdateRequestProcessorChain.init inserting DistributedUpdateProcessorFactory into updateRequestProcessorChain "stored_sig"
[junit4] 2> 609224 T1968 oasup.UpdateRequestProcessorChain.init creating updateRequestProcessorChain "distrib-dup-test-chain-explicit"
[junit4] 2> 609225 T1968 oasup.UpdateRequestProcessorChain.init creating updateRequestProcessorChain "distrib-dup-test-chain-implicit"
[junit4] 2> 609227 T1968 oasup.UpdateRequestProcessorChain.init inserting DistributedUpdateProcessorFactory into updateRequestProcessorChain "distrib-dup-test-chain-implicit"
[junit4] 2> 609228 T1968 oasc.SolrCore.loadUpdateProcessorChains no updateRequestProcessorChain defined as default, creating implicit default
[junit4] 2> 609229 T1968 oasc.RequestHandlers.initHandlersFromConfig created standard: solr.StandardRequestHandler
[junit4] 2> 609230 T1968 oasc.RequestHandlers.initHandlersFromConfig created /get: solr.RealTimeGetHandler
[junit4] 2> 609231 T1968 oasc.RequestHandlers.initHandlersFromConfig adding lazy requestHandler: solr.ReplicationHandler
[junit4] 2> 609233 T1968 oasc.RequestHandlers.initHandlersFromConfig created /replication: solr.ReplicationHandler
[junit4] 2> 609235 T1968 oasc.RequestHandlers.initHandlersFromConfig created /update: solr.UpdateRequestHandler
[junit4] 2> 609237 T1968 oasc.RequestHandlers.initHandlersFromConfig created /admin/: org.apache.solr.handler.admin.AdminHandlers
[junit4] 2> 609238 T1968 oasc.RequestHandlers.initHandlersFromConfig created /admin/file: solr.admin.ShowFileRequestHandler
[junit4] 2> 609239 T1968 oasc.RequestHandlers.initHandlersFromConfig created /admin/fileedit: solr.admin.EditFileRequestHandler
[junit4] 2> 609243 T2014 oass.FileExchangeRateProvider.reload Reloading exchange rates from file currency.xml
[junit4] 2> 609247 T1968 oashl.XMLLoader.init xsltCacheLifetimeSeconds=60
[junit4] 2> 609261 T2014 oass.FileExchangeRateProvider.reload Reloading exchange rates from file currency.xml
[junit4] 2> 609274 T1968 oasu.CommitTracker.<init> Hard AutoCommit: disabled
[junit4] 2> 609274 T1968 oasu.CommitTracker.<init> Soft AutoCommit: disabled
[junit4] 2> 609276 T1968 oasu.RandomMergePolicy.<init> RandomMergePolicy wrapping class org.apache.lucene.index.TieredMergePolicy: [TieredMergePolicy: maxMergeAtOnce=15, maxMergeAtOnceExplicit=24, maxMergedSegmentMB=54.5029296875, floorSegmentMB=2.021484375, forceMergeDeletesPctAllowed=22.747804672034544, segmentsPerTier=25.0, maxCFSSegmentSizeMB=8.796093022207999E12, noCFSRatio=0.0
[junit4] 2> 609279 T2014 oass.OpenExchangeRatesOrgProvider.reload Reloading exchange rates from open-exchange-rates.json
[junit4] 2> 609280 T1968 oasc.SolrDeletionPolicy.onInit SolrDeletionPolicy.onInit: commits: num=1
[junit4] 2> commit{dir=MockDirectoryWrapper(RAMDirectory@48442041 lockFactory=org.apache.lucene.store.SingleInstanceLockFactory@7d333645),segFN=segments_1,generation=1}
[junit4] 2> 609283 T1968 oasc.SolrDeletionPolicy.updateCommits newest commit generation = 1
[junit4] 2> 609279 T1995 oasc.ShardLeaderElectionContext.runLeaderProcess Running the leader process for shard shard1
[junit4] 2> 609285 T2014 oass.OpenExchangeRatesOrgProvider$OpenExchangeRates.<init> WARN Unknown key IMPORTANT NOTE
[j
[...truncated too long message...]
chedEvent state:SyncConnected type:NodeDataChanged path:/clusterstate.json, has occurred - updating... (live nodes size: 0)
[junit4] 2> 1792522 T4778 oasc.Overseer$ClusterStateUpdater.updateState Update state numShards=null message={
[junit4] 2> "operation":"state",
[junit4] 2> "base_url":"http://127.0.0.1/solr",
[junit4] 2> "node_name":"node1",
[junit4] 2> "shard":"s1",
[junit4] 2> "collection":"collection1",
[junit4] 2> "core":"core2",
[junit4] 2> "roles":"",
[junit4] 2> "state":"recovering"}
[junit4] 2> 1792524 T4771 oascc.ZkStateReader$2.process A cluster state change: WatchedEvent state:SyncConnected type:NodeDataChanged path:/clusterstate.json, has occurred - updating... (live nodes size: 0)
[junit4] 2> 1792529 T4778 oasc.Overseer$ClusterStateUpdater.run Starting to work on the main queue
[junit4] 2> 1792535 T4778 oascc.ZkStateReader.updateClusterState Updating cloud state from ZooKeeper...
[junit4] 2> 1792537 T4778 oasc.Overseer$ClusterStateUpdater.updateState Update state numShards=null message={
[junit4] 2> "operation":"state",
[junit4] 2> "base_url":"http://127.0.0.1/solr",
[junit4] 2> "node_name":"node1",
[junit4] 2> "shard":"s1",
[junit4] 2> "collection":"collection1",
[junit4] 2> "core":"core3",
[junit4] 2> "roles":"",
[junit4] 2> "state":"recovering"}
[junit4] 2> 1792545 T4777 oasc.DistributedQueue$LatchChildWatcher.process LatchChildWatcher fired on path: /overseer/queue state: SyncConnected type NodeChildrenChanged
[junit4] 2> 1792547 T4771 oascc.ZkStateReader$2.process A cluster state change: WatchedEvent state:SyncConnected type:NodeDataChanged path:/clusterstate.json, has occurred - updating... (live nodes size: 0)
[junit4] 2> 1792614 T4367 oasc.ZkTestServer.send4LetterWord connecting to 127.0.0.1:50491 50491
[junit4] 2> 1792721 T4765 oasc.ZkTestServer.send4LetterWord connecting to 127.0.0.1:50491 50491
[junit4] 2> 1792938 T4367 oas.SolrTestCaseJ4.tearDown ###Ending testReplay
[junit4] 2> 1792939 T4778 oasc.Overseer$ClusterStateUpdater.run Overseer Loop exiting : 127.0.0.1:50491_solr
[junit4] 1> client port:0.0.0.0/0.0.0.0:0
[junit4] 2> 1792945 T4780 oasc.Overseer$ClusterStateUpdater.checkIfIamStillLeader ERROR could not read the data org.apache.zookeeper.KeeperException$SessionExpiredException: KeeperErrorCode = Session expired for /overseer_elect/leader
[junit4] 2> at org.apache.zookeeper.KeeperException.create(KeeperException.java:127)
[junit4] 2> at org.apache.zookeeper.KeeperException.create(KeeperException.java:51)
[junit4] 2> at org.apache.zookeeper.ZooKeeper.getData(ZooKeeper.java:1155)
[junit4] 2> at org.apache.solr.common.cloud.SolrZkClient$7.execute(SolrZkClient.java:277)
[junit4] 2> at org.apache.solr.common.cloud.SolrZkClient$7.execute(SolrZkClient.java:274)
[junit4] 2> at org.apache.solr.common.cloud.ZkCmdExecutor.retryOperation(ZkCmdExecutor.java:73)
[junit4] 2> at org.apache.solr.common.cloud.SolrZkClient.getData(SolrZkClient.java:274)
[junit4] 2> at org.apache.solr.cloud.Overseer$ClusterStateUpdater.checkIfIamStillLeader(Overseer.java:302)
[junit4] 2> at org.apache.solr.cloud.Overseer$ClusterStateUpdater.access$300(Overseer.java:85)
[junit4] 2> at org.apache.solr.cloud.Overseer$ClusterStateUpdater$1.run(Overseer.java:291)
[junit4] 2>
[junit4] 2> 1792945 T4367 oas.SolrTestCaseJ4.initCore ####initCore
[junit4] 2> 1792948 T4367 oas.SolrTestCaseJ4.initCore ####initCore end
[junit4] 2> 1795950 T4367 oas.SolrTestCaseJ4.deleteCore ###deleteCore
[junit4] 2> NOTE: leaving temporary files on disk at: /Users/jenkins/workspace/Lucene-Solr-trunk-MacOSX/solr/build/solr-core/test/J0/./solr.cloud.OverseerTest-2CA84FADD31C1010-001
[junit4] 2> NOTE: test params are: codec=CheapBastard, sim=DefaultSimilarity, locale=sq, timezone=Europe/Madrid
[junit4] 2> NOTE: Mac OS X 10.8.5 x86_64/Oracle Corporation 1.7.0_51 (64-bit)/cpus=2,threads=1,free=251182968,total=476053504
[junit4] 2> NOTE: All tests run in this JVM: [DOMUtilTest, XmlUpdateRequestHandlerTest, TestSolrXMLSerializer, DistributedSuggestComponentTest, CacheHeaderTest, FieldAnalysisRequestHandlerTest, PreAnalyzedUpdateProcessorTest, CopyFieldTest, TestSerializedLuceneMatchVersion, HdfsSyncSliceTest, TestJmxIntegration, AnalysisErrorHandlingTest, TestHashPartitioner, ChaosMonkeyNothingIsSafeTest, ShardRoutingCustomTest, SchemaVersionSpecificBehaviorTest, QueryEqualityTest, TestExceedMaxTermLength, TestCloudManagedSchemaAddField, HighlighterConfigTest, ClusterStateTest, TestManagedResource, DocExpirationUpdateProcessorFactoryTest, DirectSolrConnectionTest, TestDefaultSearchFieldResource, TestQueryUtils, TestSolrXmlPersistor, CursorMarkTest, ZkCLITest, ResponseLogComponentTest, TestSchemaVersionResource, TestRecoveryHdfs, LeaderElectionTest, RegexBoostProcessorTest, HdfsUnloadDistributedZkTest, MultiTermTest, TestAnalyzedSuggestions, TestFreeTextSuggestions, DocValuesMultiTest, TestCustomSort, TestBM25SimilarityFactory, TestDistributedMissingSort, SuggesterWFSTTest, TestConfigSets, DocumentBuilderTest, TestNonNRTOpen, TestWordDelimiterFilterFactory, TestLuceneMatchVersion, ModifyConfFileTest, SyncSliceTest, ConvertedLegacyTest, DistributedExpandComponentTest, PreAnalyzedFieldTest, TestQuerySenderNoQuery, HighlighterTest, SimpleFacetsTest, TestBinaryField, ConnectionManagerTest, TestAnalyzeInfixSuggestions, TestSearchPerf, TestUtils, AliasIntegrationTest, TestSolrDeletionPolicy2, DisMaxRequestHandlerTest, TestDistribDocBasedVersion, TestSolrJ, TestReloadAndDeleteDocs, FileUtilsTest, MoreLikeThisHandlerTest, ZkControllerTest, CollectionsAPIDistributedZkTest, PluginInfoTest, QueryParsingTest, SimplePostToolTest, TestSort, QueryResultKeyTest, TestOverriddenPrefixQueryForCustomFieldType, TestFuzzyAnalyzedSuggestions, OverseerRolesTest, TestComplexPhraseQParserPlugin, NotRequiredUniqueKeyTest, SolrIndexSplitterTest, TestSolrQueryParser, CachingDirectoryFactoryTest, TestJoin, SynonymTokenizerTest, ExpressionTest, ShardSplitTest, TestMergePolicyConfig, LukeRequestHandlerTest, TestShortCircuitedRequests, HdfsDirectoryTest, TestUniqueKeyFieldResource, TestCSVResponseWriter, TestElisionMultitermQuery, OverseerCollectionProcessorTest, TestInitQParser, TestSweetSpotSimilarityFactory, TestSolrDeletionPolicy1, TestLFUCache, BasicZkTest, TestSystemIdResolver, LegacyHTMLStripCharFilterTest, XsltUpdateRequestHandlerTest, UpdateParamsTest, AutoCommitTest, DistributedDebugComponentTest, HdfsRecoveryZkTest, TestCursorMarkWithoutUniqueKey, TestRestManager, TestSolr4Spatial, TestFunctionQuery, DeleteInactiveReplicaTest, TestTrie, DateMathParserTest, TestRequestStatusCollectionAPI, TestHighFrequencyDictionaryFactory, TestFieldResource, SearchHandlerTest, DocValuesMissingTest, HdfsWriteToMultipleCollectionsTest, TestDocSet, FunctionTest, SuggesterFSTTest, TestPerFieldSimilarity, TestRangeQuery, BinaryUpdateRequestHandlerTest, TestFieldTypeCollectionResource, WordBreakSolrSpellCheckerTest, TestBlendedInfixSuggestions, TestCollationFieldDocValues, TestSolrXmlPersistence, CoreContainerCoreInitFailuresTest, AddBlockUpdateTest, SystemInfoHandlerTest, TestBinaryResponseWriter, TestReversedWildcardFilterFactory, TestCSVLoader, TestNonDefinedSimilarityFactory, TestManagedSynonymFilterFactory, SuggesterTest, TestSimpleQParserPlugin, TestFoldingMultitermQuery, HdfsBasicDistributedZkTest, StatelessScriptUpdateProcessorFactoryTest, TimeZoneUtilsTest, UniqFieldsUpdateProcessorFactoryTest, MigrateRouteKeyTest, TestIndexSearcher, TestSchemaSimilarityResource, TestPostingsSolrHighlighter, InfoHandlerTest, TestCollapseQParserPlugin, TestRandomFaceting, SpellPossibilityIteratorTest, DeleteShardTest, RangeFacetTest, TestFieldTypeResource, SolrRequestParserTest, DirectSolrSpellCheckerTest, PolyFieldTest, ExternalFileFieldSortTest, TestConfig, OpenExchangeRatesOrgProviderTest, RemoteQueryErrorTest, OpenCloseCoreStressTest, HdfsBasicDistributedZk2Test, TestPseudoReturnFields, JSONWriterTest, FastVectorHighlighterTest, TestExtendedDismaxParser, FieldFacetExtrasTest, ChangedSchemaMergeTest, TestRealTimeGet, SolrCoreCheckLockOnStartupTest, SolrCmdDistributorTest, TestCodecSupport, ResourceLoaderTest, QueryElevationComponentTest, TestSurroundQueryParser, TestManagedResourceStorage, TestWriterPerf, BasicFunctionalityTest, SolrPluginUtilsTest, TestDefaultSimilarityFactory, OverseerTest]
[junit4] Completed in 49.22s, 9 tests, 1 error <<< FAILURES!
[...truncated 623 lines...]
BUILD FAILED
/Users/jenkins/workspace/Lucene-Solr-trunk-MacOSX/build.xml:467: The following error occurred while executing this line:
/Users/jenkins/workspace/Lucene-Solr-trunk-MacOSX/build.xml:447: The following error occurred while executing this line:
/Users/jenkins/workspace/Lucene-Solr-trunk-MacOSX/build.xml:45: The following error occurred while executing this line:
/Users/jenkins/workspace/Lucene-Solr-trunk-MacOSX/extra-targets.xml:37: The following error occurred while executing this line:
/Users/jenkins/workspace/Lucene-Solr-trunk-MacOSX/solr/build.xml:189: The following error occurred while executing this line:
/Users/jenkins/workspace/Lucene-Solr-trunk-MacOSX/solr/common-build.xml:496: The following error occurred while executing this line:
/Users/jenkins/workspace/Lucene-Solr-trunk-MacOSX/lucene/common-build.xml:1281: The following error occurred while executing this line:
/Users/jenkins/workspace/Lucene-Solr-trunk-MacOSX/lucene/common-build.xml:907: There were test failures: 396 suites, 1662 tests, 2 errors, 42 ignored (15 assumptions)
Total time: 111 minutes 1 second
Build step 'Invoke Ant' marked build as failure
Description set: Java: 64bit/jdk1.7.0 -XX:+UseCompressedOops -XX:+UseG1GC -XX:-UseSuperWord
Archiving artifacts
Recording test results
Email was triggered for: Failure
Sending email for trigger: Failure
[JENKINS] Lucene-Solr-trunk-MacOSX (64bit/jdk1.8.0) - Build # 1486
- Still Failing!
Posted by Policeman Jenkins Server <je...@thetaphi.de>.
Build: http://jenkins.thetaphi.de/job/Lucene-Solr-trunk-MacOSX/1486/
Java: 64bit/jdk1.8.0 -XX:+UseCompressedOops -XX:+UseG1GC
1 tests failed.
REGRESSION: org.apache.solr.core.TestNonNRTOpen.testReaderIsNotNRT
Error Message:
SOLR-5815? : wrong maxDoc: core=org.apache.solr.core.SolrCore@466bd027 searcher=Searcher@57f47266[collection1] main{StandardDirectoryReader(segments_8:16 _4(5.0):C1 _5(5.0):C1)} expected:<3> but was:<2>
Stack Trace:
java.lang.AssertionError: SOLR-5815? : wrong maxDoc: core=org.apache.solr.core.SolrCore@466bd027 searcher=Searcher@57f47266[collection1] main{StandardDirectoryReader(segments_8:16 _4(5.0):C1 _5(5.0):C1)} expected:<3> but was:<2>
at __randomizedtesting.SeedInfo.seed([AEEA33790E83F9B6:1B6C52FEB1424B42]:0)
at org.junit.Assert.fail(Assert.java:93)
at org.junit.Assert.failNotEquals(Assert.java:647)
at org.junit.Assert.assertEquals(Assert.java:128)
at org.junit.Assert.assertEquals(Assert.java:472)
at org.apache.solr.core.TestNonNRTOpen.assertNotNRT(TestNonNRTOpen.java:142)
at org.apache.solr.core.TestNonNRTOpen.testReaderIsNotNRT(TestNonNRTOpen.java:100)
at sun.reflect.NativeMethodAccessorImpl.invoke0(Native Method)
at sun.reflect.NativeMethodAccessorImpl.invoke(NativeMethodAccessorImpl.java:62)
at sun.reflect.DelegatingMethodAccessorImpl.invoke(DelegatingMethodAccessorImpl.java:43)
at java.lang.reflect.Method.invoke(Method.java:483)
at com.carrotsearch.randomizedtesting.RandomizedRunner.invoke(RandomizedRunner.java:1618)
at com.carrotsearch.randomizedtesting.RandomizedRunner$6.evaluate(RandomizedRunner.java:827)
at com.carrotsearch.randomizedtesting.RandomizedRunner$7.evaluate(RandomizedRunner.java:863)
at com.carrotsearch.randomizedtesting.RandomizedRunner$8.evaluate(RandomizedRunner.java:877)
at com.carrotsearch.randomizedtesting.rules.SystemPropertiesRestoreRule$1.evaluate(SystemPropertiesRestoreRule.java:53)
at org.apache.lucene.util.TestRuleSetupTeardownChained$1.evaluate(TestRuleSetupTeardownChained.java:50)
at org.apache.lucene.util.TestRuleFieldCacheSanity$1.evaluate(TestRuleFieldCacheSanity.java:51)
at org.apache.lucene.util.AbstractBeforeAfterRule$1.evaluate(AbstractBeforeAfterRule.java:46)
at com.carrotsearch.randomizedtesting.rules.SystemPropertiesInvariantRule$1.evaluate(SystemPropertiesInvariantRule.java:55)
at org.apache.lucene.util.TestRuleThreadAndTestName$1.evaluate(TestRuleThreadAndTestName.java:49)
at org.apache.lucene.util.TestRuleIgnoreAfterMaxFailures$1.evaluate(TestRuleIgnoreAfterMaxFailures.java:65)
at org.apache.lucene.util.TestRuleMarkFailure$1.evaluate(TestRuleMarkFailure.java:48)
at com.carrotsearch.randomizedtesting.rules.StatementAdapter.evaluate(StatementAdapter.java:36)
at com.carrotsearch.randomizedtesting.ThreadLeakControl$StatementRunner.run(ThreadLeakControl.java:360)
at com.carrotsearch.randomizedtesting.ThreadLeakControl.forkTimeoutingTask(ThreadLeakControl.java:793)
at com.carrotsearch.randomizedtesting.ThreadLeakControl$3.evaluate(ThreadLeakControl.java:453)
at com.carrotsearch.randomizedtesting.RandomizedRunner.runSingleTest(RandomizedRunner.java:836)
at com.carrotsearch.randomizedtesting.RandomizedRunner$3.evaluate(RandomizedRunner.java:738)
at com.carrotsearch.randomizedtesting.RandomizedRunner$4.evaluate(RandomizedRunner.java:772)
at com.carrotsearch.randomizedtesting.RandomizedRunner$5.evaluate(RandomizedRunner.java:783)
at com.carrotsearch.randomizedtesting.rules.StatementAdapter.evaluate(StatementAdapter.java:36)
at com.carrotsearch.randomizedtesting.rules.SystemPropertiesRestoreRule$1.evaluate(SystemPropertiesRestoreRule.java:53)
at org.apache.lucene.util.AbstractBeforeAfterRule$1.evaluate(AbstractBeforeAfterRule.java:46)
at org.apache.lucene.util.TestRuleStoreClassName$1.evaluate(TestRuleStoreClassName.java:42)
at com.carrotsearch.randomizedtesting.rules.SystemPropertiesInvariantRule$1.evaluate(SystemPropertiesInvariantRule.java:55)
at com.carrotsearch.randomizedtesting.rules.NoShadowingOrOverridesOnMethodsRule$1.evaluate(NoShadowingOrOverridesOnMethodsRule.java:39)
at com.carrotsearch.randomizedtesting.rules.NoShadowingOrOverridesOnMethodsRule$1.evaluate(NoShadowingOrOverridesOnMethodsRule.java:39)
at com.carrotsearch.randomizedtesting.rules.StatementAdapter.evaluate(StatementAdapter.java:36)
at com.carrotsearch.randomizedtesting.rules.StatementAdapter.evaluate(StatementAdapter.java:36)
at org.apache.lucene.util.TestRuleAssertionsRequired$1.evaluate(TestRuleAssertionsRequired.java:43)
at org.apache.lucene.util.TestRuleMarkFailure$1.evaluate(TestRuleMarkFailure.java:48)
at org.apache.lucene.util.TestRuleIgnoreAfterMaxFailures$1.evaluate(TestRuleIgnoreAfterMaxFailures.java:65)
at org.apache.lucene.util.TestRuleIgnoreTestSuites$1.evaluate(TestRuleIgnoreTestSuites.java:55)
at com.carrotsearch.randomizedtesting.rules.StatementAdapter.evaluate(StatementAdapter.java:36)
at com.carrotsearch.randomizedtesting.ThreadLeakControl$StatementRunner.run(ThreadLeakControl.java:360)
at java.lang.Thread.run(Thread.java:744)
Build Log:
[...truncated 11480 lines...]
[junit4] Suite: org.apache.solr.core.TestNonNRTOpen
[junit4] 2> Creating dataDir: /Users/jenkins/workspace/Lucene-Solr-trunk-MacOSX/solr/build/solr-core/test/J0/./solr.core.TestNonNRTOpen-AEEA33790E83F9B6-001/init-core-data-001
[junit4] 2> 3344990 T12264 oas.SolrTestCaseJ4.buildSSLConfig Randomized ssl (true) and clientAuth (false)
[junit4] 2> 3344992 T12264 oas.SolrTestCaseJ4.initCore ####initCore
[junit4] 2> 3344993 T12264 oasc.SolrResourceLoader.<init> new SolrResourceLoader for directory: '/Users/jenkins/workspace/Lucene-Solr-trunk-MacOSX/solr/core/src/test-files/solr/collection1/'
[junit4] 2> 3344994 T12264 oasc.SolrResourceLoader.replaceClassLoader Adding 'file:/Users/jenkins/workspace/Lucene-Solr-trunk-MacOSX/solr/core/src/test-files/solr/collection1/lib/.svn/' to classloader
[junit4] 2> 3344995 T12264 oasc.SolrResourceLoader.replaceClassLoader Adding 'file:/Users/jenkins/workspace/Lucene-Solr-trunk-MacOSX/solr/core/src/test-files/solr/collection1/lib/classes/' to classloader
[junit4] 2> 3344996 T12264 oasc.SolrResourceLoader.replaceClassLoader Adding 'file:/Users/jenkins/workspace/Lucene-Solr-trunk-MacOSX/solr/core/src/test-files/solr/collection1/lib/README' to classloader
[junit4] 2> 3345072 T12264 oasc.SolrConfig.<init> Using Lucene MatchVersion: LUCENE_50
[junit4] 2> 3345079 T12264 oasc.SolrConfig.<init> Loaded SolrConfig: solrconfig-basic.xml
[junit4] 2> 3345081 T12264 oass.IndexSchema.readSchema Reading Solr Schema from schema-minimal.xml
[junit4] 2> 3345085 T12264 oass.IndexSchema.readSchema [null] Schema name=minimal
[junit4] 2> 3345090 T12264 oass.IndexSchema.readSchema WARN no uniqueKey specified in schema.
[junit4] 2> 3345091 T12264 oasc.SolrResourceLoader.locateSolrHome JNDI not configured for solr (NoInitialContextEx)
[junit4] 2> 3345092 T12264 oasc.SolrResourceLoader.locateSolrHome using system property solr.solr.home: /Users/jenkins/workspace/Lucene-Solr-trunk-MacOSX/solr/core/src/test-files/solr
[junit4] 2> 3345092 T12264 oasc.SolrResourceLoader.<init> new SolrResourceLoader for directory: '/Users/jenkins/workspace/Lucene-Solr-trunk-MacOSX/solr/core/src/test-files/solr/'
[junit4] 2> 3345129 T12264 oasc.CoreContainer.<init> New CoreContainer 1331456909
[junit4] 2> 3345129 T12264 oasc.CoreContainer.load Loading cores into CoreContainer [instanceDir=/Users/jenkins/workspace/Lucene-Solr-trunk-MacOSX/solr/core/src/test-files/solr/]
[junit4] 2> 3345130 T12264 oashc.HttpShardHandlerFactory.getParameter Setting socketTimeout to: 0
[junit4] 2> 3345135 T12264 oashc.HttpShardHandlerFactory.getParameter Setting urlScheme to: null
[junit4] 2> 3345135 T12264 oashc.HttpShardHandlerFactory.getParameter Setting connTimeout to: 0
[junit4] 2> 3345135 T12264 oashc.HttpShardHandlerFactory.getParameter Setting maxConnectionsPerHost to: 20
[junit4] 2> 3345136 T12264 oashc.HttpShardHandlerFactory.getParameter Setting corePoolSize to: 0
[junit4] 2> 3345136 T12264 oashc.HttpShardHandlerFactory.getParameter Setting maximumPoolSize to: 2147483647
[junit4] 2> 3345136 T12264 oashc.HttpShardHandlerFactory.getParameter Setting maxThreadIdleTime to: 5
[junit4] 2> 3345136 T12264 oashc.HttpShardHandlerFactory.getParameter Setting sizeOfQueue to: -1
[junit4] 2> 3345137 T12264 oashc.HttpShardHandlerFactory.getParameter Setting fairnessPolicy to: false
[junit4] 2> 3345142 T12264 oasl.LogWatcher.createWatcher SLF4J impl is org.slf4j.impl.Log4jLoggerFactory
[junit4] 2> 3345143 T12264 oasl.LogWatcher.newRegisteredLogWatcher Registering Log Listener [Log4j (org.slf4j.impl.Log4jLoggerFactory)]
[junit4] 2> 3345143 T12264 oasc.CoreContainer.load Host Name:
[junit4] 2> 3345147 T12265 oasc.SolrResourceLoader.<init> new SolrResourceLoader for directory: '/Users/jenkins/workspace/Lucene-Solr-trunk-MacOSX/solr/core/src/test-files/solr/collection1/'
[junit4] 2> 3345148 T12265 oasc.SolrResourceLoader.replaceClassLoader Adding 'file:/Users/jenkins/workspace/Lucene-Solr-trunk-MacOSX/solr/core/src/test-files/solr/collection1/lib/.svn/' to classloader
[junit4] 2> 3345148 T12265 oasc.SolrResourceLoader.replaceClassLoader Adding 'file:/Users/jenkins/workspace/Lucene-Solr-trunk-MacOSX/solr/core/src/test-files/solr/collection1/lib/classes/' to classloader
[junit4] 2> 3345149 T12265 oasc.SolrResourceLoader.replaceClassLoader Adding 'file:/Users/jenkins/workspace/Lucene-Solr-trunk-MacOSX/solr/core/src/test-files/solr/collection1/lib/README' to classloader
[junit4] 2> 3345189 T12265 oasc.SolrConfig.<init> Using Lucene MatchVersion: LUCENE_50
[junit4] 2> 3345240 T12265 oasc.SolrConfig.<init> Loaded SolrConfig: solrconfig-basic.xml
[junit4] 2> 3345241 T12265 oass.IndexSchema.readSchema Reading Solr Schema from schema-minimal.xml
[junit4] 2> 3345244 T12265 oass.IndexSchema.readSchema [collection1] Schema name=minimal
[junit4] 2> 3345246 T12265 oass.IndexSchema.readSchema WARN no uniqueKey specified in schema.
[junit4] 2> 3345247 T12265 oasc.CoreContainer.create Creating SolrCore 'collection1' using configuration from instancedir /Users/jenkins/workspace/Lucene-Solr-trunk-MacOSX/solr/core/src/test-files/solr/collection1/
[junit4] 2> 3345247 T12265 oasc.SolrCore.initDirectoryFactory solr.StandardDirectoryFactory
[junit4] 2> 3345248 T12265 oasc.SolrCore.<init> [collection1] Opening new SolrCore at /Users/jenkins/workspace/Lucene-Solr-trunk-MacOSX/solr/core/src/test-files/solr/collection1/, dataDir=/Users/jenkins/workspace/Lucene-Solr-trunk-MacOSX/solr/build/solr-core/test/J0/./solr.core.TestNonNRTOpen-AEEA33790E83F9B6-001/init-core-data-001/
[junit4] 2> 3345249 T12265 oasc.SolrCore.<init> JMX monitoring not detected for core: collection1
[junit4] 2> 3345250 T12265 oasc.CachingDirectoryFactory.get return new directory for /Users/jenkins/workspace/Lucene-Solr-trunk-MacOSX/solr/build/solr-core/test/J0/solr.core.TestNonNRTOpen-AEEA33790E83F9B6-001/init-core-data-001
[junit4] 2> 3345250 T12265 oasc.SolrCore.getNewIndexDir New index directory detected: old=null new=/Users/jenkins/workspace/Lucene-Solr-trunk-MacOSX/solr/build/solr-core/test/J0/./solr.core.TestNonNRTOpen-AEEA33790E83F9B6-001/init-core-data-001/index/
[junit4] 2> 3345251 T12265 oasc.SolrCore.initIndex WARN [collection1] Solr index directory '/Users/jenkins/workspace/Lucene-Solr-trunk-MacOSX/solr/build/solr-core/test/J0/./solr.core.TestNonNRTOpen-AEEA33790E83F9B6-001/init-core-data-001/index' doesn't exist. Creating new index...
[junit4] 2> 3345252 T12265 oasc.CachingDirectoryFactory.get return new directory for /Users/jenkins/workspace/Lucene-Solr-trunk-MacOSX/solr/build/solr-core/test/J0/solr.core.TestNonNRTOpen-AEEA33790E83F9B6-001/init-core-data-001/index
[junit4] 2> 3345255 T12265 oasc.SolrDeletionPolicy.onCommit SolrDeletionPolicy.onCommit: commits: num=1
[junit4] 2> commit{dir=/Users/jenkins/workspace/Lucene-Solr-trunk-MacOSX/solr/build/solr-core/test/J0/solr.core.TestNonNRTOpen-AEEA33790E83F9B6-001/init-core-data-001/index,segFN=segments_1,generation=1}
[junit4] 2> 3345256 T12265 oasc.SolrDeletionPolicy.updateCommits newest commit generation = 1
[junit4] 2> 3345259 T12265 oasc.SolrCore.loadUpdateProcessorChains no updateRequestProcessorChain defined as default, creating implicit default
[junit4] 2> 3345260 T12265 oasc.RequestHandlers.initHandlersFromConfig created standard: solr.StandardRequestHandler
[junit4] 2> 3345260 T12265 oasc.RequestHandlers.initHandlersFromConfig created /update: solr.UpdateRequestHandler
[junit4] 2> 3345268 T12265 oashl.XMLLoader.init xsltCacheLifetimeSeconds=60
[junit4] 2> 3345270 T12265 oasu.CommitTracker.<init> Hard AutoCommit: disabled
[junit4] 2> 3345270 T12265 oasu.CommitTracker.<init> Soft AutoCommit: disabled
[junit4] 2> 3345271 T12265 oass.SolrIndexSearcher.<init> Opening Searcher@8a9c82d[collection1] main
[junit4] 2> 3345272 T12265 oasr.ManagedResourceStorage$FileStorageIO.configure File-based storage initialized to use dir: /Users/jenkins/workspace/Lucene-Solr-trunk-MacOSX/solr/core/src/test-files/solr/collection1/conf
[junit4] 2> 3345272 T12265 oasr.RestManager.init Initializing RestManager with initArgs: {storageDir=/Users/jenkins/workspace/Lucene-Solr-trunk-MacOSX/solr/core/src/test-files/solr/collection1/conf/}
[junit4] 2> 3345272 T12265 oasr.ManagedResourceStorage.load Reading _rest_managed.json using file:dir=/Users/jenkins/workspace/Lucene-Solr-trunk-MacOSX/solr/core/src/test-files/solr/collection1/conf
[junit4] 2> 3345272 T12265 oasr.ManagedResource.reloadFromStorage WARN No stored data found for /rest/managed
[junit4] 2> 3345273 T12265 oasr.ManagedResource.notifyObserversDuringInit WARN No registered observers for /rest/managed
[junit4] 2> 3345274 T12265 oasr.RestManager.init Initializing 0 registered ManagedResources
[junit4] 2> 3345274 T12266 oasc.SolrCore.registerSearcher [collection1] Registered new searcher Searcher@8a9c82d[collection1] main{StandardDirectoryReader(segments_1:1)}
[junit4] 2> 3345274 T12265 oasc.CoreContainer.registerCore registering core: collection1
[junit4] 2> 3345277 T12264 oas.SolrTestCaseJ4.initCore ####initCore end
[junit4] 2> ASYNC NEW_CORE C2249 name=collection1 org.apache.solr.core.SolrCore@74e6f659
[junit4] 2> 3345282 T12264 C2249 oasc.SolrDeletionPolicy.onInit SolrDeletionPolicy.onInit: commits: num=1
[junit4] 2> commit{dir=/Users/jenkins/workspace/Lucene-Solr-trunk-MacOSX/solr/build/solr-core/test/J0/solr.core.TestNonNRTOpen-AEEA33790E83F9B6-001/init-core-data-001/index,segFN=segments_1,generation=1}
[junit4] 2> 3345282 T12264 C2249 oasc.SolrDeletionPolicy.updateCommits newest commit generation = 1
[junit4] 2> 3345285 T12264 C2249 oasup.LogUpdateProcessor.finish [collection1] webapp=null path=null params={} {add=[(null)]} 0 7
[junit4] 2> 3345288 T12264 C2249 oasu.DirectUpdateHandler2.commit start commit{,optimize=false,openSearcher=true,waitSearcher=true,expungeDeletes=false,softCommit=false,prepareCommit=false}
[junit4] 2> 3345307 T12264 C2249 oasc.SolrDeletionPolicy.onCommit SolrDeletionPolicy.onCommit: commits: num=2
[junit4] 2> commit{dir=/Users/jenkins/workspace/Lucene-Solr-trunk-MacOSX/solr/build/solr-core/test/J0/solr.core.TestNonNRTOpen-AEEA33790E83F9B6-001/init-core-data-001/index,segFN=segments_1,generation=1}
[junit4] 2> commit{dir=/Users/jenkins/workspace/Lucene-Solr-trunk-MacOSX/solr/build/solr-core/test/J0/solr.core.TestNonNRTOpen-AEEA33790E83F9B6-001/init-core-data-001/index,segFN=segments_2,generation=2}
[junit4] 2> 3345307 T12264 C2249 oasc.SolrDeletionPolicy.updateCommits newest commit generation = 2
[junit4] 2> 3345316 T12264 C2249 oass.SolrIndexSearcher.<init> Opening Searcher@7138165f[collection1] main
[junit4] 2> 3345317 T12266 oasc.SolrCore.registerSearcher [collection1] Registered new searcher Searcher@7138165f[collection1] main{StandardDirectoryReader(segments_2:3 _0(5.0):C1)}
[junit4] 2> 3345318 T12264 C2249 oasu.DirectUpdateHandler2.commit end_commit_flush
[junit4] 2> 3345318 T12264 C2249 oasup.LogUpdateProcessor.finish [collection1] webapp=null path=null params={} {commit=} 0 30
[junit4] 2> 3345320 T12264 oas.SolrTestCaseJ4.deleteCore ###deleteCore
[junit4] 2> 3345321 T12264 oasc.CoreContainer.shutdown Shutting down CoreContainer instance=1331456909
[junit4] 2> 3345321 T12264 oasc.SolrCore.close [collection1] CLOSING SolrCore org.apache.solr.core.SolrCore@74e6f659
[junit4] 2> 3345322 T12264 oasu.DirectUpdateHandler2.close closing DirectUpdateHandler2{commits=1,autocommits=0,soft autocommits=0,optimizes=0,rollbacks=0,expungeDeletes=0,docsPending=0,adds=0,deletesById=0,deletesByQuery=0,errors=0,cumulative_adds=1,cumulative_deletesById=0,cumulative_deletesByQuery=0,cumulative_errors=0}
[junit4] 2> 3345322 T12264 oasu.SolrCoreState.decrefSolrCoreState Closing SolrCoreState
[junit4] 2> 3345322 T12264 oasu.DefaultSolrCoreState.closeIndexWriter SolrCoreState ref count has reached 0 - closing IndexWriter
[junit4] 2> 3345323 T12264 oasu.DefaultSolrCoreState.closeIndexWriter closing IndexWriter with IndexWriterCloser
[junit4] 2> 3345326 T12264 oasc.SolrCore.closeSearcher [collection1] Closing main searcher on request.
[junit4] 2> 3345326 T12264 oasc.CachingDirectoryFactory.close Closing StandardDirectoryFactory - 2 directories currently being tracked
[junit4] 2> 3345327 T12264 oasc.CachingDirectoryFactory.closeCacheValue looking to close /Users/jenkins/workspace/Lucene-Solr-trunk-MacOSX/solr/build/solr-core/test/J0/solr.core.TestNonNRTOpen-AEEA33790E83F9B6-001/init-core-data-001 [CachedDir<<refCount=0;path=/Users/jenkins/workspace/Lucene-Solr-trunk-MacOSX/solr/build/solr-core/test/J0/solr.core.TestNonNRTOpen-AEEA33790E83F9B6-001/init-core-data-001;done=false>>]
[junit4] 2> 3345327 T12264 oasc.CachingDirectoryFactory.close Closing directory: /Users/jenkins/workspace/Lucene-Solr-trunk-MacOSX/solr/build/solr-core/test/J0/solr.core.TestNonNRTOpen-AEEA33790E83F9B6-001/init-core-data-001
[junit4] 2> 3345327 T12264 oasc.CachingDirectoryFactory.closeCacheValue looking to close /Users/jenkins/workspace/Lucene-Solr-trunk-MacOSX/solr/build/solr-core/test/J0/solr.core.TestNonNRTOpen-AEEA33790E83F9B6-001/init-core-data-001/index [CachedDir<<refCount=0;path=/Users/jenkins/workspace/Lucene-Solr-trunk-MacOSX/solr/build/solr-core/test/J0/solr.core.TestNonNRTOpen-AEEA33790E83F9B6-001/init-core-data-001/index;done=false>>]
[junit4] 2> 3345328 T12264 oasc.CachingDirectoryFactory.close Closing directory: /Users/jenkins/workspace/Lucene-Solr-trunk-MacOSX/solr/build/solr-core/test/J0/solr.core.TestNonNRTOpen-AEEA33790E83F9B6-001/init-core-data-001/index
[junit4] 2> 3345330 T12264 oas.SolrTestCaseJ4.initCore ####initCore
[junit4] 2> 3345330 T12264 oasc.SolrResourceLoader.<init> new SolrResourceLoader for directory: '/Users/jenkins/workspace/Lucene-Solr-trunk-MacOSX/solr/core/src/test-files/solr/collection1/'
[junit4] 2> 3345332 T12264 oasc.SolrResourceLoader.replaceClassLoader Adding 'file:/Users/jenkins/workspace/Lucene-Solr-trunk-MacOSX/solr/core/src/test-files/solr/collection1/lib/.svn/' to classloader
[junit4] 2> 3345332 T12264 oasc.SolrResourceLoader.replaceClassLoader Adding 'file:/Users/jenkins/workspace/Lucene-Solr-trunk-MacOSX/solr/core/src/test-files/solr/collection1/lib/classes/' to classloader
[junit4] 2> 3345333 T12264 oasc.SolrResourceLoader.replaceClassLoader Adding 'file:/Users/jenkins/workspace/Lucene-Solr-trunk-MacOSX/solr/core/src/test-files/solr/collection1/lib/README' to classloader
[junit4] 2> 3345408 T12264 oasc.SolrConfig.<init> Using Lucene MatchVersion: LUCENE_50
[junit4] 2> 3345415 T12264 oasc.SolrConfig.<init> Loaded SolrConfig: solrconfig-basic.xml
[junit4] 2> 3345416 T12264 oass.IndexSchema.readSchema Reading Solr Schema from schema-minimal.xml
[junit4] 2> 3345420 T12264 oass.IndexSchema.readSchema [null] Schema name=minimal
[junit4] 2> 3345424 T12264 oass.IndexSchema.readSchema WARN no uniqueKey specified in schema.
[junit4] 2> 3345426 T12264 oasc.SolrResourceLoader.locateSolrHome JNDI not configured for solr (NoInitialContextEx)
[junit4] 2> 3345427 T12264 oasc.SolrResourceLoader.locateSolrHome using system property solr.solr.home: /Users/jenkins/workspace/Lucene-Solr-trunk-MacOSX/solr/core/src/test-files/solr
[junit4] 2> 3345427 T12264 oasc.SolrResourceLoader.<init> new SolrResourceLoader for directory: '/Users/jenkins/workspace/Lucene-Solr-trunk-MacOSX/solr/core/src/test-files/solr/'
[junit4] 2> 3345468 T12264 oasc.CoreContainer.<init> New CoreContainer 907117865
[junit4] 2> 3345470 T12264 oasc.CoreContainer.load Loading cores into CoreContainer [instanceDir=/Users/jenkins/workspace/Lucene-Solr-trunk-MacOSX/solr/core/src/test-files/solr/]
[junit4] 2> 3345470 T12264 oashc.HttpShardHandlerFactory.getParameter Setting socketTimeout to: 0
[junit4] 2> 3345470 T12264 oashc.HttpShardHandlerFactory.getParameter Setting urlScheme to: null
[junit4] 2> 3345470 T12264 oashc.HttpShardHandlerFactory.getParameter Setting connTimeout to: 0
[junit4] 2> 3345471 T12264 oashc.HttpShardHandlerFactory.getParameter Setting maxConnectionsPerHost to: 20
[junit4] 2> 3345471 T12264 oashc.HttpShardHandlerFactory.getParameter Setting corePoolSize to: 0
[junit4] 2> 3345471 T12264 oashc.HttpShardHandlerFactory.getParameter Setting maximumPoolSize to: 2147483647
[junit4] 2> 3345472 T12264 oashc.HttpShardHandlerFactory.getParameter Setting maxThreadIdleTime to: 5
[junit4] 2> 3345472 T12264 oashc.HttpShardHandlerFactory.getParameter Setting sizeOfQueue to: -1
[junit4] 2> 3345472 T12264 oashc.HttpShardHandlerFactory.getParameter Setting fairnessPolicy to: false
[junit4] 2> 3345487 T12264 oasl.LogWatcher.createWatcher SLF4J impl is org.slf4j.impl.Log4jLoggerFactory
[junit4] 2> 3345488 T12264 oasl.LogWatcher.newRegisteredLogWatcher Registering Log Listener [Log4j (org.slf4j.impl.Log4jLoggerFactory)]
[junit4] 2> 3345488 T12264 oasc.CoreContainer.load Host Name:
[junit4] 2> 3345503 T12268 oasc.SolrResourceLoader.<init> new SolrResourceLoader for directory: '/Users/jenkins/workspace/Lucene-Solr-trunk-MacOSX/solr/core/src/test-files/solr/collection1/'
[junit4] 2> 3345504 T12268 oasc.SolrResourceLoader.replaceClassLoader Adding 'file:/Users/jenkins/workspace/Lucene-Solr-trunk-MacOSX/solr/core/src/test-files/solr/collection1/lib/.svn/' to classloader
[junit4] 2> 3345504 T12268 oasc.SolrResourceLoader.replaceClassLoader Adding 'file:/Users/jenkins/workspace/Lucene-Solr-trunk-MacOSX/solr/core/src/test-files/solr/collection1/lib/classes/' to classloader
[junit4] 2> 3345504 T12268 oasc.SolrResourceLoader.replaceClassLoader Adding 'file:/Users/jenkins/workspace/Lucene-Solr-trunk-MacOSX/solr/core/src/test-files/solr/collection1/lib/README' to classloader
[junit4] 2> 3345540 T12268 oasc.SolrConfig.<init> Using Lucene MatchVersion: LUCENE_50
[junit4] 2> 3345547 T12268 oasc.SolrConfig.<init> Loaded SolrConfig: solrconfig-basic.xml
[junit4] 2> 3345548 T12268 oass.IndexSchema.readSchema Reading Solr Schema from schema-minimal.xml
[junit4] 2> 3345552 T12268 oass.IndexSchema.readSchema [collection1] Schema name=minimal
[junit4] 2> 3345554 T12268 oass.IndexSchema.readSchema WARN no uniqueKey specified in schema.
[junit4] 2> 3345556 T12268 oasc.CoreContainer.create Creating SolrCore 'collection1' using configuration from instancedir /Users/jenkins/workspace/Lucene-Solr-trunk-MacOSX/solr/core/src/test-files/solr/collection1/
[junit4] 2> 3345556 T12268 oasc.SolrCore.initDirectoryFactory solr.StandardDirectoryFactory
[junit4] 2> 3345557 T12268 oasc.SolrCore.<init> [collection1] Opening new SolrCore at /Users/jenkins/workspace/Lucene-Solr-trunk-MacOSX/solr/core/src/test-files/solr/collection1/, dataDir=/Users/jenkins/workspace/Lucene-Solr-trunk-MacOSX/solr/build/solr-core/test/J0/./solr.core.TestNonNRTOpen-AEEA33790E83F9B6-001/init-core-data-001/
[junit4] 2> 3345557 T12268 oasc.SolrCore.<init> JMX monitoring not detected for core: collection1
[junit4] 2> 3345558 T12268 oasc.CachingDirectoryFactory.get return new directory for /Users/jenkins/workspace/Lucene-Solr-trunk-MacOSX/solr/build/solr-core/test/J0/solr.core.TestNonNRTOpen-AEEA33790E83F9B6-001/init-core-data-001
[junit4] 2> 3345559 T12268 oasc.SolrCore.getNewIndexDir New index directory detected: old=null new=/Users/jenkins/workspace/Lucene-Solr-trunk-MacOSX/solr/build/solr-core/test/J0/./solr.core.TestNonNRTOpen-AEEA33790E83F9B6-001/init-core-data-001/index/
[junit4] 2> 3345561 T12268 oasc.SolrCore.loadUpdateProcessorChains no updateRequestProcessorChain defined as default, creating implicit default
[junit4] 2> 3345561 T12268 oasc.RequestHandlers.initHandlersFromConfig created standard: solr.StandardRequestHandler
[junit4] 2> 3345562 T12268 oasc.RequestHandlers.initHandlersFromConfig created /update: solr.UpdateRequestHandler
[junit4] 2> 3345570 T12268 oashl.XMLLoader.init xsltCacheLifetimeSeconds=60
[junit4] 2> 3345571 T12268 oasu.CommitTracker.<init> Hard AutoCommit: disabled
[junit4] 2> 3345571 T12268 oasu.CommitTracker.<init> Soft AutoCommit: disabled
[junit4] 2> 3345572 T12268 oasc.CachingDirectoryFactory.get return new directory for /Users/jenkins/workspace/Lucene-Solr-trunk-MacOSX/solr/build/solr-core/test/J0/solr.core.TestNonNRTOpen-AEEA33790E83F9B6-001/init-core-data-001/index
[junit4] 2> 3345575 T12268 oass.SolrIndexSearcher.<init> Opening Searcher@6bbb88eb[collection1] main
[junit4] 2> 3345576 T12268 oasr.ManagedResourceStorage$FileStorageIO.configure File-based storage initialized to use dir: /Users/jenkins/workspace/Lucene-Solr-trunk-MacOSX/solr/core/src/test-files/solr/collection1/conf
[junit4] 2> 3345576 T12268 oasr.RestManager.init Initializing RestManager with initArgs: {storageDir=/Users/jenkins/workspace/Lucene-Solr-trunk-MacOSX/solr/core/src/test-files/solr/collection1/conf/}
[junit4] 2> 3345577 T12268 oasr.ManagedResourceStorage.load Reading _rest_managed.json using file:dir=/Users/jenkins/workspace/Lucene-Solr-trunk-MacOSX/solr/core/src/test-files/solr/collection1/conf
[junit4] 2> 3345578 T12268 oasr.ManagedResource.reloadFromStorage WARN No stored data found for /rest/managed
[junit4] 2> 3345579 T12268 oasr.ManagedResource.notifyObserversDuringInit WARN No registered observers for /rest/managed
[junit4] 2> 3345579 T12268 oasr.RestManager.init Initializing 0 registered ManagedResources
[junit4] 2> 3345579 T12268 oasc.CoreContainer.registerCore registering core: collection1
[junit4] 2> 3345580 T12269 oasc.SolrCore.registerSearcher [collection1] Registered new searcher Searcher@6bbb88eb[collection1] main{StandardDirectoryReader(segments_2:3 _0(5.0):C1)}
[junit4] 2> 3345583 T12264 oas.SolrTestCaseJ4.initCore ####initCore end
[junit4] 2> 3345583 T12264 oasc.TestNonNRTOpen.assertNotNRT Checking notNRT & maxDoc=1 of core=org.apache.solr.core.SolrCore@5f1ed6d6
[junit4] 2> 3345589 T12264 oas.SolrTestCaseJ4.setUp ###Starting testSharedCores
[junit4] 2> ASYNC NEW_CORE C2250 name=collection1 org.apache.solr.core.SolrCore@5f1ed6d6
[junit4] 2> 3345589 T12264 C2250 oasu.DirectUpdateHandler2.deleteAll [collection1] REMOVING ALL DOCUMENTS FROM INDEX
[junit4] 2> 3345596 T12264 C2250 oasc.SolrDeletionPolicy.onInit SolrDeletionPolicy.onInit: commits: num=1
[junit4] 2> commit{dir=/Users/jenkins/workspace/Lucene-Solr-trunk-MacOSX/solr/build/solr-core/test/J0/solr.core.TestNonNRTOpen-AEEA33790E83F9B6-001/init-core-data-001/index,segFN=segments_2,generation=2}
[junit4] 2> 3345597 T12264 C2250 oasc.SolrDeletionPolicy.updateCommits newest commit generation = 2
[junit4] 2> 3345597 T12264 C2250 oasup.LogUpdateProcessor.finish [collection1] webapp=null path=null params={} {deleteByQuery=*:*} 0 8
[junit4] 2> 3345600 T12264 C2250 oasup.LogUpdateProcessor.finish [collection1] webapp=null path=null params={} {add=[(null)]} 0 2
[junit4] 2> 3345601 T12264 C2250 oasu.DirectUpdateHandler2.commit start commit{,optimize=false,openSearcher=true,waitSearcher=true,expungeDeletes=false,softCommit=false,prepareCommit=false}
[junit4] 2> 3345619 T12264 C2250 oasc.SolrDeletionPolicy.onCommit SolrDeletionPolicy.onCommit: commits: num=2
[junit4] 2> commit{dir=/Users/jenkins/workspace/Lucene-Solr-trunk-MacOSX/solr/build/solr-core/test/J0/solr.core.TestNonNRTOpen-AEEA33790E83F9B6-001/init-core-data-001/index,segFN=segments_2,generation=2}
[junit4] 2> commit{dir=/Users/jenkins/workspace/Lucene-Solr-trunk-MacOSX/solr/build/solr-core/test/J0/solr.core.TestNonNRTOpen-AEEA33790E83F9B6-001/init-core-data-001/index,segFN=segments_3,generation=3}
[junit4] 2> 3345619 T12264 C2250 oasc.SolrDeletionPolicy.updateCommits newest commit generation = 3
[junit4] 2> 3345633 T12264 C2250 oass.SolrIndexSearcher.<init> Opening Searcher@45f7a4dc[collection1] main
[junit4] 2> 3345634 T12269 oasc.SolrCore.registerSearcher [collection1] Registered new searcher Searcher@45f7a4dc[collection1] main{StandardDirectoryReader(segments_3:6 _1(5.0):C1)}
[junit4] 2> 3345634 T12264 C2250 oasu.DirectUpdateHandler2.commit end_commit_flush
[junit4] 2> 3345636 T12264 C2250 oasup.LogUpdateProcessor.finish [collection1] webapp=null path=null params={} {commit=} 0 35
[junit4] 2> 3345637 T12264 C2250 oasu.DirectUpdateHandler2.commit start commit{,optimize=true,openSearcher=true,waitSearcher=true,expungeDeletes=false,softCommit=false,prepareCommit=false}
[junit4] 2> 3345638 T12264 C2250 oasu.DirectUpdateHandler2.commit No uncommitted changes. Skipping IW.commit.
[junit4] 2> 3345640 T12264 C2250 oasc.SolrCore.openNewSearcher SolrIndexSearcher has not changed - not re-opening: org.apache.solr.search.SolrIndexSearcher
[junit4] 2> 3345640 T12264 C2250 oasu.DirectUpdateHandler2.commit end_commit_flush
[junit4] 2> 3345641 T12264 C2250 oasup.LogUpdateProcessor.finish [collection1] webapp=null path=null params={} {optimize=} 0 4
[junit4] 2> 3345644 T12264 C2250 oasup.LogUpdateProcessor.finish [collection1] webapp=null path=null params={} {add=[(null)]} 0 2
[junit4] 2> 3345645 T12264 C2250 oasu.DirectUpdateHandler2.commit start commit{,optimize=false,openSearcher=true,waitSearcher=true,expungeDeletes=false,softCommit=false,prepareCommit=false}
[junit4] 2> 3345667 T12264 C2250 oasc.SolrDeletionPolicy.onCommit SolrDeletionPolicy.onCommit: commits: num=2
[junit4] 2> commit{dir=/Users/jenkins/workspace/Lucene-Solr-trunk-MacOSX/solr/build/solr-core/test/J0/solr.core.TestNonNRTOpen-AEEA33790E83F9B6-001/init-core-data-001/index,segFN=segments_3,generation=3}
[junit4] 2> commit{dir=/Users/jenkins/workspace/Lucene-Solr-trunk-MacOSX/solr/build/solr-core/test/J0/solr.core.TestNonNRTOpen-AEEA33790E83F9B6-001/init-core-data-001/index,segFN=segments_4,generation=4}
[junit4] 2> 3345667 T12264 C2250 oasc.SolrDeletionPolicy.updateCommits newest commit generation = 4
[junit4] 2> 3345682 T12264 C2250 oass.SolrIndexSearcher.<init> Opening Searcher@462d2dbe[collection1] main
[junit4] 2> 3345682 T12269 oasc.SolrCore.registerSearcher [collection1] Registered new searcher Searcher@462d2dbe[collection1] main{StandardDirectoryReader(segments_4:8 _1(5.0):C1 _2(5.0):C1)}
[junit4] 2> 3345683 T12264 C2250 oasu.DirectUpdateHandler2.commit end_commit_flush
[junit4] 2> 3345683 T12264 C2250 oasup.LogUpdateProcessor.finish [collection1] webapp=null path=null params={} {commit=} 0 38
[junit4] 2> 3345686 T12264 C2250 oasup.LogUpdateProcessor.finish [collection1] webapp=null path=null params={} {add=[(null)]} 0 2
[junit4] 2> 3345688 T12264 C2250 oasup.LogUpdateProcessor.finish [collection1] webapp=null path=null params={} {add=[(null)]} 0 1
[junit4] 2> 3345688 T12264 C2250 oasu.DirectUpdateHandler2.commit start commit{,optimize=false,openSearcher=true,waitSearcher=true,expungeDeletes=false,softCommit=false,prepareCommit=false}
[junit4] 2> 3345718 T12264 C2250 oasc.SolrDeletionPolicy.onCommit SolrDeletionPolicy.onCommit: commits: num=2
[junit4] 2> commit{dir=/Users/jenkins/workspace/Lucene-Solr-trunk-MacOSX/solr/build/solr-core/test/J0/solr.core.TestNonNRTOpen-AEEA33790E83F9B6-001/init-core-data-001/index,segFN=segments_4,generation=4}
[junit4] 2> commit{dir=/Users/jenkins/workspace/Lucene-Solr-trunk-MacOSX/solr/build/solr-core/test/J0/solr.core.TestNonNRTOpen-AEEA33790E83F9B6-001/init-core-data-001/index,segFN=segments_5,generation=5}
[junit4] 2> 3345719 T12264 C2250 oasc.SolrDeletionPolicy.updateCommits newest commit generation = 5
[junit4] 2> 3345743 T12264 C2250 oass.SolrIndexSearcher.<init> Opening Searcher@54e0fd0[collection1] main
[junit4] 2> 3345743 T12264 C2250 oasu.DirectUpdateHandler2.commit end_commit_flush
[junit4] 2> 3345745 T12269 oasc.SolrCore.registerSearcher [collection1] Registered new searcher Searcher@54e0fd0[collection1] main{StandardDirectoryReader(segments_5:10 _1(5.0):C1 _2(5.0):C1 _3(5.0):C2)}
[junit4] 2> 3345746 T12264 C2250 oasup.LogUpdateProcessor.finish [collection1] webapp=null path=null params={} {commit=} 0 58
[junit4] 2> 3345746 T12264 C2250 oasup.LogUpdateProcessor.finish [collection1] webapp=null path=null params={} {deleteByQuery=foo2:doc} 0 0
[junit4] 2> 3345747 T12264 C2250 oasu.DirectUpdateHandler2.commit start commit{,optimize=false,openSearcher=true,waitSearcher=true,expungeDeletes=false,softCommit=false,prepareCommit=false}
[junit4] 2> 3345763 T12264 C2250 oasc.SolrDeletionPolicy.onCommit SolrDeletionPolicy.onCommit: commits: num=2
[junit4] 2> commit{dir=/Users/jenkins/workspace/Lucene-Solr-trunk-MacOSX/solr/build/solr-core/test/J0/solr.core.TestNonNRTOpen-AEEA33790E83F9B6-001/init-core-data-001/index,segFN=segments_5,generation=5}
[junit4] 2> commit{dir=/Users/jenkins/workspace/Lucene-Solr-trunk-MacOSX/solr/build/solr-core/test/J0/solr.core.TestNonNRTOpen-AEEA33790E83F9B6-001/init-core-data-001/index,segFN=segments_6,generation=6}
[junit4] 2> 3345763 T12264 C2250 oasc.SolrDeletionPolicy.updateCommits newest commit generation = 6
[junit4] 2> 3345779 T12264 C2250 oass.SolrIndexSearcher.<init> Opening Searcher@2101a710[collection1] main
[junit4] 2> 3345780 T12269 oasc.SolrCore.registerSearcher [collection1] Registered new searcher Searcher@2101a710[collection1] main{StandardDirectoryReader(segments_6:11 _1(5.0):C1 _2(5.0):C1 _3(5.0):C2/1:delGen=1)}
[junit4] 2> 3345780 T12264 C2250 oasu.DirectUpdateHandler2.commit end_commit_flush
[junit4] 2> 3345781 T12264 C2250 oasup.LogUpdateProcessor.finish [collection1] webapp=null path=null params={} {commit=} 0 34
[junit4] 2> 3345781 T12264 oas.SolrTestCaseJ4.tearDown ###Ending testSharedCores
[junit4] 2> 3345788 T12264 oas.SolrTestCaseJ4.setUp ###Starting testReaderIsNotNRT
[junit4] 2> 3345788 T12264 C2250 oasu.DirectUpdateHandler2.deleteAll [collection1] REMOVING ALL DOCUMENTS FROM INDEX
[junit4] 2> 3345790 T12264 C2250 oasup.LogUpdateProcessor.finish [collection1] webapp=null path=null params={} {deleteByQuery=*:*} 0 2
[junit4] 2> 3345792 T12264 C2250 oasup.LogUpdateProcessor.finish [collection1] webapp=null path=null params={} {add=[(null)]} 0 1
[junit4] 2> 3345793 T12264 C2250 oasu.DirectUpdateHandler2.commit start commit{,optimize=false,openSearcher=true,waitSearcher=true,expungeDeletes=false,softCommit=false,prepareCommit=false}
[junit4] 2> 3345810 T12264 C2250 oasc.SolrDeletionPolicy.onCommit SolrDeletionPolicy.onCommit: commits: num=2
[junit4] 2> commit{dir=/Users/jenkins/workspace/Lucene-Solr-trunk-MacOSX/solr/build/solr-core/test/J0/solr.core.TestNonNRTOpen-AEEA33790E83F9B6-001/init-core-data-001/index,segFN=segments_6,generation=6}
[junit4] 2> commit{dir=/Users/jenkins/workspace/Lucene-Solr-trunk-MacOSX/solr/build/solr-core/test/J0/solr.core.TestNonNRTOpen-AEEA33790E83F9B6-001/init-core-data-001/index,segFN=segments_7,generation=7}
[junit4] 2> 3345811 T12264 C2250 oasc.SolrDeletionPolicy.updateCommits newest commit generation = 7
[junit4] 2> 3345837 T12264 C2250 oass.SolrIndexSearcher.<init> Opening Searcher@7c39326[collection1] main
[junit4] 2> 3345837 T12264 C2250 oasu.DirectUpdateHandler2.commit end_commit_flush
[junit4] 2> 3345837 T12269 oasc.SolrCore.registerSearcher [collection1] Registered new searcher Searcher@7c39326[collection1] main{StandardDirectoryReader(segments_7:14 _4(5.0):C1)}
[junit4] 2> 3345841 T12264 C2250 oasup.LogUpdateProcessor.finish [collection1] webapp=null path=null params={} {commit=} 0 48
[junit4] 2> 3345842 T12264 oasc.TestNonNRTOpen.assertNotNRT Checking notNRT & maxDoc=1 of core=org.apache.solr.core.SolrCore@5f1ed6d6
[junit4] 2> 3345842 T12264 oasc.TestNonNRTOpen.testReaderIsNotNRT Reloading core: org.apache.solr.core.SolrCore@5f1ed6d6
[junit4] 2> 3345843 T12264 oasc.SolrResourceLoader.<init> new SolrResourceLoader for directory: '/Users/jenkins/workspace/Lucene-Solr-trunk-MacOSX/solr/core/src/test-files/solr/collection1/'
[junit4] 2> 3345844 T12264 oasc.SolrResourceLoader.replaceClassLoader Adding 'file:/Users/jenkins/workspace/Lucene-Solr-trunk-MacOSX/solr/core/src/test-files/solr/collection1/lib/.svn/' to classloader
[junit4] 2> 3345844 T12264 oasc.SolrResourceLoader.replaceClassLoader Adding 'file:/Users/jenkins/workspace/Lucene-Solr-trunk-MacOSX/solr/core/src/test-files/solr/collection1/lib/classes/' to classloader
[junit4] 2> 3345845 T12264 oasc.SolrResourceLoader.replaceClassLoader Adding 'file:/Users/jenkins/workspace/Lucene-Solr-trunk-MacOSX/solr/core/src/test-files/solr/collection1/lib/README' to classloader
[junit4] 2> 3345919 T12264 oasc.SolrConfig.<init> Using Lucene MatchVersion: LUCENE_50
[junit4] 2> 3345927 T12264 oasc.SolrConfig.<init> Loaded SolrConfig: solrconfig-basic.xml
[junit4] 2> 3345928 T12264 oass.IndexSchema.readSchema Reading Solr Schema from schema-minimal.xml
[junit4] 2> 3345931 T12264 oass.IndexSchema.readSchema [collection1] Schema name=minimal
[junit4] 2> 3345939 T12264 oass.IndexSchema.readSchema WARN no uniqueKey specified in schema.
[junit4] 2> 3345940 T12264 oasc.CoreContainer.reload Reloading SolrCore 'collection1' using configuration from instancedir /Users/jenkins/workspace/Lucene-Solr-trunk-MacOSX/solr/core/src/test-files/solr/collection1/
[junit4] 2> 3345941 T12264 oasc.SolrCore.<init> [collection1] Opening new SolrCore at /Users/jenkins/workspace/Lucene-Solr-trunk-MacOSX/solr/core/src/test-files/solr/collection1/, dataDir=/Users/jenkins/workspace/Lucene-Solr-trunk-MacOSX/solr/build/solr-core/test/J0/./solr.core.TestNonNRTOpen-AEEA33790E83F9B6-001/init-core-data-001/
[junit4] 2> 3345941 T12264 oasc.SolrCore.<init> JMX monitoring not detected for core: collection1
[junit4] 2> 3345942 T12264 oasc.SolrCore.getNewIndexDir New index directory detected: old=null new=/Users/jenkins/workspace/Lucene-Solr-trunk-MacOSX/solr/build/solr-core/test/J0/./solr.core.TestNonNRTOpen-AEEA33790E83F9B6-001/init-core-data-001/index/
[junit4] 2> 3345945 T12264 oasc.SolrCore.loadUpdateProcessorChains no updateRequestProcessorChain defined as default, creating implicit default
[junit4] 2> 3345947 T12264 oasc.RequestHandlers.initHandlersFromConfig created standard: solr.StandardRequestHandler
[junit4] 2> 3345948 T12264 oasc.RequestHandlers.initHandlersFromConfig created /update: solr.UpdateRequestHandler
[junit4] 2> 3345956 T12264 oashl.XMLLoader.init xsltCacheLifetimeSeconds=60
[junit4] 2> 3345957 T12264 oasu.CommitTracker.<init> Hard AutoCommit: disabled
[junit4] 2> 3345957 T12264 oasu.CommitTracker.<init> Soft AutoCommit: disabled
[junit4] 2> 3345961 T12264 oass.SolrIndexSearcher.<init> Opening Searcher@6760d53e[collection1] main
[junit4] 2> 3345962 T12264 oasr.ManagedResourceStorage$FileStorageIO.configure File-based storage initialized to use dir: /Users/jenkins/workspace/Lucene-Solr-trunk-MacOSX/solr/core/src/test-files/solr/collection1/conf
[junit4] 2> 3345962 T12264 oasr.RestManager.init Initializing RestManager with initArgs: {storageDir=/Users/jenkins/workspace/Lucene-Solr-trunk-MacOSX/solr/core/src/test-files/solr/collection1/conf/}
[junit4] 2> 3345963 T12264 oasr.ManagedResourceStorage.load Reading _rest_managed.json using file:dir=/Users/jenkins/workspace/Lucene-Solr-trunk-MacOSX/solr/core/src/test-files/solr/collection1/conf
[junit4] 2> 3345963 T12264 oasr.ManagedResource.reloadFromStorage WARN No stored data found for /rest/managed
[junit4] 2> 3345964 T12264 oasr.ManagedResource.notifyObserversDuringInit WARN No registered observers for /rest/managed
[junit4] 2> 3345964 T12264 oasr.RestManager.init Initializing 0 registered ManagedResources
[junit4] 2> 3345965 T12271 oasc.SolrCore.registerSearcher [collection1] Registered new searcher Searcher@6760d53e[collection1] main{StandardDirectoryReader(segments_7:14 _4(5.0):C1)}
[junit4] 2> 3345966 T12264 oasu.DefaultSolrCoreState.newIndexWriter Creating new IndexWriter...
[junit4] 2> 3345966 T12264 oasu.DefaultSolrCoreState.newIndexWriter Waiting until IndexWriter is unused... core=collection1
[junit4] 2> 3345966 T12264 oasu.DefaultSolrCoreState.newIndexWriter Closing old IndexWriter... core=collection1
[junit4] 2> 3345973 T12264 oasc.SolrDeletionPolicy.onInit SolrDeletionPolicy.onInit: commits: num=1
[junit4] 2> commit{dir=/Users/jenkins/workspace/Lucene-Solr-trunk-MacOSX/solr/build/solr-core/test/J0/solr.core.TestNonNRTOpen-AEEA33790E83F9B6-001/init-core-data-001/index,segFN=segments_7,generation=7}
[junit4] 2> 3345974 T12264 oasc.SolrDeletionPolicy.updateCommits newest commit generation = 7
[junit4] 2> 3345974 T12264 oasu.DefaultSolrCoreState.newIndexWriter New IndexWriter is ready to be used.
[junit4] 2> 3345976 T12264 oasc.SolrCore.openNewSearcher SolrIndexSearcher has not changed - not re-opening: org.apache.solr.search.SolrIndexSearcher
[junit4] 2> 3345976 T12264 oasc.CoreContainer.registerCore replacing core: collection1
[junit4] 2> 3345977 T12264 oasc.SolrCore.close [collection1] CLOSING SolrCore org.apache.solr.core.SolrCore@5f1ed6d6
[junit4] 2> 3345977 T12264 oasu.DirectUpdateHandler2.close closing DirectUpdateHandler2{commits=5,autocommits=0,soft autocommits=0,optimizes=1,rollbacks=0,expungeDeletes=0,docsPending=0,adds=0,deletesById=0,deletesByQuery=0,errors=0,cumulative_adds=5,cumulative_deletesById=0,cumulative_deletesByQuery=3,cumulative_errors=0}
[junit4] 2> 3345978 T12264 oasc.SolrCore.closeSearcher [collection1] Closing main searcher on request.
[junit4] 2> 3345978 T12264 oasc.TestNonNRTOpen.assertNotNRT Checking notNRT & maxDoc=1 of core=org.apache.solr.core.SolrCore@6acf0c17
[junit4] 2> ASYNC NEW_CORE C2251 name=collection1 org.apache.solr.core.SolrCore@6acf0c17
[junit4] 2> 3345981 T12264 C2251 oasup.LogUpdateProcessor.finish [collection1] webapp=null path=null params={} {add=[(null)]} 0 1
[junit4] 2> 3345982 T12264 C2251 oasu.DirectUpdateHandler2.commit start commit{,optimize=false,openSearcher=true,waitSearcher=true,expungeDeletes=false,softCommit=false,prepareCommit=false}
[junit4] 2> 3346004 T12264 C2251 oasc.SolrDeletionPolicy.onCommit SolrDeletionPolicy.onCommit: commits: num=2
[junit4] 2> commit{dir=/Users/jenkins/workspace/Lucene-Solr-trunk-MacOSX/solr/build/solr-core/test/J0/solr.core.TestNonNRTOpen-AEEA33790E83F9B6-001/init-core-data-001/index,segFN=segments_7,generation=7}
[junit4] 2> commit{dir=/Users/jenkins/workspace/Lucene-Solr-trunk-MacOSX/solr/build/solr-core/test/J0/solr.core.TestNonNRTOpen-AEEA33790E83F9B6-001/init-core-data-001/index,segFN=segments_8,generation=8}
[junit4] 2> 3346004 T12264 C2251 oasc.SolrDeletionPolicy.updateCommits newest commit generation = 8
[junit4] 2> 3346018 T12264 C2251 oass.SolrIndexSearcher.<init> Opening Searcher@45590438[collection1] main
[junit4] 2> 3346019 T12271 oasc.SolrCore.registerSearcher [collection1] Registered new searcher Searcher@45590438[collection1] main{StandardDirectoryReader(segments_8:16 _4(5.0):C1 _5(5.0):C1)}
[junit4] 2> 3346019 T12264 C2251 oasu.DirectUpdateHandler2.commit end_commit_flush
[junit4] 2> 3346019 T12264 C2251 oasup.LogUpdateProcessor.finish [collection1] webapp=null path=null params={} {commit=} 0 37
[junit4] 2> 3346020 T12264 oasc.TestNonNRTOpen.assertNotNRT Checking notNRT & maxDoc=2 of core=org.apache.solr.core.SolrCore@6acf0c17
[junit4] 2> 3346023 T12264 C2251 oasup.LogUpdateProcessor.finish [collection1] webapp=null path=null params={} {add=[(null)]} 0 2
[junit4] 2> 3346023 T12264 oasc.TestNonNRTOpen.testReaderIsNotNRT Reloading core: org.apache.solr.core.SolrCore@6acf0c17
[junit4] 2> 3346024 T12264 oasc.SolrResourceLoader.<init> new SolrResourceLoader for directory: '/Users/jenkins/workspace/Lucene-Solr-trunk-MacOSX/solr/core/src/test-files/solr/collection1/'
[junit4] 2> 3346025 T12264 oasc.SolrResourceLoader.replaceClassLoader Adding 'file:/Users/jenkins/workspace/Lucene-Solr-trunk-MacOSX/solr/core/src/test-files/solr/collection1/lib/.svn/' to classloader
[junit4] 2> 3346026 T12264 oasc.SolrResourceLoader.replaceClassLoader Adding 'file:/Users/jenkins/workspace/Lucene-Solr-trunk-MacOSX/solr/core/src/test-files/solr/collection1/lib/classes/' to classloader
[junit4] 2> 3346027 T12264 oasc.SolrResourceLoader.replaceClassLoader Adding 'file:/Users/jenkins/workspace/Lucene-Solr-trunk-MacOSX/solr/core/src/test-files/solr/collection1/lib/README' to classloader
[junit4] 2> 3346096 T12264 oasc.SolrConfig.<init> Using Lucene MatchVersion: LUCENE_50
[junit4] 2> 3346104 T12264 oasc.SolrConfig.<init> Loaded SolrConfig: solrconfig-basic.xml
[junit4] 2> 3346108 T12264 oass.IndexSchema.readSchema Reading Solr Schema from schema-minimal.xml
[junit4] 2> 3346112 T12264 oass.IndexSchema.readSchema [collection1] Schema name=minimal
[junit4] 2> 3346118 T12264 oass.IndexSchema.readSchema WARN no uniqueKey specified in schema.
[junit4] 2> 3346120 T12264 oasc.CoreContainer.reload Reloading SolrCore 'collection1' using configuration from instancedir /Users/jenkins/workspace/Lucene-Solr-trunk-MacOSX/solr/core/src/test-files/solr/collection1/
[junit4] 2> 3346120 T12264 oasc.SolrCore.<init> [collection1] Opening new SolrCore at /Users/jenkins/workspace/Lucene-Solr-trunk-MacOSX/solr/core/src/test-files/solr/collection1/, dataDir=/Users/jenkins/workspace/Lucene-Solr-trunk-MacOSX/solr/build/solr-core/test/J0/./solr.core.TestNonNRTOpen-AEEA33790E83F9B6-001/init-core-data-001/
[junit4] 2> 3346121 T12264 oasc.SolrCore.<init> JMX monitoring not detected for core: collection1
[junit4] 2> 3346122 T12264 oasc.SolrCore.getNewIndexDir New index directory detected: old=null new=/Users/jenkins/workspace/Lucene-Solr-trunk-MacOSX/solr/build/solr-core/test/J0/./solr.core.TestNonNRTOpen-AEEA33790E83F9B6-001/init-core-data-001/index/
[junit4] 2> 3346124 T12264 oasc.SolrCore.loadUpdateProcessorChains no updateRequestProcessorChain defined as default, creating implicit default
[junit4] 2> 3346125 T12264 oasc.RequestHandlers.initHandlersFromConfig created standard: solr.StandardRequestHandler
[junit4] 2> 3346126 T12264 oasc.RequestHandlers.initHandlersFromConfig created /update: solr.UpdateRequestHandler
[junit4] 2> 3346134 T12264 oashl.XMLLoader.init xsltCacheLifetimeSeconds=60
[junit4] 2> 3346135 T12264 oasu.CommitTracker.<init> Hard AutoCommit: disabled
[junit4] 2> 3346135 T12264 oasu.CommitTracker.<init> Soft AutoCommit: disabled
[junit4] 2> 3346142 T12264 oass.SolrIndexSearcher.<init> Opening Searcher@57f47266[collection1] main
[junit4] 2> 3346142 T12264 oasr.ManagedResourceStorage$FileStorageIO.configure File-based storage initialized to use dir: /Users/jenkins/workspace/Lucene-Solr-trunk-MacOSX/solr/core/src/test-files/solr/collection1/conf
[junit4] 2> 3346143 T12264 oasr.RestManager.init Initializing RestManager with initArgs: {storageDir=/Users/jenkins/workspace/Lucene-Solr-trunk-MacOSX/solr/core/src/test-files/solr/collection1/conf/}
[junit4] 2> 3346143 T12264 oasr.ManagedResourceStorage.load Reading _rest_managed.json using file:dir=/Users/jenkins/workspace/Lucene-Solr-trunk-MacOSX/solr/core/src/test-files/solr/collection1/conf
[junit4] 2> 3346145 T12264 oasr.ManagedResource.reloadFromStorage WARN No stored data found for /rest/managed
[junit4] 2> 3346145 T12264 oasr.ManagedResource.notifyObserversDuringInit WARN No registered observers for /rest/managed
[junit4] 2> 3346145 T12264 oasr.RestManager.init Initializing 0 registered ManagedResources
[junit4] 2> 3346146 T12272 oasc.SolrCore.registerSearcher [collection1] Registered new searcher Searcher@57f47266[collection1] main{StandardDirectoryReader(segments_8:16 _4(5.0):C1 _5(5.0):C1)}
[junit4] 2> 3346146 T12264 oasu.DefaultSolrCoreState.newIndexWriter Creating new IndexWriter...
[junit4] 2> 3346146 T12264 oasu.DefaultSolrCoreState.newIndexWriter Waiting until IndexWriter is unused... core=collection1
[junit4] 2> 3346147 T12264 oasu.DefaultSolrCoreState.newIndexWriter Closing old IndexWriter... core=collection1
[junit4] 2> 3346164 T12264 oasc.SolrDeletionPolicy.onCommit SolrDeletionPolicy.onCommit: commits: num=2
[junit4] 2> commit{dir=/Users/jenkins/workspace/Lucene-Solr-trunk-MacOSX/solr/build/solr-core/test/J0/solr.core.TestNonNRTOpen-AEEA33790E83F9B6-001/init-core-data-001/index,segFN=segments_8,generation=8}
[junit4] 2> commit{dir=/Users/jenkins/workspace/Lucene-Solr-trunk-MacOSX/solr/build/solr-core/test/J0/solr.core.TestNonNRTOpen-AEEA33790E83F9B6-001/init-core-data-001/index,segFN=segments_9,generation=9}
[junit4] 2> 3346165 T12264 oasc.SolrDeletionPolicy.updateCommits newest commit generation = 9
[junit4] 2> 3346185 T12264 oasc.SolrDeletionPolicy.onInit SolrDeletionPolicy.onInit: commits: num=1
[junit4] 2> commit{dir=/Users/jenkins/workspace/Lucene-Solr-trunk-MacOSX/solr/build/solr-core/test/J0/solr.core.TestNonNRTOpen-AEEA33790E83F9B6-001/init-core-data-001/index,segFN=segments_9,generation=9}
[junit4] 2> 3346185 T12264 oasc.SolrDeletionPolicy.updateCommits newest commit generation = 9
[junit4] 2> 3346186 T12264 oasu.DefaultSolrCoreState.newIndexWriter New IndexWriter is ready to be used.
[junit4] 2> 3346194 T12264 oass.SolrIndexSearcher.<init> Opening Searcher@3d99fa39[collection1] main
[junit4] 2> 3346197 T12264 oasc.CoreContainer.registerCore replacing core: collection1
[junit4] 2> 3346197 T12264 oasc.SolrCore.close [collection1] CLOSING SolrCore org.apache.solr.core.SolrCore@6acf0c17
[junit4] 2> 3346197 T12264 oasu.DirectUpdateHandler2.close closing DirectUpdateHandler2{commits=1,autocommits=0,soft autocommits=0,optimizes=0,rollbacks=0,expungeDeletes=0,docsPending=1,adds=1,deletesById=0,deletesByQuery=0,errors=0,cumulative_adds=2,cumulative_deletesById=0,cumulative_deletesByQuery=0,cumulative_errors=0}
[junit4] 2> 3346198 T12264 oasc.SolrCore.closeSearcher [collection1] Closing main searcher on request.
[junit4] 2> 3346198 T12264 oasc.TestNonNRTOpen.assertNotNRT Checking notNRT & maxDoc=3 of core=org.apache.solr.core.SolrCore@466bd027
[junit4] 2> 3346199 T12264 oas.SolrTestCaseJ4.tearDown ###Ending testReaderIsNotNRT
[junit4] 2> 3346204 T12272 oasc.SolrCore.registerSearcher [collection1] Registered new searcher Searcher@3d99fa39[collection1] main{StandardDirectoryReader(segments_9:18 _4(5.0):C1 _5(5.0):C1 _6(5.0):C1)}
[junit4] 2> NOTE: reproduce with: ant test -Dtestcase=TestNonNRTOpen -Dtests.method=testReaderIsNotNRT -Dtests.seed=AEEA33790E83F9B6 -Dtests.slow=true -Dtests.locale=en -Dtests.timezone=Africa/Lome -Dtests.file.encoding=UTF-8
[junit4] FAILURE 0.43s | TestNonNRTOpen.testReaderIsNotNRT <<<
[junit4] > Throwable #1: java.lang.AssertionError: SOLR-5815? : wrong maxDoc: core=org.apache.solr.core.SolrCore@466bd027 searcher=Searcher@57f47266[collection1] main{StandardDirectoryReader(segments_8:16 _4(5.0):C1 _5(5.0):C1)} expected:<3> but was:<2>
[junit4] > at __randomizedtesting.SeedInfo.seed([AEEA33790E83F9B6:1B6C52FEB1424B42]:0)
[junit4] > at org.apache.solr.core.TestNonNRTOpen.assertNotNRT(TestNonNRTOpen.java:142)
[junit4] > at org.apache.solr.core.TestNonNRTOpen.testReaderIsNotNRT(TestNonNRTOpen.java:100)
[junit4] > at java.lang.Thread.run(Thread.java:744)
[junit4] 2> 3346218 T12264 oas.SolrTestCaseJ4.deleteCore ###deleteCore
[junit4] 2> 3346218 T12264 oasc.CoreContainer.shutdown Shutting down CoreContainer instance=907117865
[junit4] 2> 3346219 T12264 oasc.SolrCore.close [collection1] CLOSING SolrCore org.apache.solr.core.SolrCore@466bd027
[junit4] 2> 3346219 T12264 oasu.DirectUpdateHandler2.close closing DirectUpdateHandler2{commits=0,autocommits=0,soft autocommits=0,optimizes=0,rollbacks=0,expungeDeletes=0,docsPending=0,adds=0,deletesById=0,deletesByQuery=0,errors=0,cumulative_adds=0,cumulative_deletesById=0,cumulative_deletesByQuery=0,cumulative_errors=0}
[junit4] 2> 3346219 T12264 oasu.SolrCoreState.decrefSolrCoreState Closing SolrCoreState
[junit4] 2> 3346220 T12264 oasu.DefaultSolrCoreState.closeIndexWriter SolrCoreState ref count has reached 0 - closing IndexWriter
[junit4] 2> 3346220 T12264 oasu.DefaultSolrCoreState.closeIndexWriter closing IndexWriter with IndexWriterCloser
[junit4] 2> 3346231 T12264 oasc.SolrCore.closeSearcher [collection1] Closing main searcher on request.
[junit4] 2> 3346232 T12264 oasc.CachingDirectoryFactory.close Closing StandardDirectoryFactory - 2 directories currently being tracked
[junit4] 2> 3346233 T12264 oasc.CachingDirectoryFactory.closeCacheValue looking to close /Users/jenkins/workspace/Lucene-Solr-trunk-MacOSX/solr/build/solr-core/test/J0/solr.core.TestNonNRTOpen-AEEA33790E83F9B6-001/init-core-data-001/index [CachedDir<<refCount=0;path=/Users/jenkins/workspace/Lucene-Solr-trunk-MacOSX/solr/build/solr-core/test/J0/solr.core.TestNonNRTOpen-AEEA33790E83F9B6-001/init-core-data-001/index;done=false>>]
[junit4] 2> 3346234 T12264 oasc.CachingDirectoryFactory.close Closing directory: /Users/jenkins/workspace/Lucene-Solr-trunk-MacOSX/solr/build/solr-core/test/J0/solr.core.TestNonNRTOpen-AEEA33790E83F9B6-001/init-core-data-001/index
[junit4] 2> 3346234 T12264 oasc.CachingDirectoryFactory.closeCacheValue looking to close /Users/jenkins/workspace/Lucene-Solr-trunk-MacOSX/solr/build/solr-core/test/J0/solr.core.TestNonNRTOpen-AEEA33790E83F9B6-001/init-core-data-001 [CachedDir<<refCount=0;path=/Users/jenkins/workspace/Lucene-Solr-trunk-MacOSX/solr/build/solr-core/test/J0/solr.core.TestNonNRTOpen-AEEA33790E83F9B6-001/init-core-data-001;done=false>>]
[junit4] 2> 3346235 T12264 oasc.CachingDirectoryFactory.close Closing directory: /Users/jenkins/workspace/Lucene-Solr-trunk-MacOSX/solr/build/solr-core/test/J0/solr.core.TestNonNRTOpen-AEEA33790E83F9B6-001/init-core-data-001
[junit4] 2> NOTE: leaving temporary files on disk at: /Users/jenkins/workspace/Lucene-Solr-trunk-MacOSX/solr/build/solr-core/test/J0/./solr.core.TestNonNRTOpen-AEEA33790E83F9B6-001
[junit4] 2> NOTE: test params are: codec=Lucene41, sim=RandomSimilarityProvider(queryNorm=true,coord=yes): {}, locale=en, timezone=Africa/Lome
[junit4] 2> NOTE: Mac OS X 10.8.5 x86_64/Oracle Corporation 1.8.0 (64-bit)/cpus=2,threads=1,free=113270848,total=536870912
[junit4] 2> NOTE: All tests run in this JVM: [TestRequestStatusCollectionAPI, ReturnFieldsTest, UnloadDistributedZkTest, HdfsCollectionsAPIDistributedZkTest, SimpleFacetsTest, RemoteQueryErrorTest, TestAnalyzedSuggestions, TestSolrDeletionPolicy1, TestSolr4Spatial, TestSolrQueryParser, ZkCLITest, TestPartialUpdateDeduplication, TestIndexingPerformance, CurrencyFieldOpenExchangeTest, TestSolrXmlPersistence, TestDocBasedVersionConstraints, UUIDFieldTest, DateMathParserTest, TestCopyFieldCollectionResource, DistribCursorPagingTest, CacheHeaderTest, TestSurroundQueryParser, QueryResultKeyTest, FullSolrCloudDistribCmdsTest, ShardRoutingCustomTest, TestSerializedLuceneMatchVersion, DirectSolrSpellCheckerTest, TestBinaryField, TermVectorComponentTest, TestRestManager, TestLRUCache, TestAddFieldRealTimeGet, TestWriterPerf, SoftAutoCommitTest, SuggestComponentTest, DistributedTermsComponentTest, TestClassNameShortening, FieldFacetTest, DistributedExpandComponentTest, UniqFieldsUpdateProcessorFactoryTest, SearchHandlerTest, InfoHandlerTest, TestCollectionAPI, SliceStateUpdateTest, TestMultiCoreConfBootstrap, TestQueryUtils, HdfsSyncSliceTest, TestSchemaVersionResource, LeaderElectionTest, TestInfoStreamLogging, TestHighFrequencyDictionaryFactory, TestSimpleQParserPlugin, TestFastLRUCache, ZkControllerTest, SpatialFilterTest, TestFieldTypeCollectionResource, TestFileDictionaryLookup, TestBadConfig, TestSolrJ, DocValuesTest, SyncSliceTest, CursorMarkTest, CoreMergeIndexesAdminHandlerTest, TestDistributedSearch, MinimalSchemaTest, TestLFUCache, TestDynamicFieldCollectionResource, TestSolrXMLSerializer, ModifyConfFileTest, PathHierarchyTokenizerFactoryTest, PreAnalyzedUpdateProcessorTest, CurrencyFieldXmlFileTest, CopyFieldTest, RequiredFieldsTest, TestShardHandlerFactory, TestPseudoReturnFields, UpdateRequestProcessorFactoryTest, TestPhraseSuggestions, DefaultValueUpdateProcessorTest, AlternateDirectoryTest, ConvertedLegacyTest, TestSolrXmlPersistor, SpellCheckCollatorTest, DirectUpdateHandlerTest, TestSort, TestTrie, TestSolrQueryParserDefaultOperatorResource, LoggingHandlerTest, TestStressVersions, TestManagedSchema, TestSystemIdResolver, SolrRequestParserTest, DocValuesMissingTest, TestComponentsName, TestQuerySenderNoQuery, TestLMJelinekMercerSimilarityFactory, TestPHPSerializedResponseWriter, SuggesterTSTTest, RecoveryZkTest, TestSolrIndexConfig, TestNRTOpen, ScriptEngineTest, NoFacetTest, SSLMigrationTest, ChaosMonkeyNothingIsSafeTest, TestIndexSearcher, EnumFieldTest, TestManagedResourceStorage, HardAutoCommitTest, SolrIndexConfigTest, TestUniqueKeyFieldResource, TestFastOutputStream, TestDistributedMissingSort, XmlUpdateRequestHandlerTest, HdfsChaosMonkeySafeLeaderTest, TestRandomMergePolicy, TestFoldingMultitermQuery, TestSchemaResource, DocumentAnalysisRequestHandlerTest, SchemaVersionSpecificBehaviorTest, DeleteShardTest, RegexBoostProcessorTest, TestExceedMaxTermLength, PreAnalyzedFieldTest, LeaderElectionIntegrationTest, OpenCloseCoreStressTest, TestCSVLoader, TestUtils, QueryParsingTest, PrimUtilsTest, AssignTest, ClusterStateTest, SolrCoreTest, HighlighterConfigTest, SystemInfoHandlerTest, TestHighlightDedupGrouping, CSVRequestHandlerTest, TestCSVResponseWriter, CollectionsAPIDistributedZkTest, TestConfig, TestFieldSortValues, TestCloudManagedSchema, TestLuceneMatchVersion, PolyFieldTest, TestFreeTextSuggestions, TestImplicitCoreProperties, TestQuerySenderListener, DebugComponentTest, ResourceLoaderTest, TestCollationFieldDocValues, TestValueSourceCache, TestCoreContainer, ClusterStateUpdateTest, TestUpdate, BlockDirectoryTest, TestArbitraryIndexDir, ParsingFieldUpdateProcessorsTest, TestAtomicUpdateErrorCases, TestManagedSynonymFilterFactory, TestHashPartitioner, FastVectorHighlighterTest, SuggesterWFSTTest, DirectSolrConnectionTest, FieldMutatingUpdateProcessorTest, PluginInfoTest, TestCollapseQParserPlugin, SolrIndexSplitterTest, DistributedQueryComponentCustomSortTest, CoreAdminRequestStatusTest, FieldAnalysisRequestHandlerTest, TestCollationField, TestNonDefinedSimilarityFactory, WordBreakSolrSpellCheckerTest, AddSchemaFieldsUpdateProcessorFactoryTest, HdfsUnloadDistributedZkTest, TestRangeQuery, SolrInfoMBeanTest, NotRequiredUniqueKeyTest, TestSolrXml, SolrCoreCheckLockOnStartupTest, TestReplicationHandler, TestFunctionQuery, HdfsBasicDistributedZk2Test, BasicDistributedZk2Test, TestRTGBase, SignatureUpdateProcessorFactoryTest, TestWordDelimiterFilterFactory, XsltUpdateRequestHandlerTest, BlockCacheTest, ZkSolrClientTest, ConnectionManagerTest, TimeZoneUtilsTest, TestExpandComponent, TestCloudManagedSchemaAddField, BasicDistributedZkTest, ChaosMonkeySafeLeaderTest, OverseerTest, ShardRoutingTest, BasicZkTest, TestRandomFaceting, TestZkChroot, TestRandomDVFaceting, AutoCommitTest, TestDistributedGrouping, TestFaceting, TestRecovery, DistributedSpellCheckComponentTest, TermVectorComponentDistributedTest, TestRealTimeGet, TestStressReorder, TestJoin, TestReload, StatsComponentTest, SpellCheckComponentTest, TestGroupingSearch, SolrCmdDistributorTest, QueryElevationComponentTest, PeerSyncTest, BadIndexSchemaTest, TestFiltering, BasicFunctionalityTest, TestLazyCores, OverseerCollectionProcessorTest, HighlighterTest, ShowFileRequestHandlerTest, DistributedQueryElevationComponentTest, SimplePostToolTest, TestCoreDiscovery, AnalysisAfterCoreReloadTest, TestExtendedDismaxParser, SuggesterFSTTest, CoreAdminHandlerTest, SuggesterTest, TestStressLucene, NoCacheHeaderTest, QueryEqualityTest, DirectUpdateHandlerOptimizeTest, StatelessScriptUpdateProcessorFactoryTest, SortByFunctionTest, TestRemoteStreaming, DocValuesMultiTest, DistanceFunctionTest, IndexBasedSpellCheckerTest, LukeRequestHandlerTest, DisMaxRequestHandlerTest, StandardRequestHandlerTest, TestReversedWildcardFilterFactory, TestQueryTypes, PrimitiveFieldTypeTest, TestOmitPositions, FileBasedSpellCheckerTest, TermsComponentTest, RequestHandlersTest, DocumentBuilderTest, MoreLikeThisHandlerTest, IndexSchemaRuntimeFieldTest, SolrPluginUtilsTest, IndexSchemaTest, TestJmxIntegration, JSONWriterTest, MBeansHandlerTest, JsonLoaderTest, BinaryUpdateRequestHandlerTest, PingRequestHandlerTest, CoreContainerCoreInitFailuresTest, TestBinaryResponseWriter, SOLR749Test, UpdateParamsTest, ResponseLogComponentTest, BadComponentTest, TestStressRecovery, TestMergePolicyConfig, TestSolrDeletionPolicy2, MultiTermTest, SampleTest, TestDocSet, TestSearchPerf, NumericFieldsTest, TestElisionMultitermQuery, OutputWriterTest, TestFuzzyAnalyzedSuggestions, ExternalFileFieldSortTest, TestSolrCoreProperties, TestPostingsSolrHighlighter, SpellPossibilityIteratorTest, TestCharFilters, TestCodecSupport, SynonymTokenizerTest, TestXIncludeConfig, EchoParamsTest, TestSweetSpotSimilarityFactory, TestDFRSimilarityFactory, TestPerFieldSimilarity, TestLMDirichletSimilarityFactory, TestIBSimilarityFactory, TestBM25SimilarityFactory, TestDefaultSimilarityFactory, TestFastWriter, LegacyHTMLStripCharFilterTest, TestJmxMonitoredMap, OpenExchangeRatesOrgProviderTest, URLClassifyProcessorTest, TestSuggestSpellingConverter, DateFieldTest, SpellingQueryConverterTest, DOMUtilTest, RAMDirectoryFactoryTest, TestDocumentBuilder, ZkNodePropsTest, SliceStateTest, FileUtilsTest, CircularListTest, CursorPagingTest, SolrTestCaseJ4Test, TestCursorMarkWithoutUniqueKey, AbstractAnalyticsStatsTest, ExpressionTest, AbstractAnalyticsFacetTest, FieldFacetExtrasTest, QueryFacetTest, RangeFacetTest, FunctionTest, AliasIntegrationTest, AsyncMigrateRouteKeyTest, CollectionsAPIAsyncDistributedZkTest, CustomCollectionTest, DeleteInactiveReplicaTest, DeleteReplicaTest, DistribDocExpirationUpdateProcessorTest, MigrateRouteKeyTest, OverseerRolesTest, OverseerStatusTest, ShardSplitTest, SolrXmlInZkTest, TestDistribDocBasedVersion, TestMiniSolrCloudCluster, TestModifyConfFiles, TestShortCircuitedRequests, TriLevelCompositeIdRoutingTest, HdfsBasicDistributedZkTest, HdfsRecoveryZkTest, HdfsWriteToMultipleCollectionsTest, StressHdfsTest, CachingDirectoryFactoryTest, TestConfigSets, TestNonNRTOpen]
[junit4] Completed in 1.27s, 2 tests, 1 failure <<< FAILURES!
[...truncated 120 lines...]
BUILD FAILED
/Users/jenkins/workspace/Lucene-Solr-trunk-MacOSX/build.xml:467: The following error occurred while executing this line:
/Users/jenkins/workspace/Lucene-Solr-trunk-MacOSX/build.xml:447: The following error occurred while executing this line:
/Users/jenkins/workspace/Lucene-Solr-trunk-MacOSX/build.xml:45: The following error occurred while executing this line:
/Users/jenkins/workspace/Lucene-Solr-trunk-MacOSX/extra-targets.xml:37: The following error occurred while executing this line:
/Users/jenkins/workspace/Lucene-Solr-trunk-MacOSX/solr/build.xml:189: The following error occurred while executing this line:
/Users/jenkins/workspace/Lucene-Solr-trunk-MacOSX/solr/common-build.xml:496: The following error occurred while executing this line:
/Users/jenkins/workspace/Lucene-Solr-trunk-MacOSX/lucene/common-build.xml:1281: The following error occurred while executing this line:
/Users/jenkins/workspace/Lucene-Solr-trunk-MacOSX/lucene/common-build.xml:907: There were test failures: 396 suites, 1662 tests, 1 failure, 42 ignored (15 assumptions)
Total time: 93 minutes 48 seconds
Build step 'Invoke Ant' marked build as failure
Description set: Java: 64bit/jdk1.8.0 -XX:+UseCompressedOops -XX:+UseG1GC
Archiving artifacts
Recording test results
Email was triggered for: Failure
Sending email for trigger: Failure