You are viewing a plain text version of this content. The canonical link for it is here.
Posted to builds@lucene.apache.org by Apache Jenkins Server <je...@builds.apache.org> on 2025/01/09 22:59:08 UTC
[JENKINS] Lucene » Lucene-Check-main - Build # 11863 - Unstable!
Build: https://ci-builds.apache.org/job/Lucene/job/Lucene-Check-main/11863/
1 tests failed.
FAILED: org.apache.lucene.misc.index.TestBPReorderingMergePolicy.testReorderOnAddIndexes
Error Message:
org.apache.lucene.index.CheckIndex$CheckIndexException: Field "vector" has repeated neighbors of node 8064 with value 8090
Stack Trace:
org.apache.lucene.index.CheckIndex$CheckIndexException: Field "vector" has repeated neighbors of node 8064 with value 8090
at __randomizedtesting.SeedInfo.seed([3E5ADB63D1B2A79B:2F71148DD8D17A2B]:0)
at app/org.apache.lucene.core@11.0.0-SNAPSHOT/org.apache.lucene.index.CheckIndex.testHnswGraph(CheckIndex.java:2931)
at app/org.apache.lucene.core@11.0.0-SNAPSHOT/org.apache.lucene.index.CheckIndex.testHnswGraphs(CheckIndex.java:2806)
at app/org.apache.lucene.core@11.0.0-SNAPSHOT/org.apache.lucene.index.CheckIndex.testSegment(CheckIndex.java:1125)
at app/org.apache.lucene.core@11.0.0-SNAPSHOT/org.apache.lucene.index.CheckIndex.checkIndex(CheckIndex.java:822)
at app/org.apache.lucene.core@11.0.0-SNAPSHOT/org.apache.lucene.index.CheckIndex.checkIndex(CheckIndex.java:592)
at app/org.apache.lucene.test_framework@11.0.0-SNAPSHOT/org.apache.lucene.tests.util.TestUtil.checkIndex(TestUtil.java:338)
at app/org.apache.lucene.test_framework@11.0.0-SNAPSHOT/org.apache.lucene.tests.store.MockDirectoryWrapper.close(MockDirectoryWrapper.java:921)
at app/org.apache.lucene.core@11.0.0-SNAPSHOT/org.apache.lucene.util.IOUtils.close(IOUtils.java:85)
at app/org.apache.lucene.core@11.0.0-SNAPSHOT/org.apache.lucene.util.IOUtils.close(IOUtils.java:72)
at app//org.apache.lucene.misc.index.TestBPReorderingMergePolicy.testReorderOnAddIndexes(TestBPReorderingMergePolicy.java:241)
at java.base@21.0.3/jdk.internal.reflect.DirectMethodHandleAccessor.invoke(DirectMethodHandleAccessor.java:103)
at java.base@21.0.3/java.lang.reflect.Method.invoke(Method.java:580)
at app/randomizedtesting.runner@2.8.1/com.carrotsearch.randomizedtesting.RandomizedRunner.invoke(RandomizedRunner.java:1758)
at app/randomizedtesting.runner@2.8.1/com.carrotsearch.randomizedtesting.RandomizedRunner$8.evaluate(RandomizedRunner.java:946)
at app/randomizedtesting.runner@2.8.1/com.carrotsearch.randomizedtesting.RandomizedRunner$9.evaluate(RandomizedRunner.java:982)
at app/randomizedtesting.runner@2.8.1/com.carrotsearch.randomizedtesting.RandomizedRunner$10.evaluate(RandomizedRunner.java:996)
at app/org.apache.lucene.test_framework@11.0.0-SNAPSHOT/org.apache.lucene.tests.util.TestRuleSetupTeardownChained$1.evaluate(TestRuleSetupTeardownChained.java:48)
at app/org.apache.lucene.test_framework@11.0.0-SNAPSHOT/org.apache.lucene.tests.util.AbstractBeforeAfterRule$1.evaluate(AbstractBeforeAfterRule.java:43)
at app/org.apache.lucene.test_framework@11.0.0-SNAPSHOT/org.apache.lucene.tests.util.TestRuleThreadAndTestName$1.evaluate(TestRuleThreadAndTestName.java:45)
at app/org.apache.lucene.test_framework@11.0.0-SNAPSHOT/org.apache.lucene.tests.util.TestRuleIgnoreAfterMaxFailures$1.evaluate(TestRuleIgnoreAfterMaxFailures.java:60)
at app/org.apache.lucene.test_framework@11.0.0-SNAPSHOT/org.apache.lucene.tests.util.TestRuleMarkFailure$1.evaluate(TestRuleMarkFailure.java:44)
at app/junit@4.13.1/org.junit.rules.RunRules.evaluate(RunRules.java:20)
at app/randomizedtesting.runner@2.8.1/com.carrotsearch.randomizedtesting.rules.StatementAdapter.evaluate(StatementAdapter.java:36)
at app/randomizedtesting.runner@2.8.1/com.carrotsearch.randomizedtesting.ThreadLeakControl$StatementRunner.run(ThreadLeakControl.java:390)
at app/randomizedtesting.runner@2.8.1/com.carrotsearch.randomizedtesting.ThreadLeakControl.forkTimeoutingTask(ThreadLeakControl.java:843)
at app/randomizedtesting.runner@2.8.1/com.carrotsearch.randomizedtesting.ThreadLeakControl$3.evaluate(ThreadLeakControl.java:490)
at app/randomizedtesting.runner@2.8.1/com.carrotsearch.randomizedtesting.RandomizedRunner.runSingleTest(RandomizedRunner.java:955)
at app/randomizedtesting.runner@2.8.1/com.carrotsearch.randomizedtesting.RandomizedRunner$5.evaluate(RandomizedRunner.java:840)
at app/randomizedtesting.runner@2.8.1/com.carrotsearch.randomizedtesting.RandomizedRunner$6.evaluate(RandomizedRunner.java:891)
at app/randomizedtesting.runner@2.8.1/com.carrotsearch.randomizedtesting.RandomizedRunner$7.evaluate(RandomizedRunner.java:902)
at app/org.apache.lucene.test_framework@11.0.0-SNAPSHOT/org.apache.lucene.tests.util.AbstractBeforeAfterRule$1.evaluate(AbstractBeforeAfterRule.java:43)
at app/randomizedtesting.runner@2.8.1/com.carrotsearch.randomizedtesting.rules.StatementAdapter.evaluate(StatementAdapter.java:36)
at app/org.apache.lucene.test_framework@11.0.0-SNAPSHOT/org.apache.lucene.tests.util.TestRuleStoreClassName$1.evaluate(TestRuleStoreClassName.java:38)
at app/randomizedtesting.runner@2.8.1/com.carrotsearch.randomizedtesting.rules.NoShadowingOrOverridesOnMethodsRule$1.evaluate(NoShadowingOrOverridesOnMethodsRule.java:40)
at app/randomizedtesting.runner@2.8.1/com.carrotsearch.randomizedtesting.rules.NoShadowingOrOverridesOnMethodsRule$1.evaluate(NoShadowingOrOverridesOnMethodsRule.java:40)
at app/randomizedtesting.runner@2.8.1/com.carrotsearch.randomizedtesting.rules.StatementAdapter.evaluate(StatementAdapter.java:36)
at app/randomizedtesting.runner@2.8.1/com.carrotsearch.randomizedtesting.rules.StatementAdapter.evaluate(StatementAdapter.java:36)
at app/org.apache.lucene.test_framework@11.0.0-SNAPSHOT/org.apache.lucene.tests.util.TestRuleAssertionsRequired$1.evaluate(TestRuleAssertionsRequired.java:53)
at app/org.apache.lucene.test_framework@11.0.0-SNAPSHOT/org.apache.lucene.tests.util.AbstractBeforeAfterRule$1.evaluate(AbstractBeforeAfterRule.java:43)
at app/org.apache.lucene.test_framework@11.0.0-SNAPSHOT/org.apache.lucene.tests.util.TestRuleMarkFailure$1.evaluate(TestRuleMarkFailure.java:44)
at app/org.apache.lucene.test_framework@11.0.0-SNAPSHOT/org.apache.lucene.tests.util.TestRuleIgnoreAfterMaxFailures$1.evaluate(TestRuleIgnoreAfterMaxFailures.java:60)
at app/org.apache.lucene.test_framework@11.0.0-SNAPSHOT/org.apache.lucene.tests.util.TestRuleIgnoreTestSuites$1.evaluate(TestRuleIgnoreTestSuites.java:47)
at app/junit@4.13.1/org.junit.rules.RunRules.evaluate(RunRules.java:20)
at app/randomizedtesting.runner@2.8.1/com.carrotsearch.randomizedtesting.rules.StatementAdapter.evaluate(StatementAdapter.java:36)
at app/randomizedtesting.runner@2.8.1/com.carrotsearch.randomizedtesting.ThreadLeakControl$StatementRunner.run(ThreadLeakControl.java:390)
at app/randomizedtesting.runner@2.8.1/com.carrotsearch.randomizedtesting.ThreadLeakControl.lambda$forkTimeoutingTask$0(ThreadLeakControl.java:850)
at java.base@21.0.3/java.lang.Thread.run(Thread.java:1583)
Build Log:
[...truncated 1855 lines...]
ERROR: The following test(s) have failed:
- org.apache.lucene.misc.index.TestBPReorderingMergePolicy.testReorderOnAddIndexes (:lucene:misc)
Test output: /home/jenkins/jenkins-slave/workspace/Lucene/Lucene-Check-main/lucene/misc/build/test-results/test/outputs/OUTPUT-org.apache.lucene.misc.index.TestBPReorderingMergePolicy.txt
Reproduce with: gradlew :lucene:misc:test --tests "org.apache.lucene.misc.index.TestBPReorderingMergePolicy.testReorderOnAddIndexes" -Ptests.jvms=4 -Ptests.jvmargs= -Ptests.seed=3E5ADB63D1B2A79B -Ptests.multiplier=2 -Ptests.gui=true -Ptests.file.encoding=ISO-8859-1 -Ptests.vectorsize=128 -Ptests.forceintegervectors=true
Deprecated Gradle features were used in this build, making it incompatible with Gradle 9.0.
You can use '--warning-mode all' to show the individual deprecation warnings and determine if they come from your own scripts or plugins.
For more on this, please refer to https://docs.gradle.org/8.10/userguide/command_line_interface.html#sec:command_line_warnings in the Gradle documentation.
BUILD SUCCESSFUL in 41m 18s
884 actionable tasks: 884 executed
Publishing build scan...
https://ge.apache.org/s/gtldnfbprrjgk
Build step 'Invoke Gradle script' changed build result to SUCCESS
Archiving artifacts
‘**/*.events’ doesn’t match anything: ‘**’ exists but not ‘**/*.events’
No artifacts found that match the file pattern "**/*.events,heapdumps/**,**/hs_err_pid*". Configuration error?
Recording test results
[Checks API] No suitable checks publisher found.
Build step 'Publish JUnit test result report' changed build result to UNSTABLE
Email was triggered for: Unstable (Test Failures)
Sending email for trigger: Unstable (Test Failures)