You are viewing a plain text version of this content. The canonical link for it is here.
Posted to builds@beam.apache.org by Apache Jenkins Server <je...@builds.apache.org> on 2023/01/31 06:09:12 UTC
Build failed in Jenkins: beam_PostCommit_XVR_Spark #4759
See <https://ci-beam.apache.org/job/beam_PostCommit_XVR_Spark/4759/display/redirect?page=changes>
Changes:
[noreply] Standardizing naming and URN for Pubsub Read Schema Transform (#25170)
------------------------------------------
[...truncated 620.67 KB...]
pymongo==3.13.0
PyMySQL==1.0.2
pyparsing==3.0.9
pytest==7.2.1
pytest-forked==1.4.0
pytest-timeout==2.1.0
pytest-xdist==2.5.0
python-dateutil==2.8.2
python-snappy==0.6.1
pytz==2022.7.1
PyYAML==6.0
regex==2022.10.31
requests==2.28.2
requests-mock==1.10.0
requests-oauthlib==1.3.1
rsa==4.9
scikit-learn==1.0.2
scipy==1.7.3
setuptools==67.0.0
six==1.16.0
sortedcontainers==2.4.0
soupsieve==2.3.2.post1
SQLAlchemy==1.4.46
sqlparse==0.4.3
tenacity==5.1.5
tensorboard==2.11.2
tensorboard-data-server==0.6.1
tensorboard-plugin-wit==1.8.1
tensorflow==2.11.0
tensorflow-estimator==2.11.0
tensorflow-io-gcs-filesystem==0.30.0
termcolor==2.2.0
testcontainers==3.7.1
threadpoolctl==3.1.0
tomli==2.0.1
tqdm==4.64.1
typing_extensions==4.4.0
uritemplate==4.1.1
urllib3==1.26.14
websocket-client==1.4.2
Werkzeug==2.2.2
wheel==0.38.4
wrapt==1.14.1
zipp==3.11.0
zstandard==0.19.0
Removing intermediate container 1f3acee81950
---> 031128556703
Step 17/32 : COPY target/LICENSE /opt/apache/beam/
---> ecd206063f37
Step 18/32 : COPY target/LICENSE.python /opt/apache/beam/
---> baa45f1f258c
Step 19/32 : COPY target/NOTICE /opt/apache/beam/
---> 2f0e9c83a04d
Step 20/32 : COPY target/launcher/linux_amd64/boot /opt/apache/beam/
---> 09b617ecb7fb
Step 21/32 : ENTRYPOINT ["/opt/apache/beam/boot"]
---> Running in 64cf141e3dd3
Removing intermediate container 64cf141e3dd3
---> a3e6c64bc421
Step 22/32 : FROM beam as third_party_licenses
---> a3e6c64bc421
Step 23/32 : ARG pull_licenses
---> Running in 50bd56d016f6
Removing intermediate container 50bd56d016f6
---> 8f9b40ba20c1
Step 24/32 : COPY target/license_scripts /tmp/license_scripts/
---> 9ef6839d6d9c
Step 25/32 : COPY target/LICENSE target/go-licenses/* /opt/apache/beam/third_party_licenses/golang/
---> d5a1f136a226
Step 26/32 : RUN rm /opt/apache/beam/third_party_licenses/golang/LICENSE
---> Running in 7de5ab8164d9
Removing intermediate container 7de5ab8164d9
---> bca4ace36a6a
Step 27/32 : COPY target/license_scripts /tmp/license_scripts/
---> be7243d7c04b
Step 28/32 : RUN if [ "$pull_licenses" = "true" ] ; then pip install 'pip-licenses<4.0.0' pyyaml tenacity && python /tmp/license_scripts/pull_licenses_py.py ; fi
---> Running in dccdb2ecf3b3
Collecting pip-licenses<4.0.0
Downloading pip_licenses-3.5.5-py3-none-any.whl (17 kB)
Requirement already satisfied: pyyaml in /usr/local/lib/python3.7/site-packages (6.0)
Requirement already satisfied: tenacity in /usr/local/lib/python3.7/site-packages (5.1.5)
Collecting PTable
Downloading PTable-0.9.2.tar.gz (31 kB)
Preparing metadata (setup.py): started
Preparing metadata (setup.py): finished with status 'done'
Requirement already satisfied: six>=1.9.0 in /usr/local/lib/python3.7/site-packages (from tenacity) (1.16.0)
Building wheels for collected packages: PTable
Building wheel for PTable (setup.py): started
Building wheel for PTable (setup.py): finished with status 'done'
Created wheel for PTable: filename=PTable-0.9.2-py3-none-any.whl size=22908 sha256=b12f2ecb0dbea556d2e204675c9ad80ea0a2a234b2985d2caac932521a5e0262
Stored in directory: /root/.cache/pip/wheels/33/df/2f/674985b3f8a2de3f96357d1eadef5110f74fa91b3785e52a54
Successfully built PTable
Installing collected packages: PTable, pip-licenses
Successfully installed PTable-0.9.2 pip-licenses-3.5.5
[91mWARNING: Running pip as the 'root' user can result in broken permissions and conflicting behaviour with the system package manager. It is recommended to use a virtual environment instead: https://pip.pypa.io/warnings/venv
[0m[91mERROR:root:Error occurred when pull license for flatbuffers from {'license': 'https://raw.githubusercontent.com/google/flatbuffers/master/LICENSE.txt'}.
[0m[91mTraceback (most recent call last):
File "/tmp/license_scripts/pull_licenses_py.py", line 98, in pull_from_url
headers={'User-Agent': 'Apache Beam'}))
File "/usr/local/lib/python3.7/urllib/request.py", line 222, in urlopen
return opener.open(url, data, timeout)
File "/usr/local/lib/python3.7/urllib/request.py", line 531, in open
response = meth(req, response)
File "/usr/local/lib/python3.7/urllib/request.py", line 641, in http_response
'http', request, response, code, msg, hdrs)
File "/usr/local/lib/python3.7/urllib/request.py", line 569, in error
return self._call_chain(*args)
File "/usr/local/lib/python3.7/urllib/request.py", line 503, in _call_chain
result = func(*args)
File "/usr/local/lib/python3.7/urllib/request.py", line 649, in http_error_default
raise HTTPError(req.full_url, code, msg, hdrs, fp)
urllib.error.HTTPError: HTTP Error 404: Not Found
ERROR:root:Error occurred when pull license for flatbuffers from {'license': 'https://raw.githubusercontent.com/google/flatbuffers/master/LICENSE.txt'}.
[0m[91mTraceback (most recent call last):
File "/tmp/license_scripts/pull_licenses_py.py", line 98, in pull_from_url
headers={'User-Agent': 'Apache Beam'}))
File "/usr/local/lib/python3.7/urllib/request.py", line 222, in urlopen
return opener.open(url, data, timeout)
File "/usr/local/lib/python3.7/urllib/request.py", line 531, in open
response = meth(req, response)
File "/usr/local/lib/python3.7/urllib/request.py", line 641, in http_response
'http', request, response, code, msg, hdrs)
File "/usr/local/lib/python3.7/urllib/request.py", line 569, in error
return self._call_chain(*args)
File "/usr/local/lib/python3.7/urllib/request.py", line 503, in _call_chain
result = func(*args)
File "/usr/local/lib/python3.7/urllib/request.py", line 649, in http_error_default
raise HTTPError(req.full_url, code, msg, hdrs, fp)
urllib.error.HTTPError: HTTP Error 404: Not Found
ERROR:root:Error occurred when pull license for flatbuffers from {'license': 'https://raw.githubusercontent.com/google/flatbuffers/master/LICENSE.txt'}.
[0m[91mTraceback (most recent call last):
File "/tmp/license_scripts/pull_licenses_py.py", line 98, in pull_from_url
headers={'User-Agent': 'Apache Beam'}))
File "/usr/local/lib/python3.7/urllib/request.py", line 222, in urlopen
return opener.open(url, data, timeout)
File "/usr/local/lib/python3.7/urllib/request.py", line 531, in open
response = meth(req, response)
File "/usr/local/lib/python3.7/urllib/request.py", line 641, in http_response
'http', request, response, code, msg, hdrs)
File "/usr/local/lib/python3.7/urllib/request.py", line 569, in error
return self._call_chain(*args)
File "/usr/local/lib/python3.7/urllib/request.py", line 503, in _call_chain
result = func(*args)
File "/usr/local/lib/python3.7/urllib/request.py", line 649, in http_error_default
raise HTTPError(req.full_url, code, msg, hdrs, fp)
urllib.error.HTTPError: HTTP Error 404: Not Found
ERROR:root:Error occurred when pull license for flatbuffers from {'license': 'https://raw.githubusercontent.com/google/flatbuffers/master/LICENSE.txt'}.
[0m[91mTraceback (most recent call last):
File "/tmp/license_scripts/pull_licenses_py.py", line 98, in pull_from_url
headers={'User-Agent': 'Apache Beam'}))
File "/usr/local/lib/python3.7/urllib/request.py", line 222, in urlopen
return opener.open(url, data, timeout)
File "/usr/local/lib/python3.7/urllib/request.py", line 531, in open
response = meth(req, response)
File "/usr/local/lib/python3.7/urllib/request.py", line 641, in http_response
'http', request, response, code, msg, hdrs)
File "/usr/local/lib/python3.7/urllib/request.py", line 569, in error
return self._call_chain(*args)
File "/usr/local/lib/python3.7/urllib/request.py", line 503, in _call_chain
result = func(*args)
File "/usr/local/lib/python3.7/urllib/request.py", line 649, in http_error_default
raise HTTPError(req.full_url, code, msg, hdrs, fp)
urllib.error.HTTPError: HTTP Error 404: Not Found
ERROR:root:Error occurred when pull license for flatbuffers from {'license': 'https://raw.githubusercontent.com/google/flatbuffers/master/LICENSE.txt'}.
[0mSkip pulling license for bs4
[91mTraceback (most recent call last):
File "/tmp/license_scripts/pull_licenses_py.py", line 98, in pull_from_url
headers={'User-Agent': 'Apache Beam'}))
File "/usr/local/lib/python3.7/urllib/request.py", line 222, in urlopen
return opener.open(url, data, timeout)
File "/usr/local/lib/python3.7/urllib/request.py", line 531, in open
response = meth(req, response)
File "/usr/local/lib/python3.7/urllib/request.py", line 641, in http_response
'http', request, response, code, msg, hdrs)
File "/usr/local/lib/python3.7/urllib/request.py", line 569, in error
return self._call_chain(*args)
File "/usr/local/lib/python3.7/urllib/request.py", line 503, in _call_chain
result = func(*args)
File "/usr/local/lib/python3.7/urllib/request.py", line 649, in http_error_default
raise HTTPError(req.full_url, code, msg, hdrs, fp)
urllib.error.HTTPError: HTTP Error 404: Not Found
[0m[91mTraceback (most recent call last):
File "/tmp/license_scripts/pull_licenses_py.py", line 176, in <module>
pull_from_url(dep['Name'].lower(), dep_config['pip_dependencies'])):
File "/usr/local/lib/python3.7/site-packages/tenacity/__init__.py", line 293, in wrapped_f
return self.call(f, *args, **kw)
File "/usr/local/lib/python3.7/site-packages/tenacity/__init__.py", line 359, in call
do = self.iter(retry_state=retry_state)
File "/usr/local/lib/python3.7/site-packages/tenacity/__init__.py", line 332, in iter
raise retry_exc.reraise()
File "/usr/local/lib/python3.7/site-packages/tenacity/__init__.py", line 168, in reraise
raise self.last_attempt.result()
File "/usr/local/lib/python3.7/concurrent/futures/_base.py", line 428, in result
return self.__get_result()
File "/usr/local/lib/python3.7/concurrent/futures/_base.py", line 384, in __get_result
raise self._exception
File "/usr/local/lib/python3.7/site-packages/tenacity/__init__.py", line 362, in call
result = fn(*args, **kwargs)
File "/tmp/license_scripts/pull_licenses_py.py", line 98, in pull_from_url
headers={'User-Agent': 'Apache Beam'}))
File "/usr/local/lib/python3.7/urllib/request.py", line 222, in urlopen
return opener.open(url, data, timeout)
File "/usr/local/lib/python3.7/urllib/request.py", line 531, in open
response = meth(req, response)
File "/usr/local/lib/python3.7/urllib/request.py", line 641, in http_response
'http', request, response, code, msg, hdrs)
File "/usr/local/lib/python3.7/urllib/request.py", line 569, in error
return self._call_chain(*args)
File "/usr/local/lib/python3.7/urllib/request.py", line 503, in _call_chain
result = func(*args)
File "/usr/local/lib/python3.7/urllib/request.py", line 649, in http_error_default
raise HTTPError(req.full_url, code, msg, hdrs, fp)
urllib.error.HTTPError: HTTP Error 404: Not Found
[0mThe command '/bin/sh -c if [ "$pull_licenses" = "true" ] ; then pip install 'pip-licenses<4.0.0' pyyaml tenacity && python /tmp/license_scripts/pull_licenses_py.py ; fi' returned a non-zero code: 1
> Task :sdks:python:container:py37:docker FAILED
> Task :runners:spark:2:job-server:sparkJobServerCleanup
Stopping job server pid: 422345.
FAILURE: Build failed with an exception.
* What went wrong:
Execution failed for task ':sdks:python:container:py37:docker'.
> Process 'command 'docker'' finished with non-zero exit value 1
* Try:
> Run with --stacktrace option to get the stack trace.
> Run with --info or --debug option to get more log output.
* Get more help at https://help.gradle.org
Deprecated Gradle features were used in this build, making it incompatible with Gradle 8.0.
You can use '--warning-mode all' to show the individual deprecation warnings and determine if they come from your own scripts or plugins.
See https://docs.gradle.org/7.5.1/userguide/command_line_interface.html#sec:command_line_warnings
Execution optimizations have been disabled for 1 invalid unit(s) of work during this build to ensure correctness.
Please consult deprecation warnings for more details.
BUILD FAILED in 10m 33s
262 actionable tasks: 177 executed, 73 from cache, 12 up-to-date
Publishing build scan...
https://gradle.com/s/acjp2p47lssts
Build step 'Invoke Gradle script' changed build result to FAILURE
Build step 'Invoke Gradle script' marked build as failure
---------------------------------------------------------------------
To unsubscribe, e-mail: builds-unsubscribe@beam.apache.org
For additional commands, e-mail: builds-help@beam.apache.org
Jenkins build is back to normal : beam_PostCommit_XVR_Spark #4762
Posted by Apache Jenkins Server <je...@builds.apache.org>.
See <https://ci-beam.apache.org/job/beam_PostCommit_XVR_Spark/4762/display/redirect?page=changes>
---------------------------------------------------------------------
To unsubscribe, e-mail: builds-unsubscribe@beam.apache.org
For additional commands, e-mail: builds-help@beam.apache.org
Build failed in Jenkins: beam_PostCommit_XVR_Spark #4761
Posted by Apache Jenkins Server <je...@builds.apache.org>.
See <https://ci-beam.apache.org/job/beam_PostCommit_XVR_Spark/4761/display/redirect?page=changes>
Changes:
[noreply] Attempt fix GCPIO_Direct tests timeout (#25209)
------------------------------------------
[...truncated 85.55 KB...]
> Task :sdks:java:extensions:schemaio-expansion-service:spotlessJava FROM-CACHE
> Task :sdks:java:extensions:schemaio-expansion-service:spotlessJavaCheck UP-TO-DATE
> Task :sdks:java:extensions:schemaio-expansion-service:spotlessCheck UP-TO-DATE
> Task :sdks:java:extensions:schemaio-expansion-service:test FROM-CACHE
> Task :sdks:java:extensions:schemaio-expansion-service:check UP-TO-DATE
> Task :sdks:java:extensions:schemaio-expansion-service:build
> Task :sdks:java:testing:kafka-service:createCheckerFrameworkManifest
> Task :sdks:java:testing:kafka-service:compileJava NO-SOURCE
> Task :sdks:java:testing:kafka-service:processResources NO-SOURCE
> Task :sdks:java:testing:kafka-service:classes UP-TO-DATE
> Task :sdks:java:testing:kafka-service:compileTestJava FROM-CACHE
> Task :sdks:java:testing:kafka-service:processTestResources
> Task :sdks:java:testing:kafka-service:testClasses
> Task :sdks:java:io:expansion-service:distTar
> Task :release:go-licenses:py:dockerRun
W0131 17:59:26.029426 35 library.go:101] "golang.org/x/sys/unix" contains non-Go code that can't be inspected for further dependencies:
/go/pkg/mod/golang.org/x/sys@v0.2.0/unix/asm_linux_amd64.s
> Task :sdks:java:testing:kafka-service:buildTestKafkaServiceJar FROM-CACHE
> Task :sdks:java:io:debezium:createCheckerFrameworkManifest
> Task :sdks:java:io:debezium:compileJava FROM-CACHE
> Task :sdks:java:io:debezium:processResources NO-SOURCE
> Task :sdks:java:io:debezium:classes UP-TO-DATE
> Task :sdks:java:io:debezium:jar
> Task :sdks:java:io:debezium:expansion-service:createCheckerFrameworkManifest
> Task :sdks:java:container:pullLicenses
INFO:root:Pulling license for 124 dependencies using 16 threads.
> Task :sdks:java:io:debezium:expansion-service:compileJava NO-SOURCE
> Task :sdks:java:io:debezium:expansion-service:processResources NO-SOURCE
> Task :sdks:java:io:debezium:expansion-service:classes UP-TO-DATE
> Task :sdks:java:io:debezium:expansion-service:jar
> Task :sdks:java:io:debezium:expansion-service:startScripts
> Task :release:go-licenses:go:dockerRun
W0131 17:59:29.079956 31 library.go:101] "golang.org/x/sys/unix" contains non-Go code that can't be inspected for further dependencies:
/go/pkg/mod/golang.org/x/sys@v0.2.0/unix/asm_linux_amd64.s
> Task :sdks:java:io:debezium:expansion-service:distTar
> Task :release:go-licenses:java:dockerRun
W0131 17:59:29.288622 80 library.go:101] "golang.org/x/sys/unix" contains non-Go code that can't be inspected for further dependencies:
/go/pkg/mod/golang.org/x/sys@v0.2.0/unix/asm_linux_amd64.s
> Task :sdks:java:container:pullLicenses
INFO:root:Replaced local file URL with file://<https://ci-beam.apache.org/job/beam_PostCommit_XVR_Spark/ws/src/sdks/java/container/license_scripts/manual_licenses/xz/COPYING> for xz-1.5
INFO:root:pull_licenses_java.py succeed. It took 1.569117 seconds with 16 threads.
> Task :release:go-licenses:py:dockerRun
+ go-licenses csv github.com/apache/beam/sdks/v2/python/container
+ tee /output/licenses/list.csv
> Task :sdks:java:container:java8:copyJavaThirdPartyLicenses
> Task :sdks:java:container:goPrepare UP-TO-DATE
> Task :sdks:python:setupVirtualenv
> Task :sdks:java:io:expansion-service:distZip
> Task :sdks:java:io:expansion-service:compileTestJava NO-SOURCE
> Task :sdks:java:io:expansion-service:processTestResources NO-SOURCE
> Task :sdks:java:io:expansion-service:testClasses UP-TO-DATE
> Task :sdks:java:io:expansion-service:packageTests
> Task :sdks:java:container:goBuild
> Task :sdks:java:io:expansion-service:shadowJar FROM-CACHE
> Task :release:go-licenses:py:dockerRun
W0131 17:59:32.971799 82 library.go:101] "golang.org/x/sys/unix" contains non-Go code that can't be inspected for further dependencies:
/go/pkg/mod/golang.org/x/sys@v0.2.0/unix/asm_linux_amd64.s
> Task :sdks:java:container:java8:copySdkHarnessLauncher
Execution optimizations have been disabled for task ':sdks:java:container:java8:copySdkHarnessLauncher' to ensure correctness due to the following reasons:
- Gradle detected a problem with the following location: '<https://ci-beam.apache.org/job/beam_PostCommit_XVR_Spark/ws/src/sdks/java/container/build/target'.> Reason: Task ':sdks:java:container:java8:copySdkHarnessLauncher' uses this output of task ':sdks:java:container:downloadCloudProfilerAgent' without declaring an explicit or implicit dependency. This can lead to incorrect results being produced, depending on what order the tasks are executed. Please refer to https://docs.gradle.org/7.5.1/userguide/validation_problems.html#implicit_dependency for more details about this problem.
- Gradle detected a problem with the following location: '<https://ci-beam.apache.org/job/beam_PostCommit_XVR_Spark/ws/src/sdks/java/container/build/target'.> Reason: Task ':sdks:java:container:java8:copySdkHarnessLauncher' uses this output of task ':sdks:java:container:pullLicenses' without declaring an explicit or implicit dependency. This can lead to incorrect results being produced, depending on what order the tasks are executed. Please refer to https://docs.gradle.org/7.5.1/userguide/validation_problems.html#implicit_dependency for more details about this problem.
> Task :sdks:java:io:google-cloud-platform:expansion-service:createCheckerFrameworkManifest
> Task :sdks:java:io:google-cloud-platform:expansion-service:compileJava NO-SOURCE
> Task :sdks:java:io:google-cloud-platform:expansion-service:processResources NO-SOURCE
> Task :sdks:java:io:google-cloud-platform:expansion-service:classes UP-TO-DATE
> Task :sdks:java:io:google-cloud-platform:expansion-service:jar
> Task :release:go-licenses:java:dockerRun
+ chmod -R a+w /output/licenses
> Task :sdks:java:io:debezium:expansion-service:distZip
> Task :sdks:java:io:debezium:expansion-service:compileTestJava NO-SOURCE
> Task :sdks:java:io:debezium:expansion-service:processTestResources NO-SOURCE
> Task :sdks:java:io:debezium:expansion-service:testClasses UP-TO-DATE
> Task :sdks:java:io:debezium:expansion-service:packageTests
> Task :sdks:java:io:expansion-service:startShadowScripts
> Task :sdks:java:io:expansion-service:shadowDistTar
> Task :sdks:python:sdist
org/apache/beam/model/interactive/v1/beam_interactive_api.proto:36:1: warning: Import google/protobuf/timestamp.proto is unused.
Writing mypy to org/apache/beam/model/pipeline/v1/external_transforms_pb2.pyi
Writing mypy to org/apache/beam/model/pipeline/v1/beam_runner_api_pb2.pyi
Writing mypy to org/apache/beam/model/pipeline/v1/standard_window_fns_pb2.pyi
Writing mypy to org/apache/beam/model/pipeline/v1/metrics_pb2.pyi
Writing mypy to org/apache/beam/model/pipeline/v1/endpoints_pb2.pyi
Writing mypy to org/apache/beam/model/pipeline/v1/schema_pb2.pyi
Writing mypy to org/apache/beam/model/job_management/v1/beam_artifact_api_pb2.pyi
Writing mypy to org/apache/beam/model/job_management/v1/beam_expansion_api_pb2.pyi
Writing mypy to org/apache/beam/model/job_management/v1/beam_job_api_pb2.pyi
Writing mypy to org/apache/beam/model/fn_execution/v1/beam_provision_api_pb2.pyi
Writing mypy to org/apache/beam/model/fn_execution/v1/beam_fn_api_pb2.pyi
Writing mypy to org/apache/beam/model/interactive/v1/beam_interactive_api_pb2.pyi
<https://ci-beam.apache.org/job/beam_PostCommit_XVR_Spark/ws/src/build/gradleenv/1922375555/lib/python3.7/site-packages/setuptools/dist.py>:534: UserWarning: Normalizing '2.46.0.dev' to '2.46.0.dev0'
warnings.warn(tmpl.format(**locals()))
warning: no files found matching 'README.md'
warning: no files found matching 'NOTICE'
warning: no files found matching 'LICENSE'
warning: no files found matching 'LICENSE.python'
warning: sdist: standard file not found: should have one of README, README.rst, README.txt, README.md
> Task :sdks:java:io:google-cloud-platform:expansion-service:startScripts
> Task :sdks:java:io:debezium:expansion-service:shadowJar FROM-CACHE
> Task :release:go-licenses:py:dockerRun
+ chmod -R a+w /output/licenses
> Task :sdks:java:io:google-cloud-platform:expansion-service:distTar
> Task :release:go-licenses:go:dockerRun
+ go-licenses csv github.com/apache/beam/sdks/v2/go/container
+ tee /output/licenses/list.csv
W0131 17:59:39.511095 81 library.go:101] "golang.org/x/sys/unix" contains non-Go code that can't be inspected for further dependencies:
/go/pkg/mod/golang.org/x/sys@v0.2.0/unix/asm_linux_amd64.s
> Task :sdks:java:io:debezium:expansion-service:startShadowScripts
> Task :sdks:python:container:py37:copyDockerfileDependencies
> Task :sdks:java:io:debezium:expansion-service:shadowDistTar
> Task :sdks:java:io:expansion-service:shadowDistZip
> Task :sdks:java:io:expansion-service:assemble
> Task :sdks:java:io:expansion-service:analyzeClassesDependencies FROM-CACHE
> Task :sdks:java:io:expansion-service:analyzeTestClassesDependencies SKIPPED
> Task :sdks:java:io:expansion-service:analyzeDependencies UP-TO-DATE
> Task :sdks:java:io:expansion-service:checkstyleMain NO-SOURCE
> Task :sdks:java:io:expansion-service:checkstyleTest NO-SOURCE
> Task :sdks:java:io:expansion-service:javadoc NO-SOURCE
> Task :sdks:java:io:expansion-service:spotbugsMain NO-SOURCE
> Task :sdks:java:io:expansion-service:spotbugsTest SKIPPED
> Task :sdks:java:io:expansion-service:spotlessJava FROM-CACHE
> Task :sdks:java:io:expansion-service:spotlessJavaCheck UP-TO-DATE
> Task :sdks:java:io:expansion-service:spotlessCheck UP-TO-DATE
> Task :sdks:java:io:expansion-service:test NO-SOURCE
> Task :sdks:java:io:expansion-service:check UP-TO-DATE
> Task :sdks:java:io:expansion-service:build
> Task :sdks:java:io:debezium:expansion-service:shadowDistZip
> Task :sdks:java:io:debezium:expansion-service:assemble
> Task :sdks:java:io:debezium:expansion-service:analyzeClassesDependencies FROM-CACHE
> Task :sdks:java:io:debezium:expansion-service:analyzeTestClassesDependencies SKIPPED
> Task :sdks:java:io:debezium:expansion-service:analyzeDependencies UP-TO-DATE
> Task :sdks:java:io:debezium:expansion-service:checkstyleMain NO-SOURCE
> Task :sdks:java:io:debezium:expansion-service:checkstyleTest NO-SOURCE
> Task :sdks:java:io:debezium:expansion-service:javadoc NO-SOURCE
> Task :sdks:java:io:debezium:expansion-service:spotbugsMain NO-SOURCE
> Task :sdks:java:io:debezium:expansion-service:spotbugsTest SKIPPED
> Task :sdks:java:io:debezium:expansion-service:spotlessJava FROM-CACHE
> Task :sdks:java:io:debezium:expansion-service:spotlessJavaCheck UP-TO-DATE
> Task :sdks:java:io:debezium:expansion-service:spotlessCheck UP-TO-DATE
> Task :sdks:java:io:debezium:expansion-service:test NO-SOURCE
> Task :sdks:java:io:debezium:expansion-service:check UP-TO-DATE
> Task :sdks:java:io:debezium:expansion-service:build
> Task :release:go-licenses:go:dockerRun
+ chmod -R a+w /output/licenses
> Task :sdks:java:io:google-cloud-platform:expansion-service:distZip
> Task :sdks:java:io:google-cloud-platform:expansion-service:compileTestJava NO-SOURCE
> Task :sdks:java:io:google-cloud-platform:expansion-service:processTestResources NO-SOURCE
> Task :sdks:java:io:google-cloud-platform:expansion-service:testClasses UP-TO-DATE
> Task :sdks:java:io:google-cloud-platform:expansion-service:packageTests
> Task :sdks:java:extensions:sql:expansion-service:shadowJar
> Task :sdks:python:installGcpTest
> Task :release:go-licenses:go:createLicenses
> Task :sdks:go:container:copyGolangLicenses
> Task :sdks:go:container:dockerPrepare
> Task :release:go-licenses:py:createLicenses
> Task :sdks:python:container:py37:copyGolangLicenses
> Task :sdks:python:container:py37:dockerPrepare
> Task :sdks:python:installGcpTest
Using cached wrapt-1.14.1-cp37-cp37m-manylinux_2_5_x86_64.manylinux1_x86_64.manylinux_2_17_x86_64.manylinux2014_x86_64.whl (75 kB)
Collecting docker>=4.0.0
Using cached docker-6.0.1-py3-none-any.whl (147 kB)
Collecting deprecation
Using cached deprecation-2.1.0-py2.py3-none-any.whl (11 kB)
> Task :release:go-licenses:java:createLicenses
> Task :sdks:java:container:java8:copyGolangLicenses
> Task :sdks:java:container:java8:dockerPrepare
> Task :sdks:java:io:google-cloud-platform:expansion-service:shadowJar
> Task :sdks:java:container:java8:docker
> Task :sdks:go:container:docker
> Task :sdks:java:io:google-cloud-platform:expansion-service:startShadowScripts
> Task :sdks:java:io:google-cloud-platform:expansion-service:shadowDistTar
> Task :sdks:java:io:google-cloud-platform:expansion-service:shadowDistZip
> Task :sdks:java:io:google-cloud-platform:expansion-service:assemble
> Task :sdks:java:io:google-cloud-platform:expansion-service:analyzeClassesDependencies
> Task :sdks:java:io:google-cloud-platform:expansion-service:analyzeTestClassesDependencies SKIPPED
> Task :sdks:java:io:google-cloud-platform:expansion-service:analyzeDependencies
> Task :sdks:java:io:google-cloud-platform:expansion-service:checkstyleMain NO-SOURCE
> Task :sdks:java:io:google-cloud-platform:expansion-service:checkstyleTest NO-SOURCE
> Task :sdks:java:io:google-cloud-platform:expansion-service:javadoc NO-SOURCE
> Task :sdks:java:io:google-cloud-platform:expansion-service:spotbugsMain NO-SOURCE
> Task :sdks:java:io:google-cloud-platform:expansion-service:spotbugsTest SKIPPED
> Task :sdks:java:io:google-cloud-platform:expansion-service:spotlessJava FROM-CACHE
> Task :sdks:java:io:google-cloud-platform:expansion-service:spotlessJavaCheck UP-TO-DATE
> Task :sdks:java:io:google-cloud-platform:expansion-service:spotlessCheck UP-TO-DATE
> Task :sdks:java:io:google-cloud-platform:expansion-service:test NO-SOURCE
> Task :sdks:java:io:google-cloud-platform:expansion-service:check
> Task :sdks:java:io:google-cloud-platform:expansion-service:build
> Task :sdks:python:container:py37:docker
The command '/bin/sh -c if [ "$pull_licenses" = "true" ] ; then pip install 'pip-licenses<4.0.0' pyyaml tenacity && python /tmp/license_scripts/pull_licenses_py.py ; fi' returned a non-zero code: 1
> Task :sdks:python:container:py37:docker FAILED
> Task :runners:spark:2:job-server:sparkJobServerCleanup
Stopping job server pid: 969441.
FAILURE: Build failed with an exception.
* What went wrong:
Execution failed for task ':sdks:python:container:py37:docker'.
> Process 'command 'docker'' finished with non-zero exit value 1
* Try:
> Run with --stacktrace option to get the stack trace.
> Run with --info or --debug option to get more log output.
* Get more help at https://help.gradle.org
Deprecated Gradle features were used in this build, making it incompatible with Gradle 8.0.
You can use '--warning-mode all' to show the individual deprecation warnings and determine if they come from your own scripts or plugins.
See https://docs.gradle.org/7.5.1/userguide/command_line_interface.html#sec:command_line_warnings
Execution optimizations have been disabled for 1 invalid unit(s) of work during this build to ensure correctness.
Please consult deprecation warnings for more details.
BUILD FAILED in 11m 52s
262 actionable tasks: 175 executed, 75 from cache, 12 up-to-date
Publishing build scan...
https://gradle.com/s/3k3474f67kfnw
Build step 'Invoke Gradle script' changed build result to FAILURE
Build step 'Invoke Gradle script' marked build as failure
---------------------------------------------------------------------
To unsubscribe, e-mail: builds-unsubscribe@beam.apache.org
For additional commands, e-mail: builds-help@beam.apache.org
Build failed in Jenkins: beam_PostCommit_XVR_Spark #4760
Posted by Apache Jenkins Server <je...@builds.apache.org>.
See <https://ci-beam.apache.org/job/beam_PostCommit_XVR_Spark/4760/display/redirect>
Changes:
------------------------------------------
[...truncated 122.12 KB...]
> Task :sdks:java:io:google-cloud-platform:expansion-service:distZip
> Task :sdks:java:io:google-cloud-platform:expansion-service:compileTestJava NO-SOURCE
> Task :sdks:java:io:google-cloud-platform:expansion-service:processTestResources NO-SOURCE
> Task :sdks:java:io:google-cloud-platform:expansion-service:testClasses UP-TO-DATE
> Task :sdks:java:io:google-cloud-platform:expansion-service:packageTests
> Task :sdks:java:io:google-cloud-platform:expansion-service:shadowJar FROM-CACHE
> Task :sdks:java:io:google-cloud-platform:expansion-service:startShadowScripts
> Task :sdks:java:io:google-cloud-platform:expansion-service:shadowDistTar
> Task :sdks:java:io:google-cloud-platform:expansion-service:shadowDistZip
> Task :sdks:java:io:google-cloud-platform:expansion-service:assemble
> Task :sdks:java:io:google-cloud-platform:expansion-service:analyzeClassesDependencies FROM-CACHE
> Task :sdks:java:io:google-cloud-platform:expansion-service:analyzeTestClassesDependencies SKIPPED
> Task :sdks:java:io:google-cloud-platform:expansion-service:analyzeDependencies UP-TO-DATE
> Task :sdks:java:io:google-cloud-platform:expansion-service:checkstyleMain NO-SOURCE
> Task :sdks:java:io:google-cloud-platform:expansion-service:checkstyleTest NO-SOURCE
> Task :sdks:java:io:google-cloud-platform:expansion-service:javadoc NO-SOURCE
> Task :sdks:java:io:google-cloud-platform:expansion-service:spotbugsMain NO-SOURCE
> Task :sdks:java:io:google-cloud-platform:expansion-service:spotbugsTest SKIPPED
> Task :sdks:java:io:google-cloud-platform:expansion-service:spotlessJava FROM-CACHE
> Task :sdks:java:io:google-cloud-platform:expansion-service:spotlessJavaCheck UP-TO-DATE
> Task :sdks:java:io:google-cloud-platform:expansion-service:spotlessCheck UP-TO-DATE
> Task :sdks:java:io:google-cloud-platform:expansion-service:test NO-SOURCE
> Task :sdks:java:io:google-cloud-platform:expansion-service:check UP-TO-DATE
> Task :sdks:java:io:google-cloud-platform:expansion-service:build
> Task :sdks:python:installGcpTest
> Task :release:go-licenses:java:createLicenses
> Task :sdks:java:container:java8:copyGolangLicenses
> Task :sdks:java:container:java8:dockerPrepare
> Task :release:go-licenses:py:createLicenses
> Task :sdks:python:container:py37:copyGolangLicenses
> Task :sdks:python:installGcpTest
Collecting portalocker<3,>=1.0
Using cached portalocker-2.7.0-py2.py3-none-any.whl (15 kB)
Collecting isodate>=0.6.0
Using cached isodate-0.6.1-py2.py3-none-any.whl (41 kB)
> Task :sdks:python:container:py37:dockerPrepare
> Task :release:go-licenses:go:createLicenses
> Task :sdks:go:container:copyGolangLicenses
> Task :sdks:go:container:dockerPrepare
> Task :sdks:java:container:java8:docker
Sending build context to Docker daemon 65.27MB
Step 1/22 : ARG java_version
Step 2/22 : FROM openjdk:${java_version}-bullseye
---> b273004037cc
Step 3/22 : MAINTAINER "Apache Beam <de...@beam.apache.org>"
> Task :sdks:python:installGcpTest
Requirement already satisfied: py in <https://ci-beam.apache.org/job/beam_PostCommit_XVR_Spark/ws/src/build/gradleenv/1922375555/lib/python3.7/site-packages> (from pytest-forked->pytest-xdist<3,>=2.5.0->apache-beam==2.46.0.dev0) (1.11.0)
> Task :sdks:go:container:docker
> Task :sdks:python:container:py37:docker
Collecting absl-py==1.4.0
Downloading absl_py-1.4.0-py3-none-any.whl (126 kB)
━━━━━━━━━━━━━━━━━━━━━━━━━━━━━━━━━━━━━━━ 126.5/126.5 KB 4.1 MB/s eta 0:00:00
Collecting astunparse==1.6.3
Downloading astunparse-1.6.3-py2.py3-none-any.whl (12 kB)
Collecting attrs==22.2.0
Downloading attrs-22.2.0-py3-none-any.whl (60 kB)
━━━━━━━━━━━━━━━━━━━━━━━━━━━━━━━━━━━━━━━━ 60.0/60.0 KB 9.1 MB/s eta 0:00:00
Collecting beautifulsoup4==4.11.1
Downloading beautifulsoup4-4.11.1-py3-none-any.whl (128 kB)
━━━━━━━━━━━━━━━━━━━━━━━━━━━━━━━━━━━━━━ 128.2/128.2 KB 17.3 MB/s eta 0:00:00
Collecting bs4==0.0.1
Downloading bs4-0.0.1.tar.gz (1.1 kB)
Preparing metadata (setup.py): started
Preparing metadata (setup.py): finished with status 'done'
Collecting cachetools==4.2.4
Downloading cachetools-4.2.4-py3-none-any.whl (10 kB)
Collecting certifi==2022.12.7
Downloading certifi-2022.12.7-py3-none-any.whl (155 kB)
━━━━━━━━━━━━━━━━━━━━━━━━━━━━━━━━━━━━━━ 155.3/155.3 KB 21.3 MB/s eta 0:00:00
Collecting cffi==1.15.1
Downloading cffi-1.15.1-cp37-cp37m-manylinux_2_17_x86_64.manylinux2014_x86_64.whl (427 kB)
━━━━━━━━━━━━━━━━━━━━━━━━━━━━━━━━━━━━━━ 427.9/427.9 KB 20.2 MB/s eta 0:00:00
Collecting charset-normalizer==3.0.1
Downloading charset_normalizer-3.0.1-cp37-cp37m-manylinux_2_17_x86_64.manylinux2014_x86_64.whl (170 kB)
━━━━━━━━━━━━━━━━━━━━━━━━━━━━━━━━━━━━━━ 170.5/170.5 KB 22.8 MB/s eta 0:00:00
Collecting click==8.1.3
Downloading click-8.1.3-py3-none-any.whl (96 kB)
━━━━━━━━━━━━━━━━━━━━━━━━━━━━━━━━━━━━━━━━ 96.6/96.6 KB 14.0 MB/s eta 0:00:00
Collecting cloudpickle==2.2.1
Downloading cloudpickle-2.2.1-py3-none-any.whl (25 kB)
Collecting crcmod==1.7
Downloading crcmod-1.7.tar.gz (89 kB)
━━━━━━━━━━━━━━━━━━━━━━━━━━━━━━━━━━━━━━━━ 89.7/89.7 KB 13.1 MB/s eta 0:00:00
Preparing metadata (setup.py): started
Preparing metadata (setup.py): finished with status 'done'
Collecting cryptography==39.0.0
Downloading cryptography-39.0.0-cp36-abi3-manylinux_2_28_x86_64.whl (4.2 MB)
━━━━━━━━━━━━━━━━━━━━━━━━━━━━━━━━━━━━━━━━ 4.2/4.2 MB 65.9 MB/s eta 0:00:00
Collecting Cython==0.29.33
Downloading Cython-0.29.33-cp37-cp37m-manylinux_2_17_x86_64.manylinux2014_x86_64.manylinux_2_24_x86_64.whl (1.9 MB)
━━━━━━━━━━━━━━━━━━━━━━━━━━━━━━━━━━━━━━━━ 1.9/1.9 MB 62.0 MB/s eta 0:00:00
Collecting deprecation==2.1.0
Downloading deprecation-2.1.0-py2.py3-none-any.whl (11 kB)
Collecting dill==0.3.1.1
Downloading dill-0.3.1.1.tar.gz (151 kB)
━━━━━━━━━━━━━━━━━━━━━━━━━━━━━━━━━━━━━━ 152.0/152.0 KB 19.4 MB/s eta 0:00:00
Preparing metadata (setup.py): started
Preparing metadata (setup.py): finished with status 'done'
Collecting docker==6.0.1
Downloading docker-6.0.1-py3-none-any.whl (147 kB)
━━━━━━━━━━━━━━━━━━━━━━━━━━━━━━━━━━━━━━ 147.5/147.5 KB 20.5 MB/s eta 0:00:00
Collecting docopt==0.6.2
Downloading docopt-0.6.2.tar.gz (25 kB)
Preparing metadata (setup.py): started
Preparing metadata (setup.py): finished with status 'done'
Collecting exceptiongroup==1.1.0
Downloading exceptiongroup-1.1.0-py3-none-any.whl (14 kB)
Collecting execnet==1.9.0
Downloading execnet-1.9.0-py2.py3-none-any.whl (39 kB)
Collecting fastavro==1.7.0
Downloading fastavro-1.7.0-cp37-cp37m-manylinux_2_17_x86_64.manylinux2014_x86_64.whl (2.4 MB)
━━━━━━━━━━━━━━━━━━━━━━━━━━━━━━━━━━━━━━━━ 2.4/2.4 MB 71.0 MB/s eta 0:00:00
Collecting fasteners==0.18
Downloading fasteners-0.18-py3-none-any.whl (18 kB)
Collecting flatbuffers==23.1.21
Downloading flatbuffers-23.1.21-py2.py3-none-any.whl (26 kB)
Collecting freezegun==1.2.2
Downloading freezegun-1.2.2-py3-none-any.whl (17 kB)
Collecting future==0.18.3
Downloading future-0.18.3.tar.gz (840 kB)
━━━━━━━━━━━━━━━━━━━━━━━━━━━━━━━━━━━━━━ 840.9/840.9 KB 46.8 MB/s eta 0:00:00
Preparing metadata (setup.py): started
Preparing metadata (setup.py): finished with status 'done'
Collecting gast==0.4.0
Downloading gast-0.4.0-py3-none-any.whl (9.8 kB)
Collecting google-api-core==2.11.0
Downloading google_api_core-2.11.0-py3-none-any.whl (120 kB)
━━━━━━━━━━━━━━━━━━━━━━━━━━━━━━━━━━━━━━ 120.3/120.3 KB 13.1 MB/s eta 0:00:00
Collecting google-api-python-client==2.74.0
Downloading google_api_python_client-2.74.0-py2.py3-none-any.whl (10.9 MB)
━━━━━━━━━━━━━━━━━━━━━━━━━━━━━━━━━━━━━━━━ 10.9/10.9 MB 75.8 MB/s eta 0:00:00
Collecting google-apitools==0.5.31
Downloading google-apitools-0.5.31.tar.gz (173 kB)
━━━━━━━━━━━━━━━━━━━━━━━━━━━━━━━━━━━━━━ 173.5/173.5 KB 23.7 MB/s eta 0:00:00
Preparing metadata (setup.py): started
Preparing metadata (setup.py): finished with status 'done'
Collecting google-auth==2.16.0
Downloading google_auth-2.16.0-py2.py3-none-any.whl (177 kB)
━━━━━━━━━━━━━━━━━━━━━━━━━━━━━━━━━━━━━━ 177.8/177.8 KB 22.1 MB/s eta 0:00:00
Collecting google-auth-httplib2==0.1.0
Downloading google_auth_httplib2-0.1.0-py2.py3-none-any.whl (9.3 kB)
Collecting google-auth-oauthlib==0.4.6
Downloading google_auth_oauthlib-0.4.6-py2.py3-none-any.whl (18 kB)
Collecting google-cloud-bigquery==3.4.2
Downloading google_cloud_bigquery-3.4.2-py2.py3-none-any.whl (215 kB)
━━━━━━━━━━━━━━━━━━━━━━━━━━━━━━━━━━━━━━ 215.1/215.1 KB 29.6 MB/s eta 0:00:00
Collecting google-cloud-bigquery-storage==2.16.2
Downloading google_cloud_bigquery_storage-2.16.2-py2.py3-none-any.whl (185 kB)
━━━━━━━━━━━━━━━━━━━━━━━━━━━━━━━━━━━━━━ 185.4/185.4 KB 25.5 MB/s eta 0:00:00
Collecting google-cloud-bigtable==1.7.3
Downloading google_cloud_bigtable-1.7.3-py2.py3-none-any.whl (268 kB)
━━━━━━━━━━━━━━━━━━━━━━━━━━━━━━━━━━━━━━ 268.7/268.7 KB 25.5 MB/s eta 0:00:00
Collecting google-cloud-core==2.3.2
Downloading google_cloud_core-2.3.2-py2.py3-none-any.whl (29 kB)
Collecting google-cloud-datastore==1.15.5
Downloading google_cloud_datastore-1.15.5-py2.py3-none-any.whl (134 kB)
━━━━━━━━━━━━━━━━━━━━━━━━━━━━━━━━━━━━━━ 134.2/134.2 KB 18.2 MB/s eta 0:00:00
Collecting google-cloud-dlp==3.11.1
Downloading google_cloud_dlp-3.11.1-py2.py3-none-any.whl (131 kB)
━━━━━━━━━━━━━━━━━━━━━━━━━━━━━━━━━━━━━━ 131.4/131.4 KB 18.1 MB/s eta 0:00:00
Collecting google-cloud-language==1.3.2
Downloading google_cloud_language-1.3.2-py2.py3-none-any.whl (83 kB)
━━━━━━━━━━━━━━━━━━━━━━━━━━━━━━━━━━━━━━━━ 83.6/83.6 KB 12.4 MB/s eta 0:00:00
Collecting google-cloud-profiler==3.1.0
Downloading google-cloud-profiler-3.1.0.tar.gz (34 kB)
Preparing metadata (setup.py): started
Preparing metadata (setup.py): finished with status 'done'
Collecting google-cloud-pubsub==2.14.0
Downloading google_cloud_pubsub-2.14.0-py2.py3-none-any.whl (241 kB)
━━━━━━━━━━━━━━━━━━━━━━━━━━━━━━━━━━━━━━ 241.5/241.5 KB 27.3 MB/s eta 0:00:00
Collecting google-cloud-pubsublite==1.6.0
Downloading google_cloud_pubsublite-1.6.0-py2.py3-none-any.whl (271 kB)
━━━━━━━━━━━━━━━━━━━━━━━━━━━━━━━━━━━━━━ 271.1/271.1 KB 30.4 MB/s eta 0:00:00
Collecting google-cloud-recommendations-ai==0.7.1
Downloading google_cloud_recommendations_ai-0.7.1-py2.py3-none-any.whl (148 kB)
━━━━━━━━━━━━━━━━━━━━━━━━━━━━━━━━━━━━━━ 148.2/148.2 KB 19.1 MB/s eta 0:00:00
Collecting google-cloud-spanner==3.27.0
Downloading google_cloud_spanner-3.27.0-py2.py3-none-any.whl (297 kB)
━━━━━━━━━━━━━━━━━━━━━━━━━━━━━━━━━━━━━━ 297.1/297.1 KB 30.0 MB/s eta 0:00:00
Collecting google-cloud-videointelligence==1.16.3
Downloading google_cloud_videointelligence-1.16.3-py2.py3-none-any.whl (183 kB)
━━━━━━━━━━━━━━━━━━━━━━━━━━━━━━━━━━━━━━ 183.9/183.9 KB 23.0 MB/s eta 0:00:00
Collecting google-cloud-vision==3.3.1
Downloading google_cloud_vision-3.3.1-py2.py3-none-any.whl (393 kB)
━━━━━━━━━━━━━━━━━━━━━━━━━━━━━━━━━━━━━━ 393.5/393.5 KB 36.8 MB/s eta 0:00:00
Collecting google-crc32c==1.5.0
Downloading google_crc32c-1.5.0-cp37-cp37m-manylinux_2_17_x86_64.manylinux2014_x86_64.whl (32 kB)
Collecting google-pasta==0.2.0
Downloading google_pasta-0.2.0-py3-none-any.whl (57 kB)
━━━━━━━━━━━━━━━━━━━━━━━━━━━━━━━━━━━━━━━━ 57.5/57.5 KB 8.8 MB/s eta 0:00:00
Collecting google-resumable-media==2.4.1
Downloading google_resumable_media-2.4.1-py2.py3-none-any.whl (77 kB)
━━━━━━━━━━━━━━━━━━━━━━━━━━━━━━━━━━━━━━━━ 77.7/77.7 KB 11.5 MB/s eta 0:00:00
Collecting googleapis-common-protos==1.58.0
Downloading googleapis_common_protos-1.58.0-py2.py3-none-any.whl (223 kB)
━━━━━━━━━━━━━━━━━━━━━━━━━━━━━━━━━━━━━━ 223.0/223.0 KB 23.3 MB/s eta 0:00:00
Collecting greenlet==2.0.1
Downloading greenlet-2.0.1-cp37-cp37m-manylinux_2_17_x86_64.manylinux2014_x86_64.whl (514 kB)
━━━━━━━━━━━━━━━━━━━━━━━━━━━━━━━━━━━━━━ 514.4/514.4 KB 29.8 MB/s eta 0:00:00
Collecting grpc-google-iam-v1==0.12.6
Downloading grpc_google_iam_v1-0.12.6-py2.py3-none-any.whl (26 kB)
> Task :sdks:python:installGcpTest
Successfully installed PyJWT-2.6.0 apache-beam-2.46.0.dev0 attrs-22.2.0 azure-core-1.26.2 azure-identity-1.12.0 azure-storage-blob-12.14.1 boto3-1.26.60 botocore-1.29.60 cachetools-4.2.4 certifi-2022.12.7 cffi-1.15.1 charset-normalizer-3.0.1 cloudpickle-2.2.1 crcmod-1.7 cryptography-39.0.0 deprecation-2.1.0 dill-0.3.1.1 docker-6.0.1 docopt-0.6.2 exceptiongroup-1.1.0 execnet-1.9.0 fastavro-1.7.1 fasteners-0.18 freezegun-1.2.2 google-api-core-2.11.0 google-apitools-0.5.31 google-auth-2.16.0 google-auth-httplib2-0.1.0 google-cloud-bigquery-3.4.2 google-cloud-bigquery-storage-2.16.2 google-cloud-bigtable-1.7.3 google-cloud-core-2.3.2 google-cloud-datastore-1.15.5 google-cloud-dlp-3.11.1 google-cloud-language-1.3.2 google-cloud-pubsub-2.14.0 google-cloud-pubsublite-1.6.0 google-cloud-recommendations-ai-0.7.1 google-cloud-spanner-3.27.0 google-cloud-videointelligence-1.16.3 google-cloud-vision-3.3.1 google-crc32c-1.5.0 google-resumable-media-2.4.1 googleapis-common-protos-1.58.0 greenlet-2.0.2 grpc-google-iam-v1-0.12.6 grpcio-status-1.48.2 hdfs-2.7.0 httplib2-0.21.0 hypothesis-6.65.2 idna-3.4 iniconfig-2.0.0 isodate-0.6.1 jmespath-1.0.1 joblib-1.2.0 mock-2.0.0 msal-1.20.0 msal-extensions-1.0.0 msrest-0.7.1 oauth2client-4.1.3 oauthlib-3.2.2 objsize-0.6.1 orjson-3.8.5 overrides-6.5.0 pandas-1.3.5 parameterized-0.8.1 pbr-5.11.1 portalocker-2.7.0 proto-plus-1.22.2 psycopg2-binary-2.9.5 pyarrow-9.0.0 pyasn1-0.4.8 pyasn1-modules-0.2.8 pycparser-2.21 pydot-1.4.2 pyhamcrest-1.10.1 pymongo-3.13.0 pymysql-1.0.2 pyparsing-3.0.9 pytest-7.2.1 pytest-forked-1.4.0 pytest-timeout-2.1.0 pytest-xdist-2.5.0 python-dateutil-2.8.2 pytz-2022.7.1 pyyaml-6.0 regex-2022.10.31 requests-2.28.2 requests-oauthlib-1.3.1 requests_mock-1.10.0 rsa-4.9 s3transfer-0.6.0 scikit-learn-1.0.2 scipy-1.7.3 sortedcontainers-2.4.0 sqlalchemy-1.4.46 sqlparse-0.4.3 tenacity-5.1.5 testcontainers-3.7.1 threadpoolctl-3.1.0 tomli-2.0.1 urllib3-1.26.14 websocket-client-1.5.0 wrapt-1.14.1 zstandard-0.19.0
> Task :sdks:python:container:py37:docker
The command '/bin/sh -c if [ "$pull_licenses" = "true" ] ; then pip install 'pip-licenses<4.0.0' pyyaml tenacity && python /tmp/license_scripts/pull_licenses_py.py ; fi' returned a non-zero code: 1
> Task :sdks:python:container:py37:docker FAILED
> Task :runners:spark:2:job-server:sparkJobServerCleanup
Stopping job server pid: 574752.
FAILURE: Build failed with an exception.
* What went wrong:
Execution failed for task ':sdks:python:container:py37:docker'.
> Process 'command 'docker'' finished with non-zero exit value 1
* Try:
> Run with --stacktrace option to get the stack trace.
> Run with --info or --debug option to get more log output.
* Get more help at https://help.gradle.org
Deprecated Gradle features were used in this build, making it incompatible with Gradle 8.0.
You can use '--warning-mode all' to show the individual deprecation warnings and determine if they come from your own scripts or plugins.
See https://docs.gradle.org/7.5.1/userguide/command_line_interface.html#sec:command_line_warnings
Execution optimizations have been disabled for 1 invalid unit(s) of work during this build to ensure correctness.
Please consult deprecation warnings for more details.
BUILD FAILED in 10m 48s
262 actionable tasks: 172 executed, 78 from cache, 12 up-to-date
Publishing build scan...
https://gradle.com/s/rxoj5wpmbvqlk
Build step 'Invoke Gradle script' changed build result to FAILURE
Build step 'Invoke Gradle script' marked build as failure
---------------------------------------------------------------------
To unsubscribe, e-mail: builds-unsubscribe@beam.apache.org
For additional commands, e-mail: builds-help@beam.apache.org