You are viewing a plain text version of this content. The canonical link for it is here.
Posted to builds@cassandra.apache.org by Apache Jenkins Server <je...@builds.apache.org> on 2026/03/20 01:00:38 UTC
Build complete: Cassandra-4.0 #828 [UNSTABLE] c48b9f011d938918c3e20dbd82e7f11bd9155193
-------------------------------------------------------------------------------
Build Cassandra-4.0 #828 Still unstable
URL: https://ci-cassandra.apache.org/job/Cassandra-4.0/828/
-------------------------------------------------------------------------------
Changes:
No changes
-------------------------------------------------------------------------------
Failed Tests:
5 tests failed.
FAILED: dtest.secondary_indexes_test.TestSecondaryIndexes.test_6924_dropping_ks
FAILED: org.apache.cassandra.distributed.upgrade.DropCompactStorageTest.testDropCompactStorage
FAILED: org.apache.cassandra.db.compaction.CompactionTaskTest.testFullyExpiredSSTablesAreNotReleasedPrematurely
FAILED: org.apache.cassandra.distributed.upgrade.MixedModeReadTest.mixedModeReadColumnSubsetDigestCheck
FAILED: org.apache.cassandra.auth.CassandraRoleManagerTest.testPasswordUpdateRateLimitingPerRole-compression
-------------------------------------------------------------------------------
For complete test report and logs see https://nightlies.apache.org/cassandra/Cassandra-4.0/828/