You are viewing a plain text version of this content. The canonical link for it is here.
Posted to dev@pdfbox.apache.org by Apache Jenkins Server <je...@builds.apache.org> on 2026/05/16 15:23:17 UTC
Build failed in Jenkins: PDFBox » PDFBox JBig2 ImageIO Plugin #154
See <https://ci-builds.apache.org/job/PDFBox/job/PDFBox%20JBig2%20ImageIO%20Plugin/154/display/redirect>
Changes:
------------------------------------------
[...truncated 4.79 KiB...]
[INFO] Copying 20 resources from src/test/resources to target/test-classes
[INFO] Copying 3 resources from target/maven-shared-archive-resources to target/test-classes
[INFO]
[INFO] --- compiler:3.14.1:testCompile (default-testCompile) @ jbig2-imageio ---
[INFO] Recompiling the module because of changed dependency.
[INFO] Compiling 31 source files with javac [release 8] to target/test-classes
[INFO] <https://ci-builds.apache.org/job/PDFBox/job/PDFBox%20JBig2%20ImageIO%20Plugin/ws/src/test/java/org/apache/pdfbox/jbig2/ChecksumTest.java>: Some input files use or override a deprecated API.
[INFO] <https://ci-builds.apache.org/job/PDFBox/job/PDFBox%20JBig2%20ImageIO%20Plugin/ws/src/test/java/org/apache/pdfbox/jbig2/ChecksumTest.java>: Recompile with -Xlint:deprecation for details.
[INFO]
[INFO] --- surefire:3.5.4:test (default-test) @ jbig2-imageio ---
[INFO] Using auto detected provider org.apache.maven.surefire.junit4.JUnit4Provider
[INFO]
[INFO] -------------------------------------------------------
[INFO] T E S T S
[INFO] -------------------------------------------------------
[INFO] Running org.apache.pdfbox.jbig2.util.CacheFactoryTest
[INFO] Tests run: 1, Failures: 0, Errors: 0, Skipped: 0, Time elapsed: 0.092 s -- in org.apache.pdfbox.jbig2.util.CacheFactoryTest
[INFO] Running org.apache.pdfbox.jbig2.util.cache.SoftReferenceCacheTest
[INFO] Tests run: 2, Failures: 0, Errors: 0, Skipped: 0, Time elapsed: 4.849 s -- in org.apache.pdfbox.jbig2.util.cache.SoftReferenceCacheTest
[INFO] Running org.apache.pdfbox.jbig2.util.ServiceLookupTest
[INFO] Tests run: 3, Failures: 0, Errors: 0, Skipped: 0, Time elapsed: 0.009 s -- in org.apache.pdfbox.jbig2.util.ServiceLookupTest
[INFO] Running org.apache.pdfbox.jbig2.BitmapTest
[INFO] Tests run: 8, Failures: 0, Errors: 0, Skipped: 0, Time elapsed: 0.006 s -- in org.apache.pdfbox.jbig2.BitmapTest
[INFO] Running org.apache.pdfbox.jbig2.ChecksumTest
[INFO] Tests run: 44, Failures: 0, Errors: 0, Skipped: 0, Time elapsed: 6.646 s -- in org.apache.pdfbox.jbig2.ChecksumTest
[INFO] Running org.apache.pdfbox.jbig2.SerenityTests
[INFO] Tests run: 1, Failures: 0, Errors: 0, Skipped: 0, Time elapsed: 0.959 s -- in org.apache.pdfbox.jbig2.SerenityTests
[INFO] Running org.apache.pdfbox.jbig2.GithubIssuesTest
[INFO] Tests run: 1, Failures: 0, Errors: 0, Skipped: 0, Time elapsed: 0.051 s -- in org.apache.pdfbox.jbig2.GithubIssuesTest
[INFO] Running org.apache.pdfbox.jbig2.JBIG2PageTest
[WARNING] Tests run: 3, Failures: 0, Errors: 0, Skipped: 3, Time elapsed: 0.004 s -- in org.apache.pdfbox.jbig2.JBIG2PageTest
[INFO] Running org.apache.pdfbox.jbig2.decoder.arithmetic.ArithmeticDecoderTest
[INFO] Tests run: 2, Failures: 0, Errors: 0, Skipped: 0, Time elapsed: 0.001 s -- in org.apache.pdfbox.jbig2.decoder.arithmetic.ArithmeticDecoderTest
[INFO] Running org.apache.pdfbox.jbig2.decoder.arithmetic.CXTest
[INFO] Tests run: 10, Failures: 0, Errors: 0, Skipped: 0, Time elapsed: 0.007 s -- in org.apache.pdfbox.jbig2.decoder.arithmetic.CXTest
[INFO] Running org.apache.pdfbox.jbig2.decoder.arithmetic.ArithmeticIntegerDecoderTest
[INFO] Tests run: 1, Failures: 0, Errors: 0, Skipped: 0, Time elapsed: 0.001 s -- in org.apache.pdfbox.jbig2.decoder.arithmetic.ArithmeticIntegerDecoderTest
[INFO] Running org.apache.pdfbox.jbig2.decoder.mmr.MMRDecompressorTest
[INFO] Tests run: 1, Failures: 0, Errors: 0, Skipped: 0, Time elapsed: 0 s -- in org.apache.pdfbox.jbig2.decoder.mmr.MMRDecompressorTest
[INFO] Running org.apache.pdfbox.jbig2.JBIG2ImageReaderTest
[INFO] Tests run: 7, Failures: 0, Errors: 0, Skipped: 0, Time elapsed: 0.275 s -- in org.apache.pdfbox.jbig2.JBIG2ImageReaderTest
[INFO] Running org.apache.pdfbox.jbig2.SlidingBitmapWindowTest
[INFO] Tests run: 15, Failures: 0, Errors: 0, Skipped: 0, Time elapsed: 0.005 s -- in org.apache.pdfbox.jbig2.SlidingBitmapWindowTest
[INFO] Running org.apache.pdfbox.jbig2.image.BitmapsByteCombinationTest
[INFO] Tests run: 5, Failures: 0, Errors: 0, Skipped: 0, Time elapsed: 0.007 s -- in org.apache.pdfbox.jbig2.image.BitmapsByteCombinationTest
[INFO] Running org.apache.pdfbox.jbig2.image.BitmapsBlitTest
[INFO] Tests run: 2, Failures: 0, Errors: 0, Skipped: 0, Time elapsed: 0.146 s -- in org.apache.pdfbox.jbig2.image.BitmapsBlitTest
[INFO] Running org.apache.pdfbox.jbig2.image.BitmapsChecksumTest
[INFO] Tests run: 11, Failures: 0, Errors: 0, Skipped: 0, Time elapsed: 1.448 s -- in org.apache.pdfbox.jbig2.image.BitmapsChecksumTest
[INFO] Running org.apache.pdfbox.jbig2.segments.TextRegionTest
[WARNING] Tests run: 1, Failures: 0, Errors: 0, Skipped: 1, Time elapsed: 0.001 s -- in org.apache.pdfbox.jbig2.segments.TextRegionTest
[INFO] Running org.apache.pdfbox.jbig2.segments.HalftoneRegionTest
[INFO] Tests run: 1, Failures: 0, Errors: 0, Skipped: 0, Time elapsed: 0 s -- in org.apache.pdfbox.jbig2.segments.HalftoneRegionTest
[INFO] Running org.apache.pdfbox.jbig2.segments.RegionSegmentInformationTest
[INFO] Tests run: 1, Failures: 0, Errors: 0, Skipped: 0, Time elapsed: 0.001 s -- in org.apache.pdfbox.jbig2.segments.RegionSegmentInformationTest
[INFO] Running org.apache.pdfbox.jbig2.segments.GenericRegionTest
[WARNING] Tests run: 4, Failures: 0, Errors: 0, Skipped: 3, Time elapsed: 0.001 s -- in org.apache.pdfbox.jbig2.segments.GenericRegionTest
[INFO] Running org.apache.pdfbox.jbig2.segments.PageInformationTest
[WARNING] Tests run: 3, Failures: 0, Errors: 0, Skipped: 2, Time elapsed: 0.015 s -- in org.apache.pdfbox.jbig2.segments.PageInformationTest
[INFO] Running org.apache.pdfbox.jbig2.segments.PatternDictionaryTest
[WARNING] Tests run: 3, Failures: 0, Errors: 0, Skipped: 2, Time elapsed: 0.001 s -- in org.apache.pdfbox.jbig2.segments.PatternDictionaryTest
[INFO]
[INFO] Results:
[INFO]
[WARNING] Tests run: 130, Failures: 0, Errors: 0, Skipped: 11
[INFO]
[JENKINS] Recording test results
[INFO]
[INFO] --- jacoco:0.8.14:report (report) @ jbig2-imageio ---
[INFO] Loading execution data file <https://ci-builds.apache.org/job/PDFBox/job/PDFBox%20JBig2%20ImageIO%20Plugin/ws/target/jacoco.exec>
[INFO] Analyzed bundle 'PDFBox JBIG2 ImageIO plugin' with 87 classes
[INFO]
[INFO] --- jar:3.5.0:jar (default-jar) @ jbig2-imageio ---
[INFO] Building jar: <https://ci-builds.apache.org/job/PDFBox/job/PDFBox%20JBig2%20ImageIO%20Plugin/ws/target/jbig2-imageio-3.0.6-SNAPSHOT.jar>
[INFO]
[INFO] >>> source:3.4.0:jar (attach-sources) > generate-sources @ jbig2-imageio >>>
[INFO]
[INFO] --- enforcer:3.6.2:enforce (enforce-maven-version) @ jbig2-imageio ---
[INFO]
[INFO] --- enforcer:3.6.2:enforce (enforce-java-version) @ jbig2-imageio ---
[INFO]
[INFO] --- enforcer:3.6.2:enforce (default) @ jbig2-imageio ---
[INFO]
[INFO] --- jacoco:0.8.14:prepare-agent (default) @ jbig2-imageio ---
[INFO] surefireArgLine set to "-javaagent:/home/jenkins/.m2/repository/org/jacoco/org.jacoco.agent/0.8.14/org.jacoco.agent-0.8.14-runtime.jar=destfile=<https://ci-builds.apache.org/job/PDFBox/job/PDFBox%20JBig2%20ImageIO%20Plugin/ws/target/jacoco.exec">
[WARNING] Failed to getClass for org.apache.maven.plugins.source.SourceJarMojo
[INFO]
[INFO] <<< source:3.4.0:jar (attach-sources) < generate-sources @ jbig2-imageio <<<
[INFO]
[INFO]
[INFO] --- source:3.4.0:jar (attach-sources) @ jbig2-imageio ---
[INFO] Skipping source per configuration.
[INFO]
[INFO] --- assembly:3.8.0:single (default) @ jbig2-imageio ---
[INFO] Reading assembly descriptor: assembly.xml
[INFO] Building zip: <https://ci-builds.apache.org/job/PDFBox/job/PDFBox%20JBig2%20ImageIO%20Plugin/ws/target/jbig2-imageio-3.0.6-SNAPSHOT-src.zip>
[INFO]
[INFO] --- apache-rat:0.18:check (default) @ jbig2-imageio ---
[WARNING] Parameter 'excludes' is deprecated: Deprecated for removal since 0.17: Use <inputExclude> instead.
[WARNING] Use of deprecated option 'exclude'. Deprecated for removal since 0.17: Use <inputExclude> instead.
[INFO] No issues found.
[INFO]
[INFO] --- dependency-check:12.2.2:check (default) @ jbig2-imageio ---
[WARNING] The parameter 'ossindexAnalyzerEnabled' is deprecated and should not be used anymore. Please use 'ossIndexAnalyzerEnabled' instead.
[INFO] Checking for updates
[WARNING] An NVD API Key was not provided - it is highly recommended to use an NVD API key as the update can take a VERY long time without an API Key
[INFO] NVD API has 351,255 records in this update
[INFO] Downloaded 10,000/351,255 (3%)
[INFO] Downloaded 20,000/351,255 (6%)
[INFO] Downloaded 30,000/351,255 (9%)
[WARNING] NVD API request failures are occurring; retrying request for the 15th time
[WARNING] NVD API request failures are occurring; retrying request for the 16th time
[WARNING] NVD API request failures are occurring; retrying request for the 17th time
[WARNING] NVD API request failures are occurring; retrying request for the 18th time
[WARNING] NVD API request failures are occurring; retrying request for the 19th time
[WARNING] NVD API request failures are occurring; retrying request for the 20th time
[WARNING] NVD API request failures are occurring; retrying request for the 21st time
[WARNING] NVD API request failures are occurring; retrying request for the 22nd time
[WARNING] NVD API request failures are occurring; retrying request for the 23rd time
[WARNING] NVD API request failures are occurring; retrying request for the 24th time
[WARNING] NVD API request failures are occurring; retrying request for the 25th time
[WARNING] NVD API request failures are occurring; retrying request for the 26th time
[WARNING] NVD API request failures are occurring; retrying request for the 27th time
[WARNING] NVD API request failures are occurring; retrying request for the 28th time
[WARNING] NVD API request failures are occurring; retrying request for the 29th time
[WARNING] NVD API request failures are occurring; retrying request for the 30th time
[WARNING] NVD API request failures are occurring; retrying request for the 31st time
[ERROR] Error updating the NVD Data
org.owasp.dependencycheck.data.update.exception.UpdateException: Error updating the NVD Data
at org.owasp.dependencycheck.data.update.NvdApiDataSource.processApi (NvdApiDataSource.java:387)
at org.owasp.dependencycheck.data.update.NvdApiDataSource.update (NvdApiDataSource.java:128)
at org.owasp.dependencycheck.Engine.doUpdates (Engine.java:887)
at org.owasp.dependencycheck.Engine.initializeAndUpdateDatabase (Engine.java:692)
at org.owasp.dependencycheck.Engine.analyzeDependencies (Engine.java:619)
at org.owasp.dependencycheck.maven.BaseDependencyCheckMojo.runCheck (BaseDependencyCheckMojo.java:2093)
at org.owasp.dependencycheck.maven.BaseDependencyCheckMojo.execute (BaseDependencyCheckMojo.java:1291)
at org.apache.maven.plugin.DefaultBuildPluginManager.executeMojo (DefaultBuildPluginManager.java:126)
at org.apache.maven.lifecycle.internal.MojoExecutor.doExecute2 (MojoExecutor.java:328)
at org.apache.maven.lifecycle.internal.MojoExecutor.doExecute (MojoExecutor.java:316)
at org.apache.maven.lifecycle.internal.MojoExecutor.execute (MojoExecutor.java:212)
at org.apache.maven.lifecycle.internal.MojoExecutor.execute (MojoExecutor.java:174)
at org.apache.maven.lifecycle.internal.MojoExecutor.access$000 (MojoExecutor.java:75)
at org.apache.maven.lifecycle.internal.MojoExecutor$1.run (MojoExecutor.java:162)
at org.apache.maven.plugin.DefaultMojosExecutionStrategy.execute (DefaultMojosExecutionStrategy.java:39)
at org.apache.maven.lifecycle.internal.MojoExecutor.execute (MojoExecutor.java:159)
at org.apache.maven.lifecycle.internal.LifecycleModuleBuilder.buildProject (LifecycleModuleBuilder.java:105)
at org.apache.maven.lifecycle.internal.LifecycleModuleBuilder.buildProject (LifecycleModuleBuilder.java:73)
at org.apache.maven.lifecycle.internal.builder.singlethreaded.SingleThreadedBuilder.build (SingleThreadedBuilder.java:53)
at org.apache.maven.lifecycle.internal.LifecycleStarter.execute (LifecycleStarter.java:118)
at org.apache.maven.DefaultMaven.doExecute (DefaultMaven.java:261)
at org.apache.maven.DefaultMaven.doExecute (DefaultMaven.java:173)
at org.apache.maven.DefaultMaven.execute (DefaultMaven.java:101)
at org.jvnet.hudson.maven3.launcher.Maven35Launcher.main (Maven35Launcher.java:138)
at jdk.internal.reflect.NativeMethodAccessorImpl.invoke0 (Native Method)
at jdk.internal.reflect.NativeMethodAccessorImpl.invoke (NativeMethodAccessorImpl.java:77)
at jdk.internal.reflect.DelegatingMethodAccessorImpl.invoke (DelegatingMethodAccessorImpl.java:43)
at java.lang.reflect.Method.invoke (Method.java:569)
at org.codehaus.plexus.classworlds.launcher.Launcher.launchEnhanced (Launcher.java:255)
at org.codehaus.plexus.classworlds.launcher.Launcher.launch (Launcher.java:201)
at jenkins.maven3.agent.Maven35Main.launch (Maven35Main.java:179)
at jdk.internal.reflect.NativeMethodAccessorImpl.invoke0 (Native Method)
at jdk.internal.reflect.NativeMethodAccessorImpl.invoke (NativeMethodAccessorImpl.java:77)
at jdk.internal.reflect.DelegatingMethodAccessorImpl.invoke (DelegatingMethodAccessorImpl.java:43)
at java.lang.reflect.Method.invoke (Method.java:569)
at hudson.maven.Maven3Builder.call (Maven3Builder.java:140)
at hudson.maven.Maven3Builder.call (Maven3Builder.java:71)
at hudson.remoting.UserRequest.perform (UserRequest.java:225)
at hudson.remoting.UserRequest.perform (UserRequest.java:50)
at hudson.remoting.Request$2.run (Request.java:391)
at hudson.remoting.InterceptingExecutorService.lambda$wrap$0 (InterceptingExecutorService.java:81)
at java.util.concurrent.FutureTask.run (FutureTask.java:264)
at java.util.concurrent.ThreadPoolExecutor.runWorker (ThreadPoolExecutor.java:1136)
at java.util.concurrent.ThreadPoolExecutor$Worker.run (ThreadPoolExecutor.java:635)
at java.lang.Thread.run (Thread.java:840)
Caused by: io.github.jeremylong.openvulnerability.client.nvd.NvdApiException: NVD Returned Status Code: 429
at io.github.jeremylong.openvulnerability.client.nvd.NvdCveClient._next (NvdCveClient.java:445)
at io.github.jeremylong.openvulnerability.client.nvd.NvdCveClient.next (NvdCveClient.java:356)
at org.owasp.dependencycheck.data.update.NvdApiDataSource.processApi (NvdApiDataSource.java:343)
at org.owasp.dependencycheck.data.update.NvdApiDataSource.update (NvdApiDataSource.java:128)
at org.owasp.dependencycheck.Engine.doUpdates (Engine.java:887)
at org.owasp.dependencycheck.Engine.initializeAndUpdateDatabase (Engine.java:692)
at org.owasp.dependencycheck.Engine.analyzeDependencies (Engine.java:619)
at org.owasp.dependencycheck.maven.BaseDependencyCheckMojo.runCheck (BaseDependencyCheckMojo.java:2093)
at org.owasp.dependencycheck.maven.BaseDependencyCheckMojo.execute (BaseDependencyCheckMojo.java:1291)
at org.apache.maven.plugin.DefaultBuildPluginManager.executeMojo (DefaultBuildPluginManager.java:126)
at org.apache.maven.lifecycle.internal.MojoExecutor.doExecute2 (MojoExecutor.java:328)
at org.apache.maven.lifecycle.internal.MojoExecutor.doExecute (MojoExecutor.java:316)
at org.apache.maven.lifecycle.internal.MojoExecutor.execute (MojoExecutor.java:212)
at org.apache.maven.lifecycle.internal.MojoExecutor.execute (MojoExecutor.java:174)
at org.apache.maven.lifecycle.internal.MojoExecutor.access$000 (MojoExecutor.java:75)
at org.apache.maven.lifecycle.internal.MojoExecutor$1.run (MojoExecutor.java:162)
at org.apache.maven.plugin.DefaultMojosExecutionStrategy.execute (DefaultMojosExecutionStrategy.java:39)
at org.apache.maven.lifecycle.internal.MojoExecutor.execute (MojoExecutor.java:159)
at org.apache.maven.lifecycle.internal.LifecycleModuleBuilder.buildProject (LifecycleModuleBuilder.java:105)
at org.apache.maven.lifecycle.internal.LifecycleModuleBuilder.buildProject (LifecycleModuleBuilder.java:73)
at org.apache.maven.lifecycle.internal.builder.singlethreaded.SingleThreadedBuilder.build (SingleThreadedBuilder.java:53)
at org.apache.maven.lifecycle.internal.LifecycleStarter.execute (LifecycleStarter.java:118)
at org.apache.maven.DefaultMaven.doExecute (DefaultMaven.java:261)
at org.apache.maven.DefaultMaven.doExecute (DefaultMaven.java:173)
at org.apache.maven.DefaultMaven.execute (DefaultMaven.java:101)
at org.jvnet.hudson.maven3.launcher.Maven35Launcher.main (Maven35Launcher.java:138)
at jdk.internal.reflect.NativeMethodAccessorImpl.invoke0 (Native Method)
at jdk.internal.reflect.NativeMethodAccessorImpl.invoke (NativeMethodAccessorImpl.java:77)
at jdk.internal.reflect.DelegatingMethodAccessorImpl.invoke (DelegatingMethodAccessorImpl.java:43)
at java.lang.reflect.Method.invoke (Method.java:569)
at org.codehaus.plexus.classworlds.launcher.Launcher.launchEnhanced (Launcher.java:255)
at org.codehaus.plexus.classworlds.launcher.Launcher.launch (Launcher.java:201)
at jenkins.maven3.agent.Maven35Main.launch (Maven35Main.java:179)
at jdk.internal.reflect.NativeMethodAccessorImpl.invoke0 (Native Method)
at jdk.internal.reflect.NativeMethodAccessorImpl.invoke (NativeMethodAccessorImpl.java:77)
at jdk.internal.reflect.DelegatingMethodAccessorImpl.invoke (DelegatingMethodAccessorImpl.java:43)
at java.lang.reflect.Method.invoke (Method.java:569)
at hudson.maven.Maven3Builder.call (Maven3Builder.java:140)
at hudson.maven.Maven3Builder.call (Maven3Builder.java:71)
at hudson.remoting.UserRequest.perform (UserRequest.java:225)
at hudson.remoting.UserRequest.perform (UserRequest.java:50)
at hudson.remoting.Request$2.run (Request.java:391)
at hudson.remoting.InterceptingExecutorService.lambda$wrap$0 (InterceptingExecutorService.java:81)
at java.util.concurrent.FutureTask.run (FutureTask.java:264)
at java.util.concurrent.ThreadPoolExecutor.runWorker (ThreadPoolExecutor.java:1136)
at java.util.concurrent.ThreadPoolExecutor$Worker.run (ThreadPoolExecutor.java:635)
at java.lang.Thread.run (Thread.java:840)
[INFO] Skipping Known Exploited Vulnerabilities update check since last check was within 24 hours.
[WARNING] Unable to update 1 or more Cached Web DataSource, using local data instead. Results may not include recent vulnerabilities.
[ERROR] Unable to continue dependency-check analysis.
[WARNING] Attempt to (de-)serialize anonymous class org.jfrog.hudson.maven2.MavenDependenciesRecorder$1; see: https://jenkins.io/redirect/serialization-of-anonymous-classes/
[INFO] ------------------------------------------------------------------------
[INFO] BUILD FAILURE
[INFO] ------------------------------------------------------------------------
[INFO] Total time: 02:28 min
[INFO] Finished at: 2026-05-16T15:23:15Z
[INFO] ------------------------------------------------------------------------
Waiting for Jenkins to finish collecting data
[ERROR] Failed to execute goal org.owasp:dependency-check-maven:12.2.2:check (default) on project jbig2-imageio: Fatal exception(s) analyzing PDFBox JBIG2 ImageIO plugin: One or more exceptions occurred during analysis:
[ERROR] UpdateException: Error updating the NVD Data
[ERROR] caused by NvdApiException: NVD Returned Status Code: 429
[ERROR] NoDataException: No documents exist
[ERROR] -> [Help 1]
[ERROR]
[ERROR] To see the full stack trace of the errors, re-run Maven with the -e switch.
[ERROR] Re-run Maven using the -X switch to enable full debug logging.
[ERROR]
[ERROR] For more information about the errors and possible solutions, please read the following articles:
[ERROR] [Help 1] http://cwiki.apache.org/confluence/display/MAVEN/MojoExecutionException
[JENKINS] Archiving <https://ci-builds.apache.org/job/PDFBox/job/PDFBox%20JBig2%20ImageIO%20Plugin/ws/pom.xml> to org.apache.pdfbox/jbig2-imageio/3.0.6-SNAPSHOT/jbig2-imageio-3.0.6-SNAPSHOT.pom
[JENKINS] Archiving <https://ci-builds.apache.org/job/PDFBox/job/PDFBox%20JBig2%20ImageIO%20Plugin/ws/target/jbig2-imageio-3.0.6-SNAPSHOT.jar> to org.apache.pdfbox/jbig2-imageio/3.0.6-SNAPSHOT/jbig2-imageio-3.0.6-SNAPSHOT.jar
[JENKINS] Archiving <https://ci-builds.apache.org/job/PDFBox/job/PDFBox%20JBig2%20ImageIO%20Plugin/ws/target/jbig2-imageio-3.0.6-SNAPSHOT-src.zip> to org.apache.pdfbox/jbig2-imageio/3.0.6-SNAPSHOT/jbig2-imageio-3.0.6-SNAPSHOT-src.zip
Sending e-mails to: dev@pdfbox.apache.org
channel stopped
---------------------------------------------------------------------
To unsubscribe, e-mail: dev-unsubscribe@pdfbox.apache.org
For additional commands, e-mail: dev-help@pdfbox.apache.org
Jenkins build is back to normal : PDFBox » PDFBox JBig2 ImageIO Plugin #156
Posted by Apache Jenkins Server <je...@builds.apache.org>.
See <https://ci-builds.apache.org/job/PDFBox/job/PDFBox%20JBig2%20ImageIO%20Plugin/156/display/redirect>
---------------------------------------------------------------------
To unsubscribe, e-mail: dev-unsubscribe@pdfbox.apache.org
For additional commands, e-mail: dev-help@pdfbox.apache.org
Build failed in Jenkins: PDFBox » PDFBox JBig2 ImageIO Plugin #155
Posted by Apache Jenkins Server <je...@builds.apache.org>.
See <https://ci-builds.apache.org/job/PDFBox/job/PDFBox%20JBig2%20ImageIO%20Plugin/155/display/redirect>
Changes:
------------------------------------------
[...truncated 1.68 MiB...]
at org.owasp.dependencycheck.data.nvdcve.CveDB.updateOrInsertVulnerability (CveDB.java:1168)
at org.owasp.dependencycheck.data.nvdcve.CveDB.updateVulnerability (CveDB.java:1093)
at org.owasp.dependencycheck.data.update.nvd.api.NvdApiProcessor.updateCveDb (NvdApiProcessor.java:119)
at org.owasp.dependencycheck.data.update.nvd.api.NvdApiProcessor.call (NvdApiProcessor.java:96)
at org.owasp.dependencycheck.data.update.nvd.api.NvdApiProcessor.call (NvdApiProcessor.java:40)
at java.util.concurrent.FutureTask.run (FutureTask.java:264)
at java.util.concurrent.ThreadPoolExecutor.runWorker (ThreadPoolExecutor.java:1136)
at java.util.concurrent.ThreadPoolExecutor$Worker.run (ThreadPoolExecutor.java:635)
at java.lang.Thread.run (Thread.java:840)
[ERROR] Failed to process CVE-2009-1722
java.lang.NullPointerException: Cannot invoke "org.apache.commons.dbcp2.BasicDataSource.getConnection()" because "this.connectionPool" is null
at org.owasp.dependencycheck.data.nvdcve.DatabaseManager.getConnection (DatabaseManager.java:576)
at org.owasp.dependencycheck.data.nvdcve.CveDB.updateOrInsertVulnerability (CveDB.java:1168)
at org.owasp.dependencycheck.data.nvdcve.CveDB.updateVulnerability (CveDB.java:1093)
at org.owasp.dependencycheck.data.update.nvd.api.NvdApiProcessor.updateCveDb (NvdApiProcessor.java:119)
at org.owasp.dependencycheck.data.update.nvd.api.NvdApiProcessor.call (NvdApiProcessor.java:96)
at org.owasp.dependencycheck.data.update.nvd.api.NvdApiProcessor.call (NvdApiProcessor.java:40)
at java.util.concurrent.FutureTask.run (FutureTask.java:264)
at java.util.concurrent.ThreadPoolExecutor.runWorker (ThreadPoolExecutor.java:1136)
at java.util.concurrent.ThreadPoolExecutor$Worker.run (ThreadPoolExecutor.java:635)
at java.lang.Thread.run (Thread.java:840)
[ERROR] Failed to process CVE-2009-2406
java.lang.NullPointerException: Cannot invoke "org.apache.commons.dbcp2.BasicDataSource.getConnection()" because "this.connectionPool" is null
at org.owasp.dependencycheck.data.nvdcve.DatabaseManager.getConnection (DatabaseManager.java:576)
at org.owasp.dependencycheck.data.nvdcve.CveDB.updateOrInsertVulnerability (CveDB.java:1168)
at org.owasp.dependencycheck.data.nvdcve.CveDB.updateVulnerability (CveDB.java:1093)
at org.owasp.dependencycheck.data.update.nvd.api.NvdApiProcessor.updateCveDb (NvdApiProcessor.java:119)
at org.owasp.dependencycheck.data.update.nvd.api.NvdApiProcessor.call (NvdApiProcessor.java:96)
at org.owasp.dependencycheck.data.update.nvd.api.NvdApiProcessor.call (NvdApiProcessor.java:40)
at java.util.concurrent.FutureTask.run (FutureTask.java:264)
at java.util.concurrent.ThreadPoolExecutor.runWorker (ThreadPoolExecutor.java:1136)
at java.util.concurrent.ThreadPoolExecutor$Worker.run (ThreadPoolExecutor.java:635)
at java.lang.Thread.run (Thread.java:840)
[ERROR] Failed to process CVE-2009-1863
java.lang.NullPointerException: Cannot invoke "org.apache.commons.dbcp2.BasicDataSource.getConnection()" because "this.connectionPool" is null
at org.owasp.dependencycheck.data.nvdcve.DatabaseManager.getConnection (DatabaseManager.java:576)
at org.owasp.dependencycheck.data.nvdcve.CveDB.updateOrInsertVulnerability (CveDB.java:1168)
at org.owasp.dependencycheck.data.nvdcve.CveDB.updateVulnerability (CveDB.java:1093)
at org.owasp.dependencycheck.data.update.nvd.api.NvdApiProcessor.updateCveDb (NvdApiProcessor.java:119)
at org.owasp.dependencycheck.data.update.nvd.api.NvdApiProcessor.call (NvdApiProcessor.java:96)
at org.owasp.dependencycheck.data.update.nvd.api.NvdApiProcessor.call (NvdApiProcessor.java:40)
at java.util.concurrent.FutureTask.run (FutureTask.java:264)
at java.util.concurrent.ThreadPoolExecutor.runWorker (ThreadPoolExecutor.java:1136)
at java.util.concurrent.ThreadPoolExecutor$Worker.run (ThreadPoolExecutor.java:635)
at java.lang.Thread.run (Thread.java:840)
[ERROR] Failed to process CVE-2009-1864
java.lang.NullPointerException: Cannot invoke "org.apache.commons.dbcp2.BasicDataSource.getConnection()" because "this.connectionPool" is null
at org.owasp.dependencycheck.data.nvdcve.DatabaseManager.getConnection (DatabaseManager.java:576)
at org.owasp.dependencycheck.data.nvdcve.CveDB.updateOrInsertVulnerability (CveDB.java:1168)
at org.owasp.dependencycheck.data.nvdcve.CveDB.updateVulnerability (CveDB.java:1093)
at org.owasp.dependencycheck.data.update.nvd.api.NvdApiProcessor.updateCveDb (NvdApiProcessor.java:119)
at org.owasp.dependencycheck.data.update.nvd.api.NvdApiProcessor.call (NvdApiProcessor.java:96)
at org.owasp.dependencycheck.data.update.nvd.api.NvdApiProcessor.call (NvdApiProcessor.java:40)
at java.util.concurrent.FutureTask.run (FutureTask.java:264)
at java.util.concurrent.ThreadPoolExecutor.runWorker (ThreadPoolExecutor.java:1136)
at java.util.concurrent.ThreadPoolExecutor$Worker.run (ThreadPoolExecutor.java:635)
at java.lang.Thread.run (Thread.java:840)
[ERROR] Failed to process CVE-2009-1865
java.lang.NullPointerException: Cannot invoke "org.apache.commons.dbcp2.BasicDataSource.getConnection()" because "this.connectionPool" is null
at org.owasp.dependencycheck.data.nvdcve.DatabaseManager.getConnection (DatabaseManager.java:576)
at org.owasp.dependencycheck.data.nvdcve.CveDB.updateOrInsertVulnerability (CveDB.java:1168)
at org.owasp.dependencycheck.data.nvdcve.CveDB.updateVulnerability (CveDB.java:1093)
at org.owasp.dependencycheck.data.update.nvd.api.NvdApiProcessor.updateCveDb (NvdApiProcessor.java:119)
at org.owasp.dependencycheck.data.update.nvd.api.NvdApiProcessor.call (NvdApiProcessor.java:96)
at org.owasp.dependencycheck.data.update.nvd.api.NvdApiProcessor.call (NvdApiProcessor.java:40)
at java.util.concurrent.FutureTask.run (FutureTask.java:264)
at java.util.concurrent.ThreadPoolExecutor.runWorker (ThreadPoolExecutor.java:1136)
at java.util.concurrent.ThreadPoolExecutor$Worker.run (ThreadPoolExecutor.java:635)
at java.lang.Thread.run (Thread.java:840)
[ERROR] Failed to process CVE-2009-1866
java.lang.NullPointerException: Cannot invoke "org.apache.commons.dbcp2.BasicDataSource.getConnection()" because "this.connectionPool" is null
at org.owasp.dependencycheck.data.nvdcve.DatabaseManager.getConnection (DatabaseManager.java:576)
at org.owasp.dependencycheck.data.nvdcve.CveDB.updateOrInsertVulnerability (CveDB.java:1168)
at org.owasp.dependencycheck.data.nvdcve.CveDB.updateVulnerability (CveDB.java:1093)
at org.owasp.dependencycheck.data.update.nvd.api.NvdApiProcessor.updateCveDb (NvdApiProcessor.java:119)
at org.owasp.dependencycheck.data.update.nvd.api.NvdApiProcessor.call (NvdApiProcessor.java:96)
at org.owasp.dependencycheck.data.update.nvd.api.NvdApiProcessor.call (NvdApiProcessor.java:40)
at java.util.concurrent.FutureTask.run (FutureTask.java:264)
at java.util.concurrent.ThreadPoolExecutor.runWorker (ThreadPoolExecutor.java:1136)
at java.util.concurrent.ThreadPoolExecutor$Worker.run (ThreadPoolExecutor.java:635)
at java.lang.Thread.run (Thread.java:840)
[ERROR] Failed to process CVE-2009-1867
java.lang.NullPointerException: Cannot invoke "org.apache.commons.dbcp2.BasicDataSource.getConnection()" because "this.connectionPool" is null
at org.owasp.dependencycheck.data.nvdcve.DatabaseManager.getConnection (DatabaseManager.java:576)
at org.owasp.dependencycheck.data.nvdcve.CveDB.updateOrInsertVulnerability (CveDB.java:1168)
at org.owasp.dependencycheck.data.nvdcve.CveDB.updateVulnerability (CveDB.java:1093)
at org.owasp.dependencycheck.data.update.nvd.api.NvdApiProcessor.updateCveDb (NvdApiProcessor.java:119)
at org.owasp.dependencycheck.data.update.nvd.api.NvdApiProcessor.call (NvdApiProcessor.java:96)
at org.owasp.dependencycheck.data.update.nvd.api.NvdApiProcessor.call (NvdApiProcessor.java:40)
at java.util.concurrent.FutureTask.run (FutureTask.java:264)
at java.util.concurrent.ThreadPoolExecutor.runWorker (ThreadPoolExecutor.java:1136)
at java.util.concurrent.ThreadPoolExecutor$Worker.run (ThreadPoolExecutor.java:635)
at java.lang.Thread.run (Thread.java:840)
[ERROR] Failed to process CVE-2009-1868
java.lang.NullPointerException: Cannot invoke "org.apache.commons.dbcp2.BasicDataSource.getConnection()" because "this.connectionPool" is null
at org.owasp.dependencycheck.data.nvdcve.DatabaseManager.getConnection (DatabaseManager.java:576)
at org.owasp.dependencycheck.data.nvdcve.CveDB.updateOrInsertVulnerability (CveDB.java:1168)
at org.owasp.dependencycheck.data.nvdcve.CveDB.updateVulnerability (CveDB.java:1093)
at org.owasp.dependencycheck.data.update.nvd.api.NvdApiProcessor.updateCveDb (NvdApiProcessor.java:119)
at org.owasp.dependencycheck.data.update.nvd.api.NvdApiProcessor.call (NvdApiProcessor.java:96)
at org.owasp.dependencycheck.data.update.nvd.api.NvdApiProcessor.call (NvdApiProcessor.java:40)
at java.util.concurrent.FutureTask.run (FutureTask.java:264)
at java.util.concurrent.ThreadPoolExecutor.runWorker (ThreadPoolExecutor.java:1136)
at java.util.concurrent.ThreadPoolExecutor$Worker.run (ThreadPoolExecutor.java:635)
at java.lang.Thread.run (Thread.java:840)
[ERROR] Failed to process CVE-2009-1869
java.lang.NullPointerException: Cannot invoke "org.apache.commons.dbcp2.BasicDataSource.getConnection()" because "this.connectionPool" is null
at org.owasp.dependencycheck.data.nvdcve.DatabaseManager.getConnection (DatabaseManager.java:576)
at org.owasp.dependencycheck.data.nvdcve.CveDB.updateOrInsertVulnerability (CveDB.java:1168)
at org.owasp.dependencycheck.data.nvdcve.CveDB.updateVulnerability (CveDB.java:1093)
at org.owasp.dependencycheck.data.update.nvd.api.NvdApiProcessor.updateCveDb (NvdApiProcessor.java:119)
at org.owasp.dependencycheck.data.update.nvd.api.NvdApiProcessor.call (NvdApiProcessor.java:96)
at org.owasp.dependencycheck.data.update.nvd.api.NvdApiProcessor.call (NvdApiProcessor.java:40)
at java.util.concurrent.FutureTask.run (FutureTask.java:264)
at java.util.concurrent.ThreadPoolExecutor.runWorker (ThreadPoolExecutor.java:1136)
at java.util.concurrent.ThreadPoolExecutor$Worker.run (ThreadPoolExecutor.java:635)
at java.lang.Thread.run (Thread.java:840)
[ERROR] Failed to process CVE-2009-1870
java.lang.NullPointerException: Cannot invoke "org.apache.commons.dbcp2.BasicDataSource.getConnection()" because "this.connectionPool" is null
at org.owasp.dependencycheck.data.nvdcve.DatabaseManager.getConnection (DatabaseManager.java:576)
at org.owasp.dependencycheck.data.nvdcve.CveDB.updateOrInsertVulnerability (CveDB.java:1168)
at org.owasp.dependencycheck.data.nvdcve.CveDB.updateVulnerability (CveDB.java:1093)
at org.owasp.dependencycheck.data.update.nvd.api.NvdApiProcessor.updateCveDb (NvdApiProcessor.java:119)
at org.owasp.dependencycheck.data.update.nvd.api.NvdApiProcessor.call (NvdApiProcessor.java:96)
at org.owasp.dependencycheck.data.update.nvd.api.NvdApiProcessor.call (NvdApiProcessor.java:40)
at java.util.concurrent.FutureTask.run (FutureTask.java:264)
at java.util.concurrent.ThreadPoolExecutor.runWorker (ThreadPoolExecutor.java:1136)
at java.util.concurrent.ThreadPoolExecutor$Worker.run (ThreadPoolExecutor.java:635)
at java.lang.Thread.run (Thread.java:840)
[ERROR] Failed to process CVE-2008-6884
java.lang.NullPointerException: Cannot invoke "org.apache.commons.dbcp2.BasicDataSource.getConnection()" because "this.connectionPool" is null
at org.owasp.dependencycheck.data.nvdcve.DatabaseManager.getConnection (DatabaseManager.java:576)
at org.owasp.dependencycheck.data.nvdcve.CveDB.updateOrInsertVulnerability (CveDB.java:1168)
at org.owasp.dependencycheck.data.nvdcve.CveDB.updateVulnerability (CveDB.java:1093)
at org.owasp.dependencycheck.data.update.nvd.api.NvdApiProcessor.updateCveDb (NvdApiProcessor.java:119)
at org.owasp.dependencycheck.data.update.nvd.api.NvdApiProcessor.call (NvdApiProcessor.java:96)
at org.owasp.dependencycheck.data.update.nvd.api.NvdApiProcessor.call (NvdApiProcessor.java:40)
at java.util.concurrent.FutureTask.run (FutureTask.java:264)
at java.util.concurrent.ThreadPoolExecutor.runWorker (ThreadPoolExecutor.java:1136)
at java.util.concurrent.ThreadPoolExecutor$Worker.run (ThreadPoolExecutor.java:635)
at java.lang.Thread.run (Thread.java:840)
[ERROR] Failed to process CVE-2008-6885
java.lang.NullPointerException: Cannot invoke "org.apache.commons.dbcp2.BasicDataSource.getConnection()" because "this.connectionPool" is null
at org.owasp.dependencycheck.data.nvdcve.DatabaseManager.getConnection (DatabaseManager.java:576)
at org.owasp.dependencycheck.data.nvdcve.CveDB.updateOrInsertVulnerability (CveDB.java:1168)
at org.owasp.dependencycheck.data.nvdcve.CveDB.updateVulnerability (CveDB.java:1093)
at org.owasp.dependencycheck.data.update.nvd.api.NvdApiProcessor.updateCveDb (NvdApiProcessor.java:119)
at org.owasp.dependencycheck.data.update.nvd.api.NvdApiProcessor.call (NvdApiProcessor.java:96)
at org.owasp.dependencycheck.data.update.nvd.api.NvdApiProcessor.call (NvdApiProcessor.java:40)
at java.util.concurrent.FutureTask.run (FutureTask.java:264)
at java.util.concurrent.ThreadPoolExecutor.runWorker (ThreadPoolExecutor.java:1136)
at java.util.concurrent.ThreadPoolExecutor$Worker.run (ThreadPoolExecutor.java:635)
at java.lang.Thread.run (Thread.java:840)
[ERROR] Failed to process CVE-2008-6886
java.lang.NullPointerException: Cannot invoke "org.apache.commons.dbcp2.BasicDataSource.getConnection()" because "this.connectionPool" is null
at org.owasp.dependencycheck.data.nvdcve.DatabaseManager.getConnection (DatabaseManager.java:576)
at org.owasp.dependencycheck.data.nvdcve.CveDB.updateOrInsertVulnerability (CveDB.java:1168)
at org.owasp.dependencycheck.data.nvdcve.CveDB.updateVulnerability (CveDB.java:1093)
at org.owasp.dependencycheck.data.update.nvd.api.NvdApiProcessor.updateCveDb (NvdApiProcessor.java:119)
at org.owasp.dependencycheck.data.update.nvd.api.NvdApiProcessor.call (NvdApiProcessor.java:96)
at org.owasp.dependencycheck.data.update.nvd.api.NvdApiProcessor.call (NvdApiProcessor.java:40)
at java.util.concurrent.FutureTask.run (FutureTask.java:264)
at java.util.concurrent.ThreadPoolExecutor.runWorker (ThreadPoolExecutor.java:1136)
at java.util.concurrent.ThreadPoolExecutor$Worker.run (ThreadPoolExecutor.java:635)
at java.lang.Thread.run (Thread.java:840)
[ERROR] Failed to process CVE-2008-6887
java.lang.NullPointerException: Cannot invoke "org.apache.commons.dbcp2.BasicDataSource.getConnection()" because "this.connectionPool" is null
at org.owasp.dependencycheck.data.nvdcve.DatabaseManager.getConnection (DatabaseManager.java:576)
at org.owasp.dependencycheck.data.nvdcve.CveDB.updateOrInsertVulnerability (CveDB.java:1168)
at org.owasp.dependencycheck.data.nvdcve.CveDB.updateVulnerability (CveDB.java:1093)
at org.owasp.dependencycheck.data.update.nvd.api.NvdApiProcessor.updateCveDb (NvdApiProcessor.java:119)
at org.owasp.dependencycheck.data.update.nvd.api.NvdApiProcessor.call (NvdApiProcessor.java:96)
at org.owasp.dependencycheck.data.update.nvd.api.NvdApiProcessor.call (NvdApiProcessor.java:40)
at java.util.concurrent.FutureTask.run (FutureTask.java:264)
at java.util.concurrent.ThreadPoolExecutor.runWorker (ThreadPoolExecutor.java:1136)
at java.util.concurrent.ThreadPoolExecutor$Worker.run (ThreadPoolExecutor.java:635)
at java.lang.Thread.run (Thread.java:840)
[ERROR] Failed to process CVE-2008-6888
java.lang.NullPointerException: Cannot invoke "org.apache.commons.dbcp2.BasicDataSource.getConnection()" because "this.connectionPool" is null
at org.owasp.dependencycheck.data.nvdcve.DatabaseManager.getConnection (DatabaseManager.java:576)
at org.owasp.dependencycheck.data.nvdcve.CveDB.updateOrInsertVulnerability (CveDB.java:1168)
at org.owasp.dependencycheck.data.nvdcve.CveDB.updateVulnerability (CveDB.java:1093)
at org.owasp.dependencycheck.data.update.nvd.api.NvdApiProcessor.updateCveDb (NvdApiProcessor.java:119)
at org.owasp.dependencycheck.data.update.nvd.api.NvdApiProcessor.call (NvdApiProcessor.java:96)
at org.owasp.dependencycheck.data.update.nvd.api.NvdApiProcessor.call (NvdApiProcessor.java:40)
at java.util.concurrent.FutureTask.run (FutureTask.java:264)
at java.util.concurrent.ThreadPoolExecutor.runWorker (ThreadPoolExecutor.java:1136)
at java.util.concurrent.ThreadPoolExecutor$Worker.run (ThreadPoolExecutor.java:635)
at java.lang.Thread.run (Thread.java:840)
[ERROR] Failed to process CVE-2008-6889
java.lang.NullPointerException: Cannot invoke "org.apache.commons.dbcp2.BasicDataSource.getConnection()" because "this.connectionPool" is null
at org.owasp.dependencycheck.data.nvdcve.DatabaseManager.getConnection (DatabaseManager.java:576)
at org.owasp.dependencycheck.data.nvdcve.CveDB.updateOrInsertVulnerability (CveDB.java:1168)
at org.owasp.dependencycheck.data.nvdcve.CveDB.updateVulnerability (CveDB.java:1093)
at org.owasp.dependencycheck.data.update.nvd.api.NvdApiProcessor.updateCveDb (NvdApiProcessor.java:119)
at org.owasp.dependencycheck.data.update.nvd.api.NvdApiProcessor.call (NvdApiProcessor.java:96)
at org.owasp.dependencycheck.data.update.nvd.api.NvdApiProcessor.call (NvdApiProcessor.java:40)
at java.util.concurrent.FutureTask.run (FutureTask.java:264)
at java.util.concurrent.ThreadPoolExecutor.runWorker (ThreadPoolExecutor.java:1136)
at java.util.concurrent.ThreadPoolExecutor$Worker.run (ThreadPoolExecutor.java:635)
at java.lang.Thread.run (Thread.java:840)
[ERROR] Failed to process CVE-2008-6890
java.lang.NullPointerException: Cannot invoke "org.apache.commons.dbcp2.BasicDataSource.getConnection()" because "this.connectionPool" is null
at org.owasp.dependencycheck.data.nvdcve.DatabaseManager.getConnection (DatabaseManager.java:576)
at org.owasp.dependencycheck.data.nvdcve.CveDB.updateOrInsertVulnerability (CveDB.java:1168)
at org.owasp.dependencycheck.data.nvdcve.CveDB.updateVulnerability (CveDB.java:1093)
at org.owasp.dependencycheck.data.update.nvd.api.NvdApiProcessor.updateCveDb (NvdApiProcessor.java:119)
at org.owasp.dependencycheck.data.update.nvd.api.NvdApiProcessor.call (NvdApiProcessor.java:96)
at org.owasp.dependencycheck.data.update.nvd.api.NvdApiProcessor.call (NvdApiProcessor.java:40)
at java.util.concurrent.FutureTask.run (FutureTask.java:264)
at java.util.concurrent.ThreadPoolExecutor.runWorker (ThreadPoolExecutor.java:1136)
at java.util.concurrent.ThreadPoolExecutor$Worker.run (ThreadPoolExecutor.java:635)
at java.lang.Thread.run (Thread.java:840)
[ERROR] Failed to process CVE-2008-6891
java.lang.NullPointerException: Cannot invoke "org.apache.commons.dbcp2.BasicDataSource.getConnection()" because "this.connectionPool" is null
at org.owasp.dependencycheck.data.nvdcve.DatabaseManager.getConnection (DatabaseManager.java:576)
at org.owasp.dependencycheck.data.nvdcve.CveDB.updateOrInsertVulnerability (CveDB.java:1168)
at org.owasp.dependencycheck.data.nvdcve.CveDB.updateVulnerability (CveDB.java:1093)
at org.owasp.dependencycheck.data.update.nvd.api.NvdApiProcessor.updateCveDb (NvdApiProcessor.java:119)
at org.owasp.dependencycheck.data.update.nvd.api.NvdApiProcessor.call (NvdApiProcessor.java:96)
at org.owasp.dependencycheck.data.update.nvd.api.NvdApiProcessor.call (NvdApiProcessor.java:40)
at java.util.concurrent.FutureTask.run (FutureTask.java:264)
at java.util.concurrent.ThreadPoolExecutor.runWorker (ThreadPoolExecutor.java:1136)
at java.util.concurrent.ThreadPoolExecutor$Worker.run (ThreadPoolExecutor.java:635)
at java.lang.Thread.run (Thread.java:840)
[WARNING] Attempt to (de-)serialize anonymous class org.jfrog.hudson.maven2.MavenDependenciesRecorder$1; see: https://jenkins.io/redirect/serialization-of-anonymous-classes/
[INFO] ------------------------------------------------------------------------
[INFO] BUILD FAILURE
[INFO] ------------------------------------------------------------------------
[INFO] Total time: 02:27 min
[INFO] Finished at: 2026-05-16T15:30:26Z
[INFO] ------------------------------------------------------------------------
Waiting for Jenkins to finish collecting data
[ERROR] Failed to execute goal org.owasp:dependency-check-maven:12.2.2:check (default) on project jbig2-imageio: Fatal exception(s) analyzing PDFBox JBIG2 ImageIO plugin: One or more exceptions occurred during analysis:
[ERROR] UpdateException: org.h2.jdbc.JdbcBatchUpdateException: The database has been closed [90098-240]
[ERROR] caused by JdbcBatchUpdateException: The database has been closed [90098-240]
[ERROR] NoDataException: No documents exist
[ERROR] -> [Help 1]
[ERROR]
[ERROR] To see the full stack trace of the errors, re-run Maven with the -e switch.
[ERROR] Re-run Maven using the -X switch to enable full debug logging.
[ERROR]
[ERROR] For more information about the errors and possible solutions, please read the following articles:
[ERROR] [Help 1] http://cwiki.apache.org/confluence/display/MAVEN/MojoExecutionException
[JENKINS] Archiving <https://ci-builds.apache.org/job/PDFBox/job/PDFBox%20JBig2%20ImageIO%20Plugin/ws/pom.xml> to org.apache.pdfbox/jbig2-imageio/3.0.6-SNAPSHOT/jbig2-imageio-3.0.6-SNAPSHOT.pom
[JENKINS] Archiving <https://ci-builds.apache.org/job/PDFBox/job/PDFBox%20JBig2%20ImageIO%20Plugin/ws/target/jbig2-imageio-3.0.6-SNAPSHOT.jar> to org.apache.pdfbox/jbig2-imageio/3.0.6-SNAPSHOT/jbig2-imageio-3.0.6-SNAPSHOT.jar
[JENKINS] Archiving <https://ci-builds.apache.org/job/PDFBox/job/PDFBox%20JBig2%20ImageIO%20Plugin/ws/target/jbig2-imageio-3.0.6-SNAPSHOT-src.zip> to org.apache.pdfbox/jbig2-imageio/3.0.6-SNAPSHOT/jbig2-imageio-3.0.6-SNAPSHOT-src.zip
Sending e-mails to: dev@pdfbox.apache.org
channel stopped
---------------------------------------------------------------------
To unsubscribe, e-mail: dev-unsubscribe@pdfbox.apache.org
For additional commands, e-mail: dev-help@pdfbox.apache.org