You are viewing a plain text version of this content. The canonical link for it is here.
Posted to commits@beam.apache.org by Apache Jenkins Server <je...@builds.apache.org> on 2018/09/19 21:43:45 UTC

Build failed in Jenkins: beam_PostCommit_Java_Nexmark_Dataflow #442

See <https://builds.apache.org/job/beam_PostCommit_Java_Nexmark_Dataflow/442/display/redirect?page=changes>

Changes:

[amaliujia] create external table

[amaliujia] change CREATE TABLE to CREATE EXTERNAL TABLE in tests.

[amaliujia] throw ParseException to remind using create external table when input

------------------------------------------
[...truncated 125.68 KB...]
  No history is available.
Custom actions are attached to task ':beam-sdks-java-fn-execution:compileJava'.
All input files are considered out-of-date for incremental task ':beam-sdks-java-fn-execution:compileJava'.
Compiling with error-prone compiler
Note: Some input files use unchecked or unsafe operations.
Note: Recompile with -Xlint:unchecked for details.
Packing task ':beam-sdks-java-fn-execution:compileJava'
:beam-sdks-java-fn-execution:compileJava (Thread[Task worker for ':' Thread 5,5,main]) completed. Took 7.786 secs.
:beam-sdks-java-fn-execution:classes (Thread[Task worker for ':' Thread 5,5,main]) started.

> Task :beam-sdks-java-fn-execution:classes
Skipping task ':beam-sdks-java-fn-execution:classes' as it has no actions.
:beam-sdks-java-fn-execution:classes (Thread[Task worker for ':' Thread 5,5,main]) completed. Took 0.001 secs.
:beam-sdks-java-fn-execution:shadowJar (Thread[Task worker for ':' Thread 5,5,main]) started.

> Task :beam-sdks-java-fn-execution:shadowJar
Build cache key for task ':beam-sdks-java-fn-execution:shadowJar' is edf0ea79cb8921b92d5f5449dba830a3
Caching disabled for task ':beam-sdks-java-fn-execution:shadowJar': Caching has not been enabled for the task
Task ':beam-sdks-java-fn-execution:shadowJar' is not up-to-date because:
  No history is available.
*******************
GRADLE SHADOW STATS

Total Jars: 2 (includes project)
Total Time: 2.187s [2187ms]
Average Time/Jar: 1.0935s [1093.5ms]
*******************
:beam-sdks-java-fn-execution:shadowJar (Thread[Task worker for ':' Thread 5,5,main]) completed. Took 2.265 secs.

> Task :beam-runners-core-construction-java:compileJava
Note: Some input files use or override a deprecated API.
Note: Recompile with -Xlint:deprecation for details.
Note: Some input files use unchecked or unsafe operations.
Note: Recompile with -Xlint:unchecked for details.
Packing task ':beam-runners-core-construction-java:compileJava'
:beam-runners-core-construction-java:compileJava (Thread[Task worker for ':' Thread 7,5,main]) completed. Took 11.306 secs.
:beam-runners-core-construction-java:classes (Thread[Task worker for ':' Thread 7,5,main]) started.

> Task :beam-runners-core-construction-java:classes
Skipping task ':beam-runners-core-construction-java:classes' as it has no actions.
:beam-runners-core-construction-java:classes (Thread[Task worker for ':' Thread 7,5,main]) completed. Took 0.0 secs.
:beam-runners-core-construction-java:shadowJar (Thread[Task worker for ':' Thread 7,5,main]) started.

> Task :beam-runners-core-construction-java:shadowJar
Build cache key for task ':beam-runners-core-construction-java:shadowJar' is 71c47ccdb50ebe5cc282bec8128cf1d2
Caching disabled for task ':beam-runners-core-construction-java:shadowJar': Caching has not been enabled for the task
Task ':beam-runners-core-construction-java:shadowJar' is not up-to-date because:
  No history is available.
*******************
GRADLE SHADOW STATS

Total Jars: 2 (includes project)
Total Time: 1.99s [1990ms]
Average Time/Jar: 0.995s [995.0ms]
*******************
:beam-runners-core-construction-java:shadowJar (Thread[Task worker for ':' Thread 7,5,main]) completed. Took 2.309 secs.
:beam-runners-core-java:compileJava (Thread[Task worker for ':' Thread 7,5,main]) started.
:beam-runners-google-cloud-dataflow-java:compileJava (Thread[Task worker for ':',5,main]) started.

> Task :beam-runners-core-java:compileJava
Build cache key for task ':beam-runners-core-java:compileJava' is be6e6cd1d58e4343ee22d3b045162b53
Task ':beam-runners-core-java:compileJava' is not up-to-date because:
  No history is available.
Custom actions are attached to task ':beam-runners-core-java:compileJava'.
All input files are considered out-of-date for incremental task ':beam-runners-core-java:compileJava'.
Compiling with error-prone compiler
Note: Some input files use or override a deprecated API.
Note: Recompile with -Xlint:deprecation for details.
Note: Some input files use unchecked or unsafe operations.
Note: Recompile with -Xlint:unchecked for details.
Packing task ':beam-runners-core-java:compileJava'
:beam-runners-core-java:compileJava (Thread[Task worker for ':' Thread 7,5,main]) completed. Took 8.756 secs.
:beam-runners-core-java:classes (Thread[Task worker for ':' Thread 7,5,main]) started.

> Task :beam-runners-core-java:classes
Skipping task ':beam-runners-core-java:classes' as it has no actions.
:beam-runners-core-java:classes (Thread[Task worker for ':' Thread 7,5,main]) completed. Took 0.0 secs.
:beam-runners-core-java:shadowJar (Thread[Task worker for ':' Thread 7,5,main]) started.

> Task :beam-runners-google-cloud-dataflow-java:compileJava
Build cache key for task ':beam-runners-google-cloud-dataflow-java:compileJava' is 6ccbf37d5cf109ee68ac6be88f7adf44
Task ':beam-runners-google-cloud-dataflow-java:compileJava' is not up-to-date because:
  No history is available.
Custom actions are attached to task ':beam-runners-google-cloud-dataflow-java:compileJava'.
All input files are considered out-of-date for incremental task ':beam-runners-google-cloud-dataflow-java:compileJava'.
Compiling with error-prone compiler
Note: Some input files use or override a deprecated API.
Note: Recompile with -Xlint:deprecation for details.
Note: Some input files use unchecked or unsafe operations.
Note: Recompile with -Xlint:unchecked for details.
Packing task ':beam-runners-google-cloud-dataflow-java:compileJava'
:beam-runners-google-cloud-dataflow-java:compileJava (Thread[Task worker for ':',5,main]) completed. Took 9.291 secs.
:beam-runners-google-cloud-dataflow-java:classes (Thread[Task worker for ':',5,main]) started.

> Task :beam-runners-google-cloud-dataflow-java:classes
Skipping task ':beam-runners-google-cloud-dataflow-java:classes' as it has no actions.
:beam-runners-google-cloud-dataflow-java:classes (Thread[Task worker for ':',5,main]) completed. Took 0.0 secs.
:beam-runners-google-cloud-dataflow-java:shadowJar (Thread[Task worker for ':',5,main]) started.

> Task :beam-runners-core-java:shadowJar
Build cache key for task ':beam-runners-core-java:shadowJar' is 89c178a8bb6c918460b945ff481c1a7a
Caching disabled for task ':beam-runners-core-java:shadowJar': Caching has not been enabled for the task
Task ':beam-runners-core-java:shadowJar' is not up-to-date because:
  No history is available.
*******************
GRADLE SHADOW STATS

Total Jars: 2 (includes project)
Total Time: 2.203s [2203ms]
Average Time/Jar: 1.1015s [1101.5ms]
*******************
:beam-runners-core-java:shadowJar (Thread[Task worker for ':' Thread 7,5,main]) completed. Took 2.484 secs.
:beam-sdks-java-harness:compileJava (Thread[Task worker for ':' Thread 7,5,main]) started.

> Task :beam-runners-google-cloud-dataflow-java:shadowJar
Build cache key for task ':beam-runners-google-cloud-dataflow-java:shadowJar' is 1a41e2ea9af6a3a94a2b428a60b3c6cc
Caching disabled for task ':beam-runners-google-cloud-dataflow-java:shadowJar': Caching has not been enabled for the task
Task ':beam-runners-google-cloud-dataflow-java:shadowJar' is not up-to-date because:
  No history is available.
*******************
GRADLE SHADOW STATS

Total Jars: 2 (includes project)
Total Time: 2.209s [2209ms]
Average Time/Jar: 1.1045s [1104.5ms]
*******************
:beam-runners-google-cloud-dataflow-java:shadowJar (Thread[Task worker for ':',5,main]) completed. Took 2.571 secs.

> Task :beam-sdks-java-harness:compileJava
Build cache key for task ':beam-sdks-java-harness:compileJava' is 7c31a828b49563b220139a18377c4212
Task ':beam-sdks-java-harness:compileJava' is not up-to-date because:
  No history is available.
Custom actions are attached to task ':beam-sdks-java-harness:compileJava'.
All input files are considered out-of-date for incremental task ':beam-sdks-java-harness:compileJava'.
Compiling with error-prone compiler
Note: Some input files use or override a deprecated API.
Note: Recompile with -Xlint:deprecation for details.
Note: Some input files use unchecked or unsafe operations.
Note: Recompile with -Xlint:unchecked for details.
Packing task ':beam-sdks-java-harness:compileJava'
:beam-sdks-java-harness:compileJava (Thread[Task worker for ':' Thread 7,5,main]) completed. Took 5.71 secs.
:beam-sdks-java-harness:classes (Thread[Task worker for ':' Thread 7,5,main]) started.

> Task :beam-sdks-java-harness:classes
Skipping task ':beam-sdks-java-harness:classes' as it has no actions.
:beam-sdks-java-harness:classes (Thread[Task worker for ':' Thread 7,5,main]) completed. Took 0.0 secs.
:beam-sdks-java-harness:jar (Thread[Task worker for ':' Thread 7,5,main]) started.

> Task :beam-sdks-java-harness:jar
Build cache key for task ':beam-sdks-java-harness:jar' is 4a07dfcfa99b023191a684da42957e62
Caching disabled for task ':beam-sdks-java-harness:jar': Caching has not been enabled for the task
Task ':beam-sdks-java-harness:jar' is not up-to-date because:
  No history is available.
:beam-sdks-java-harness:jar (Thread[Task worker for ':' Thread 7,5,main]) completed. Took 0.032 secs.
:beam-sdks-java-harness:shadowJar (Thread[Task worker for ':' Thread 7,5,main]) started.

> Task :beam-sdks-java-harness:shadowJar
Build cache key for task ':beam-sdks-java-harness:shadowJar' is 14402559ab73ca0edcd0f5ed0f03a80f
Caching disabled for task ':beam-sdks-java-harness:shadowJar': Caching has not been enabled for the task
Task ':beam-sdks-java-harness:shadowJar' is not up-to-date because:
  No history is available.
*******************
GRADLE SHADOW STATS

Total Jars: 43 (includes project)
Total Time: 35.76s [35760ms]
Average Time/Jar: 0.8316279069767001s [831.6279069767ms]
*******************
:beam-sdks-java-harness:shadowJar (Thread[Task worker for ':' Thread 7,5,main]) completed. Took 36.219 secs.
:beam-runners-java-fn-execution:compileJava (Thread[Task worker for ':' Thread 7,5,main]) started.

> Task :beam-runners-java-fn-execution:compileJava
Build cache key for task ':beam-runners-java-fn-execution:compileJava' is 04c6f482eb0bf9b06068cf683b9bc168
Task ':beam-runners-java-fn-execution:compileJava' is not up-to-date because:
  No history is available.
Custom actions are attached to task ':beam-runners-java-fn-execution:compileJava'.
All input files are considered out-of-date for incremental task ':beam-runners-java-fn-execution:compileJava'.
Compiling with error-prone compiler
Note: <https://builds.apache.org/job/beam_PostCommit_Java_Nexmark_Dataflow/ws/src/runners/java-fn-execution/src/main/java/org/apache/beam/runners/fnexecution/ServerFactory.java> uses or overrides a deprecated API.
Note: Recompile with -Xlint:deprecation for details.
Note: Some input files use unchecked or unsafe operations.
Note: Recompile with -Xlint:unchecked for details.
Packing task ':beam-runners-java-fn-execution:compileJava'
:beam-runners-java-fn-execution:compileJava (Thread[Task worker for ':' Thread 7,5,main]) completed. Took 12.885 secs.
:beam-runners-java-fn-execution:classes (Thread[Task worker for ':' Thread 7,5,main]) started.

> Task :beam-runners-java-fn-execution:classes
Skipping task ':beam-runners-java-fn-execution:classes' as it has no actions.
:beam-runners-java-fn-execution:classes (Thread[Task worker for ':' Thread 7,5,main]) completed. Took 0.0 secs.
:beam-runners-java-fn-execution:shadowJar (Thread[Task worker for ':' Thread 7,5,main]) started.

> Task :beam-runners-java-fn-execution:shadowJar
Build cache key for task ':beam-runners-java-fn-execution:shadowJar' is 55ed79e371468871b72ad05e175465cf
Caching disabled for task ':beam-runners-java-fn-execution:shadowJar': Caching has not been enabled for the task
Task ':beam-runners-java-fn-execution:shadowJar' is not up-to-date because:
  No history is available.
*******************
GRADLE SHADOW STATS

Total Jars: 2 (includes project)
Total Time: 2.114s [2114ms]
Average Time/Jar: 1.057s [1057.0ms]
*******************
:beam-runners-java-fn-execution:shadowJar (Thread[Task worker for ':' Thread 7,5,main]) completed. Took 2.295 secs.
:beam-runners-direct-java:compileJava (Thread[Task worker for ':' Thread 7,5,main]) started.

> Task :beam-runners-direct-java:compileJava
Build cache key for task ':beam-runners-direct-java:compileJava' is 23dadc517bf986d05dc7d2633c2dd935
Task ':beam-runners-direct-java:compileJava' is not up-to-date because:
  No history is available.
Custom actions are attached to task ':beam-runners-direct-java:compileJava'.
All input files are considered out-of-date for incremental task ':beam-runners-direct-java:compileJava'.
Compiling with error-prone compiler
<https://builds.apache.org/job/beam_PostCommit_Java_Nexmark_Dataflow/ws/src/runners/direct-java/src/main/java/org/apache/beam/runners/direct/portable/ReferenceRunner.java>:268: error: cannot find symbol
        return DockerJobBundleFactory.create(jobInfo);
                                     ^
  symbol:   method create(JobInfo)
  location: class DockerJobBundleFactory
Note: Some input files use or override a deprecated API.
Note: Recompile with -Xlint:deprecation for details.
Note: Some input files use unchecked or unsafe operations.
Note: Recompile with -Xlint:unchecked for details.
1 error

> Task :beam-runners-direct-java:compileJava FAILED
:beam-runners-direct-java:compileJava (Thread[Task worker for ':' Thread 7,5,main]) completed. Took 9.246 secs.

FAILURE: Build failed with an exception.

* What went wrong:
Execution failed for task ':beam-runners-direct-java:compileJava'.
> Compilation failed with exit code 1; see the compiler error output for details.

* Try:
Run with --stacktrace option to get the stack trace. Run with --debug option to get more log output. Run with --scan to get full insights.

* Get more help at https://help.gradle.org

Deprecated Gradle features were used in this build, making it incompatible with Gradle 5.0.
See https://docs.gradle.org/4.8/userguide/command_line_interface.html#sec:command_line_warnings

BUILD FAILED in 2m 21s
59 actionable tasks: 55 executed, 4 from cache

Publishing build scan...
https://gradle.com/s/cquho5on3qzw4

Build step 'Invoke Gradle script' changed build result to FAILURE
Build step 'Invoke Gradle script' marked build as failure

Jenkins build is back to normal : beam_PostCommit_Java_Nexmark_Dataflow #444

Posted by Apache Jenkins Server <je...@builds.apache.org>.
See <https://builds.apache.org/job/beam_PostCommit_Java_Nexmark_Dataflow/444/display/redirect?page=changes>


Build failed in Jenkins: beam_PostCommit_Java_Nexmark_Dataflow #443

Posted by Apache Jenkins Server <je...@builds.apache.org>.
See <https://builds.apache.org/job/beam_PostCommit_Java_Nexmark_Dataflow/443/display/redirect>

------------------------------------------
[...truncated 125.74 KB...]
  No history is available.
Custom actions are attached to task ':beam-sdks-java-fn-execution:compileJava'.
All input files are considered out-of-date for incremental task ':beam-sdks-java-fn-execution:compileJava'.
Compiling with error-prone compiler
Note: Some input files use unchecked or unsafe operations.
Note: Recompile with -Xlint:unchecked for details.
Packing task ':beam-sdks-java-fn-execution:compileJava'
:beam-sdks-java-fn-execution:compileJava (Thread[Task worker for ':' Thread 4,5,main]) completed. Took 7.398 secs.
:beam-sdks-java-fn-execution:classes (Thread[Task worker for ':' Thread 4,5,main]) started.

> Task :beam-sdks-java-fn-execution:classes
Skipping task ':beam-sdks-java-fn-execution:classes' as it has no actions.
:beam-sdks-java-fn-execution:classes (Thread[Task worker for ':' Thread 4,5,main]) completed. Took 0.0 secs.
:beam-sdks-java-fn-execution:shadowJar (Thread[Task worker for ':' Thread 4,5,main]) started.

> Task :beam-sdks-java-fn-execution:shadowJar
Build cache key for task ':beam-sdks-java-fn-execution:shadowJar' is 23616b494b616a6c147e5469f8a303f4
Caching disabled for task ':beam-sdks-java-fn-execution:shadowJar': Caching has not been enabled for the task
Task ':beam-sdks-java-fn-execution:shadowJar' is not up-to-date because:
  No history is available.
*******************
GRADLE SHADOW STATS

Total Jars: 2 (includes project)
Total Time: 2.233s [2233ms]
Average Time/Jar: 1.1165s [1116.5ms]
*******************
:beam-sdks-java-fn-execution:shadowJar (Thread[Task worker for ':' Thread 4,5,main]) completed. Took 2.32 secs.

> Task :beam-runners-core-construction-java:compileJava
Note: Some input files use or override a deprecated API.
Note: Recompile with -Xlint:deprecation for details.
Note: Some input files use unchecked or unsafe operations.
Note: Recompile with -Xlint:unchecked for details.
Packing task ':beam-runners-core-construction-java:compileJava'
:beam-runners-core-construction-java:compileJava (Thread[Task worker for ':' Thread 5,5,main]) completed. Took 11.745 secs.
:beam-runners-core-construction-java:classes (Thread[Task worker for ':' Thread 5,5,main]) started.

> Task :beam-runners-core-construction-java:classes
Skipping task ':beam-runners-core-construction-java:classes' as it has no actions.
:beam-runners-core-construction-java:classes (Thread[Task worker for ':' Thread 5,5,main]) completed. Took 0.0 secs.
:beam-runners-core-construction-java:shadowJar (Thread[Task worker for ':' Thread 5,5,main]) started.

> Task :beam-runners-core-construction-java:shadowJar
Build cache key for task ':beam-runners-core-construction-java:shadowJar' is 349ed14adb252bfb86c7db1d72b1566d
Caching disabled for task ':beam-runners-core-construction-java:shadowJar': Caching has not been enabled for the task
Task ':beam-runners-core-construction-java:shadowJar' is not up-to-date because:
  No history is available.
*******************
GRADLE SHADOW STATS

Total Jars: 2 (includes project)
Total Time: 2.02s [2020ms]
Average Time/Jar: 1.01s [1010.0ms]
*******************
:beam-runners-core-construction-java:shadowJar (Thread[Task worker for ':' Thread 5,5,main]) completed. Took 2.359 secs.
:beam-runners-core-java:compileJava (Thread[Task worker for ':' Thread 5,5,main]) started.
:beam-runners-google-cloud-dataflow-java:compileJava (Thread[Task worker for ':' Thread 7,5,main]) started.

> Task :beam-runners-core-java:compileJava
Build cache key for task ':beam-runners-core-java:compileJava' is 72c6e3fb5d10cb08bc8ccb08e295751c
Task ':beam-runners-core-java:compileJava' is not up-to-date because:
  No history is available.
Custom actions are attached to task ':beam-runners-core-java:compileJava'.
All input files are considered out-of-date for incremental task ':beam-runners-core-java:compileJava'.
Compiling with error-prone compiler
Note: Some input files use or override a deprecated API.
Note: Recompile with -Xlint:deprecation for details.
Note: Some input files use unchecked or unsafe operations.
Note: Recompile with -Xlint:unchecked for details.
Packing task ':beam-runners-core-java:compileJava'
:beam-runners-core-java:compileJava (Thread[Task worker for ':' Thread 5,5,main]) completed. Took 9.195 secs.
:beam-runners-core-java:classes (Thread[Task worker for ':' Thread 5,5,main]) started.

> Task :beam-runners-core-java:classes
Skipping task ':beam-runners-core-java:classes' as it has no actions.
:beam-runners-core-java:classes (Thread[Task worker for ':' Thread 5,5,main]) completed. Took 0.102 secs.
:beam-runners-core-java:shadowJar (Thread[Task worker for ':' Thread 5,5,main]) started.

> Task :beam-runners-google-cloud-dataflow-java:compileJava
Build cache key for task ':beam-runners-google-cloud-dataflow-java:compileJava' is 5d873cfe0e23d0e3224a15b30ed115ae
Task ':beam-runners-google-cloud-dataflow-java:compileJava' is not up-to-date because:
  No history is available.
Custom actions are attached to task ':beam-runners-google-cloud-dataflow-java:compileJava'.
All input files are considered out-of-date for incremental task ':beam-runners-google-cloud-dataflow-java:compileJava'.
Compiling with error-prone compiler
Note: Some input files use or override a deprecated API.
Note: Recompile with -Xlint:deprecation for details.
Note: Some input files use unchecked or unsafe operations.
Note: Recompile with -Xlint:unchecked for details.
Packing task ':beam-runners-google-cloud-dataflow-java:compileJava'
:beam-runners-google-cloud-dataflow-java:compileJava (Thread[Task worker for ':' Thread 7,5,main]) completed. Took 9.947 secs.
:beam-runners-google-cloud-dataflow-java:classes (Thread[Task worker for ':' Thread 7,5,main]) started.

> Task :beam-runners-google-cloud-dataflow-java:classes
Skipping task ':beam-runners-google-cloud-dataflow-java:classes' as it has no actions.
:beam-runners-google-cloud-dataflow-java:classes (Thread[Task worker for ':' Thread 7,5,main]) completed. Took 0.0 secs.
:beam-runners-google-cloud-dataflow-java:shadowJar (Thread[Task worker for ':' Thread 7,5,main]) started.

> Task :beam-runners-core-java:shadowJar
Build cache key for task ':beam-runners-core-java:shadowJar' is 6803930141875f4dcc7dc67b03254822
Caching disabled for task ':beam-runners-core-java:shadowJar': Caching has not been enabled for the task
Task ':beam-runners-core-java:shadowJar' is not up-to-date because:
  No history is available.
*******************
GRADLE SHADOW STATS

Total Jars: 2 (includes project)
Total Time: 2.108s [2108ms]
Average Time/Jar: 1.054s [1054.0ms]
*******************
:beam-runners-core-java:shadowJar (Thread[Task worker for ':' Thread 5,5,main]) completed. Took 2.419 secs.
:beam-sdks-java-harness:compileJava (Thread[Task worker for ':' Thread 5,5,main]) started.

> Task :beam-runners-google-cloud-dataflow-java:shadowJar
Build cache key for task ':beam-runners-google-cloud-dataflow-java:shadowJar' is 2f87acebd56492a77498d1e18aad5934
Caching disabled for task ':beam-runners-google-cloud-dataflow-java:shadowJar': Caching has not been enabled for the task
Task ':beam-runners-google-cloud-dataflow-java:shadowJar' is not up-to-date because:
  No history is available.
*******************
GRADLE SHADOW STATS

Total Jars: 2 (includes project)
Total Time: 2.132s [2132ms]
Average Time/Jar: 1.066s [1066.0ms]
*******************
:beam-runners-google-cloud-dataflow-java:shadowJar (Thread[Task worker for ':' Thread 7,5,main]) completed. Took 2.409 secs.

> Task :beam-sdks-java-harness:compileJava
Build cache key for task ':beam-sdks-java-harness:compileJava' is 342f7278838a3452c0524a32133ab1d2
Task ':beam-sdks-java-harness:compileJava' is not up-to-date because:
  No history is available.
Custom actions are attached to task ':beam-sdks-java-harness:compileJava'.
All input files are considered out-of-date for incremental task ':beam-sdks-java-harness:compileJava'.
Compiling with error-prone compiler
Note: Some input files use or override a deprecated API.
Note: Recompile with -Xlint:deprecation for details.
Note: Some input files use unchecked or unsafe operations.
Note: Recompile with -Xlint:unchecked for details.
Packing task ':beam-sdks-java-harness:compileJava'
:beam-sdks-java-harness:compileJava (Thread[Task worker for ':' Thread 5,5,main]) completed. Took 5.601 secs.
:beam-sdks-java-harness:classes (Thread[Task worker for ':' Thread 5,5,main]) started.

> Task :beam-sdks-java-harness:classes
Skipping task ':beam-sdks-java-harness:classes' as it has no actions.
:beam-sdks-java-harness:classes (Thread[Task worker for ':' Thread 5,5,main]) completed. Took 0.0 secs.
:beam-sdks-java-harness:jar (Thread[Task worker for ':' Thread 5,5,main]) started.

> Task :beam-sdks-java-harness:jar
Build cache key for task ':beam-sdks-java-harness:jar' is 4a07dfcfa99b023191a684da42957e62
Caching disabled for task ':beam-sdks-java-harness:jar': Caching has not been enabled for the task
Task ':beam-sdks-java-harness:jar' is not up-to-date because:
  No history is available.
:beam-sdks-java-harness:jar (Thread[Task worker for ':' Thread 5,5,main]) completed. Took 0.054 secs.
:beam-sdks-java-harness:shadowJar (Thread[Task worker for ':' Thread 5,5,main]) started.

> Task :beam-sdks-java-harness:shadowJar
Build cache key for task ':beam-sdks-java-harness:shadowJar' is fbc7f59ca7b6269c76343185bc14f084
Caching disabled for task ':beam-sdks-java-harness:shadowJar': Caching has not been enabled for the task
Task ':beam-sdks-java-harness:shadowJar' is not up-to-date because:
  No history is available.
*******************
GRADLE SHADOW STATS

Total Jars: 43 (includes project)
Total Time: 35.059s [35059ms]
Average Time/Jar: 0.8153255813953s [815.3255813953ms]
*******************
:beam-sdks-java-harness:shadowJar (Thread[Task worker for ':' Thread 5,5,main]) completed. Took 35.491 secs.
:beam-runners-java-fn-execution:compileJava (Thread[Task worker for ':' Thread 5,5,main]) started.

> Task :beam-runners-java-fn-execution:compileJava
Build cache key for task ':beam-runners-java-fn-execution:compileJava' is ceb7ce4d2bb87dec7c34b72a2f833f7a
Task ':beam-runners-java-fn-execution:compileJava' is not up-to-date because:
  No history is available.
Custom actions are attached to task ':beam-runners-java-fn-execution:compileJava'.
All input files are considered out-of-date for incremental task ':beam-runners-java-fn-execution:compileJava'.
Compiling with error-prone compiler
Note: <https://builds.apache.org/job/beam_PostCommit_Java_Nexmark_Dataflow/ws/src/runners/java-fn-execution/src/main/java/org/apache/beam/runners/fnexecution/ServerFactory.java> uses or overrides a deprecated API.
Note: Recompile with -Xlint:deprecation for details.
Note: Some input files use unchecked or unsafe operations.
Note: Recompile with -Xlint:unchecked for details.
Packing task ':beam-runners-java-fn-execution:compileJava'
:beam-runners-java-fn-execution:compileJava (Thread[Task worker for ':' Thread 5,5,main]) completed. Took 11.893 secs.
:beam-runners-java-fn-execution:classes (Thread[Task worker for ':' Thread 5,5,main]) started.

> Task :beam-runners-java-fn-execution:classes
Skipping task ':beam-runners-java-fn-execution:classes' as it has no actions.
:beam-runners-java-fn-execution:classes (Thread[Task worker for ':' Thread 5,5,main]) completed. Took 0.0 secs.
:beam-runners-java-fn-execution:shadowJar (Thread[Task worker for ':' Thread 5,5,main]) started.

> Task :beam-runners-java-fn-execution:shadowJar
Build cache key for task ':beam-runners-java-fn-execution:shadowJar' is 729e2dfe0c0a91df1c311f11391eed9c
Caching disabled for task ':beam-runners-java-fn-execution:shadowJar': Caching has not been enabled for the task
Task ':beam-runners-java-fn-execution:shadowJar' is not up-to-date because:
  No history is available.
*******************
GRADLE SHADOW STATS

Total Jars: 2 (includes project)
Total Time: 2.173s [2173ms]
Average Time/Jar: 1.0865s [1086.5ms]
*******************
:beam-runners-java-fn-execution:shadowJar (Thread[Task worker for ':' Thread 5,5,main]) completed. Took 2.349 secs.
:beam-runners-direct-java:compileJava (Thread[Task worker for ':' Thread 5,5,main]) started.

> Task :beam-runners-direct-java:compileJava
Build cache key for task ':beam-runners-direct-java:compileJava' is 8d4d206041daa4558746a5775b52c1cc
Task ':beam-runners-direct-java:compileJava' is not up-to-date because:
  No history is available.
Custom actions are attached to task ':beam-runners-direct-java:compileJava'.
All input files are considered out-of-date for incremental task ':beam-runners-direct-java:compileJava'.
Compiling with error-prone compiler
<https://builds.apache.org/job/beam_PostCommit_Java_Nexmark_Dataflow/ws/src/runners/direct-java/src/main/java/org/apache/beam/runners/direct/portable/ReferenceRunner.java>:268: error: cannot find symbol
        return DockerJobBundleFactory.create(jobInfo);
                                     ^
  symbol:   method create(JobInfo)
  location: class DockerJobBundleFactory
Note: Some input files use or override a deprecated API.
Note: Recompile with -Xlint:deprecation for details.
Note: Some input files use unchecked or unsafe operations.
Note: Recompile with -Xlint:unchecked for details.
1 error

> Task :beam-runners-direct-java:compileJava FAILED
:beam-runners-direct-java:compileJava (Thread[Task worker for ':' Thread 5,5,main]) completed. Took 8.483 secs.

FAILURE: Build failed with an exception.

* What went wrong:
Execution failed for task ':beam-runners-direct-java:compileJava'.
> Compilation failed with exit code 1; see the compiler error output for details.

* Try:
Run with --stacktrace option to get the stack trace. Run with --debug option to get more log output. Run with --scan to get full insights.

* Get more help at https://help.gradle.org

Deprecated Gradle features were used in this build, making it incompatible with Gradle 5.0.
See https://docs.gradle.org/4.8/userguide/command_line_interface.html#sec:command_line_warnings

BUILD FAILED in 2m 19s
59 actionable tasks: 55 executed, 4 from cache

Publishing build scan...
https://gradle.com/s/tdesg4y4npshe

Build step 'Invoke Gradle script' changed build result to FAILURE
Build step 'Invoke Gradle script' marked build as failure