You are viewing a plain text version of this content. The canonical link for it is here.
Posted to dev@mesos.apache.org by Apache Jenkins Server <je...@builds.apache.org> on 2012/02/01 18:52:54 UTC
Build failed in Jenkins:
Mesos-Trunk-Ubuntu-Build-Out-Of-Src-Set-JAVA_HOME #68
See <https://builds.apache.org/job/Mesos-Trunk-Ubuntu-Build-Out-Of-Src-Set-JAVA_HOME/68/changes>
Changes:
[benh] Changed jobject to jweak where necessary.
------------------------------------------
[...truncated 13753 lines...]
[----------] 4 tests from SampleFrameworks
[ RUN ] SampleFrameworks.CppFramework
2012-02-01 17:52:39,011:18547(0x2aae30602700):ZOO_ERROR@handle_socket_error_msg@1579: Socket [127.0.0.1:42373] zk retcode=-4, errno=111(Connection refused): server refused to accept the client
2012-02-01 17:52:39,041:18547(0x2aae30e06700):ZOO_ERROR@handle_socket_error_msg@1579: Socket [127.0.0.1:39666] zk retcode=-4, errno=111(Connection refused): server refused to accept the client
2012-02-01 17:52:39,084:18547(0x2aae30401700):ZOO_ERROR@handle_socket_error_msg@1579: Socket [127.0.0.1:55020] zk retcode=-4, errno=111(Connection refused): server refused to accept the client
2012-02-01 17:52:39,115:18547(0x2aae30c05700):ZOO_ERROR@handle_socket_error_msg@1579: Socket [127.0.0.1:48874] zk retcode=-4, errno=111(Connection refused): server refused to accept the client
2012-02-01 17:52:39,317:18547(0x2aae30200700):ZOO_ERROR@handle_socket_error_msg@1579: Socket [127.0.0.1:50708] zk retcode=-4, errno=111(Connection refused): server refused to accept the client
2012-02-01 17:52:41,012:18547(0x2aae30602700):ZOO_ERROR@handle_socket_error_msg@1579: Socket [127.0.0.1:42373] zk retcode=-4, errno=111(Connection refused): server refused to accept the client
2012-02-01 17:52:41,043:18547(0x2aae30e06700):ZOO_ERROR@handle_socket_error_msg@1579: Socket [127.0.0.1:39666] zk retcode=-4, errno=111(Connection refused): server refused to accept the client
2012-02-01 17:52:41,086:18547(0x2aae30401700):ZOO_ERROR@handle_socket_error_msg@1579: Socket [127.0.0.1:55020] zk retcode=-4, errno=111(Connection refused): server refused to accept the client
2012-02-01 17:52:41,118:18547(0x2aae30c05700):ZOO_ERROR@handle_socket_error_msg@1579: Socket [127.0.0.1:48874] zk retcode=-4, errno=111(Connection refused): server refused to accept the client
2012-02-01 17:52:41,319:18547(0x2aae30200700):ZOO_ERROR@handle_socket_error_msg@1579: Socket [127.0.0.1:50708] zk retcode=-4, errno=111(Connection refused): server refused to accept the client
[ OK ] SampleFrameworks.CppFramework (5465 ms)
[ RUN ] SampleFrameworks.JavaFramework
2012-02-01 17:52:43,014:18547(0x2aae30602700):ZOO_ERROR@handle_socket_error_msg@1579: Socket [127.0.0.1:42373] zk retcode=-4, errno=111(Connection refused): server refused to accept the client
2012-02-01 17:52:43,045:18547(0x2aae30e06700):ZOO_ERROR@handle_socket_error_msg@1579: Socket [127.0.0.1:39666] zk retcode=-4, errno=111(Connection refused): server refused to accept the client
2012-02-01 17:52:43,088:18547(0x2aae30401700):ZOO_ERROR@handle_socket_error_msg@1579: Socket [127.0.0.1:55020] zk retcode=-4, errno=111(Connection refused): server refused to accept the client
2012-02-01 17:52:43,119:18547(0x2aae30c05700):ZOO_ERROR@handle_socket_error_msg@1579: Socket [127.0.0.1:48874] zk retcode=-4, errno=111(Connection refused): server refused to accept the client
2012-02-01 17:52:43,321:18547(0x2aae30200700):ZOO_ERROR@handle_socket_error_msg@1579: Socket [127.0.0.1:50708] zk retcode=-4, errno=111(Connection refused): server refused to accept the client
../../src/tests/external_tests.cpp:64: Failure
Value of: exitCode
Actual: 256
Expected: 0
External test JavaFramework failed
[ FAILED ] SampleFrameworks.JavaFramework (372 ms)
[ RUN ] SampleFrameworks.JavaExceptionFramework
../../src/tests/external_tests.cpp:64: Failure
Value of: exitCode
Actual: 256
Expected: 0
External test JavaExceptionFramework failed
[ FAILED ] SampleFrameworks.JavaExceptionFramework (242 ms)
[ RUN ] SampleFrameworks.PythonFramework
2012-02-01 17:52:45,016:18547(0x2aae30602700):ZOO_ERROR@handle_socket_error_msg@1579: Socket [127.0.0.1:42373] zk retcode=-4, errno=111(Connection refused): server refused to accept the client
2012-02-01 17:52:45,047:18547(0x2aae30e06700):ZOO_ERROR@handle_socket_error_msg@1579: Socket [127.0.0.1:39666] zk retcode=-4, errno=111(Connection refused): server refused to accept the client
2012-02-01 17:52:45,090:18547(0x2aae30401700):ZOO_ERROR@handle_socket_error_msg@1579: Socket [127.0.0.1:55020] zk retcode=-4, errno=111(Connection refused): server refused to accept the client
2012-02-01 17:52:45,120:18547(0x2aae30c05700):ZOO_ERROR@handle_socket_error_msg@1579: Socket [127.0.0.1:48874] zk retcode=-4, errno=111(Connection refused): server refused to accept the client
2012-02-01 17:52:45,323:18547(0x2aae30200700):ZOO_ERROR@handle_socket_error_msg@1579: Socket [127.0.0.1:50708] zk retcode=-4, errno=111(Connection refused): server refused to accept the client
2012-02-01 17:52:47,018:18547(0x2aae30602700):ZOO_ERROR@handle_socket_error_msg@1579: Socket [127.0.0.1:42373] zk retcode=-4, errno=111(Connection refused): server refused to accept the client
2012-02-01 17:52:47,049:18547(0x2aae30e06700):ZOO_ERROR@handle_socket_error_msg@1579: Socket [127.0.0.1:39666] zk retcode=-4, errno=111(Connection refused): server refused to accept the client
2012-02-01 17:52:47,092:18547(0x2aae30401700):ZOO_ERROR@handle_socket_error_msg@1579: Socket [127.0.0.1:55020] zk retcode=-4, errno=111(Connection refused): server refused to accept the client
2012-02-01 17:52:47,122:18547(0x2aae30c05700):ZOO_ERROR@handle_socket_error_msg@1579: Socket [127.0.0.1:48874] zk retcode=-4, errno=111(Connection refused): server refused to accept the client
2012-02-01 17:52:47,325:18547(0x2aae30200700):ZOO_ERROR@handle_socket_error_msg@1579: Socket [127.0.0.1:50708] zk retcode=-4, errno=111(Connection refused): server refused to accept the client
2012-02-01 17:52:49,020:18547(0x2aae30602700):ZOO_ERROR@handle_socket_error_msg@1579: Socket [127.0.0.1:42373] zk retcode=-4, errno=111(Connection refused): server refused to accept the client
2012-02-01 17:52:49,051:18547(0x2aae30e06700):ZOO_ERROR@handle_socket_error_msg@1579: Socket [127.0.0.1:39666] zk retcode=-4, errno=111(Connection refused): server refused to accept the client
2012-02-01 17:52:49,094:18547(0x2aae30401700):ZOO_ERROR@handle_socket_error_msg@1579: Socket [127.0.0.1:55020] zk retcode=-4, errno=111(Connection refused): server refused to accept the client
2012-02-01 17:52:49,123:18547(0x2aae30c05700):ZOO_ERROR@handle_socket_error_msg@1579: Socket [127.0.0.1:48874] zk retcode=-4, errno=111(Connection refused): server refused to accept the client
2012-02-01 17:52:49,327:18547(0x2aae30200700):ZOO_ERROR@handle_socket_error_msg@1579: Socket [127.0.0.1:50708] zk retcode=-4, errno=111(Connection refused): server refused to accept the client
[ OK ] SampleFrameworks.PythonFramework (5854 ms)
[----------] 4 tests from SampleFrameworks (11933 ms total)
[----------] 1 test from UUIDTest
[ RUN ] UUIDTest.test
[ OK ] UUIDTest.test (1 ms)
[----------] 1 test from UUIDTest (1 ms total)
[----------] 20 tests from ResourcesTest
[ RUN ] ResourcesTest.Parsing
[ OK ] ResourcesTest.Parsing (0 ms)
[ RUN ] ResourcesTest.Printing
[ OK ] ResourcesTest.Printing (0 ms)
[ RUN ] ResourcesTest.InitializedIsEmpty
[ OK ] ResourcesTest.InitializedIsEmpty (0 ms)
[ RUN ] ResourcesTest.BadResourcesNotAllocatable
[ OK ] ResourcesTest.BadResourcesNotAllocatable (0 ms)
[ RUN ] ResourcesTest.ScalarEquals
[ OK ] ResourcesTest.ScalarEquals (0 ms)
[ RUN ] ResourcesTest.ScalarSubset
[ OK ] ResourcesTest.ScalarSubset (0 ms)
[ RUN ] ResourcesTest.ScalarAddition
[ OK ] ResourcesTest.ScalarAddition (0 ms)
[ RUN ] ResourcesTest.ScalarSubtraction
[ OK ] ResourcesTest.ScalarSubtraction (0 ms)
[ RUN ] ResourcesTest.RangesEquals
[ OK ] ResourcesTest.RangesEquals (0 ms)
[ RUN ] ResourcesTest.RangesSubset
[ OK ] ResourcesTest.RangesSubset (0 ms)
[ RUN ] ResourcesTest.RangesAddition
[ OK ] ResourcesTest.RangesAddition (0 ms)
[ RUN ] ResourcesTest.RangesSubtraction
[ OK ] ResourcesTest.RangesSubtraction (0 ms)
[ RUN ] ResourcesTest.RangesSubtraction1
[ OK ] ResourcesTest.RangesSubtraction1 (0 ms)
[ RUN ] ResourcesTest.RangesSubtraction2
[ OK ] ResourcesTest.RangesSubtraction2 (0 ms)
[ RUN ] ResourcesTest.RangesSubtraction3
[ OK ] ResourcesTest.RangesSubtraction3 (0 ms)
[ RUN ] ResourcesTest.RangesSubtraction4
[ OK ] ResourcesTest.RangesSubtraction4 (0 ms)
[ RUN ] ResourcesTest.SetEquals
[ OK ] ResourcesTest.SetEquals (0 ms)
[ RUN ] ResourcesTest.SetSubset
[ OK ] ResourcesTest.SetSubset (0 ms)
[ RUN ] ResourcesTest.SetAddition
[ OK ] ResourcesTest.SetAddition (0 ms)
[ RUN ] ResourcesTest.SetSubtraction
[ OK ] ResourcesTest.SetSubtraction (0 ms)
[----------] 20 tests from ResourcesTest (1 ms total)
[----------] 3 tests from ReplicaTest
[ RUN ] ReplicaTest.Promise
[ OK ] ReplicaTest.Promise (60 ms)
[ RUN ] ReplicaTest.Append
[ OK ] ReplicaTest.Append (7 ms)
[ RUN ] ReplicaTest.Recover
[ OK ] ReplicaTest.Recover (24 ms)
[----------] 3 tests from ReplicaTest (91 ms total)
[----------] 16 tests from CoordinatorTest
[ RUN ] CoordinatorTest.Elect
[ OK ] CoordinatorTest.Elect (29 ms)
[ RUN ] CoordinatorTest.AppendRead
[ OK ] CoordinatorTest.AppendRead (21 ms)
[ RUN ] CoordinatorTest.AppendReadError
[ OK ] CoordinatorTest.AppendReadError (20 ms)
[ RUN ] CoordinatorTest.Failover
[ OK ] CoordinatorTest.Failover (25 ms)
[ RUN ] CoordinatorTest.Demoted
[ OK ] CoordinatorTest.Demoted (28 ms)
[ RUN ] CoordinatorTest.Fill
[ OK ] CoordinatorTest.Fill (56 ms)
[ RUN ] CoordinatorTest.NotLearnedFill
[ OK ] CoordinatorTest.NotLearnedFill (34 ms)
[ RUN ] CoordinatorTest.MultipleAppends
[ OK ] CoordinatorTest.MultipleAppends (44 ms)
[ RUN ] CoordinatorTest.MultipleAppendsNotLearnedFill
[ OK ] CoordinatorTest.MultipleAppendsNotLearnedFill (83 ms)
[ RUN ] CoordinatorTest.Truncate
[ OK ] CoordinatorTest.Truncate (36 ms)
[ RUN ] CoordinatorTest.TruncateNotLearnedFill
[ OK ] CoordinatorTest.TruncateNotLearnedFill (88 ms)
[ RUN ] CoordinatorTest.RacingElect
[ OK ] CoordinatorTest.RacingElect (0 ms)
[ RUN ] CoordinatorTest.FillNoQuorum
[ OK ] CoordinatorTest.FillNoQuorum (0 ms)
[ RUN ] CoordinatorTest.FillInconsistent
[ OK ] CoordinatorTest.FillInconsistent (0 ms)
[ RUN ] CoordinatorTest.LearnedOnOneReplica_NotLearnedOnAnother
[ OK ] CoordinatorTest.LearnedOnOneReplica_NotLearnedOnAnother (0 ms)
[ RUN ] CoordinatorTest.LearnedOnOneReplica_NotLearnedOnAnother_AnotherFailsAndRecovers
[ OK ] CoordinatorTest.LearnedOnOneReplica_NotLearnedOnAnother_AnotherFailsAndRecovers (0 ms)
[----------] 16 tests from CoordinatorTest (464 ms total)
[----------] 2 tests from LogTest
[ RUN ] LogTest.WriteRead
[ OK ] LogTest.WriteRead (16 ms)
[ RUN ] LogTest.Position
[ OK ] LogTest.Position (19 ms)
[----------] 2 tests from LogTest (35 ms total)
[----------] 9 tests from FaultToleranceTest
[ RUN ] FaultToleranceTest.SlaveLost
[ OK ] FaultToleranceTest.SlaveLost (1 ms)
[ RUN ] FaultToleranceTest.SlavePartitioned
[ OK ] FaultToleranceTest.SlavePartitioned (3 ms)
[ RUN ] FaultToleranceTest.SchedulerFailover
[ OK ] FaultToleranceTest.SchedulerFailover (2 ms)
[ RUN ] FaultToleranceTest.FrameworkReliableRegistration
2012-02-01 17:52:51,022:18547(0x2aae30602700):ZOO_ERROR@handle_socket_error_msg@1579: Socket [127.0.0.1:42373] zk retcode=-4, errno=111(Connection refused): server refused to accept the client
2012-02-01 17:52:51,053:18547(0x2aae30e06700):ZOO_ERROR@handle_socket_error_msg@1579: Socket [127.0.0.1:39666] zk retcode=-4, errno=111(Connection refused): server refused to accept the client
[ OK ] FaultToleranceTest.FrameworkReliableRegistration (1019 ms)
[ RUN ] FaultToleranceTest.FrameworkReregister
[ OK ] FaultToleranceTest.FrameworkReregister (2 ms)
[ RUN ] FaultToleranceTest.SchedulerFailoverStatusUpdate
2012-02-01 17:52:51,097:18547(0x2aae30401700):ZOO_ERROR@handle_socket_error_msg@1579: Socket [127.0.0.1:55020] zk retcode=-4, errno=111(Connection refused): server refused to accept the client
2012-02-01 17:52:51,125:18547(0x2aae30c05700):ZOO_ERROR@handle_socket_error_msg@1579: Socket [127.0.0.1:48874] zk retcode=-4, errno=111(Connection refused): server refused to accept the client
[ OK ] FaultToleranceTest.SchedulerFailoverStatusUpdate (56 ms)
[ RUN ] FaultToleranceTest.SchedulerFailoverFrameworkMessage
[ OK ] FaultToleranceTest.SchedulerFailoverFrameworkMessage (12 ms)
[ RUN ] FaultToleranceTest.SlaveReliableRegistration
2012-02-01 17:52:51,329:18547(0x2aae30200700):ZOO_ERROR@handle_socket_error_msg@1579: Socket [127.0.0.1:50708] zk retcode=-4, errno=111(Connection refused): server refused to accept the client
[ OK ] FaultToleranceTest.SlaveReliableRegistration (991 ms)
[ RUN ] FaultToleranceTest.SlaveReregister
[ OK ] FaultToleranceTest.SlaveReregister (1 ms)
[----------] 9 tests from FaultToleranceTest (2087 ms total)
[----------] 7 tests from ResourceOffersTest
[ RUN ] ResourceOffersTest.ResourceOfferWithMultipleSlaves
[ OK ] ResourceOffersTest.ResourceOfferWithMultipleSlaves (2 ms)
[ RUN ] ResourceOffersTest.TaskUsesNoResources
[ OK ] ResourceOffersTest.TaskUsesNoResources (3 ms)
[ RUN ] ResourceOffersTest.TaskUsesInvalidResources
[ OK ] ResourceOffersTest.TaskUsesInvalidResources (2 ms)
[ RUN ] ResourceOffersTest.TaskUsesMoreResourcesThanOffered
[ OK ] ResourceOffersTest.TaskUsesMoreResourcesThanOffered (2 ms)
[ RUN ] ResourceOffersTest.ResourcesGetReofferedWhenUnused
[ OK ] ResourceOffersTest.ResourcesGetReofferedWhenUnused (2 ms)
[ RUN ] ResourceOffersTest.ResourcesGetReofferedAfterTaskDescriptionError
[ OK ] ResourceOffersTest.ResourcesGetReofferedAfterTaskDescriptionError (3 ms)
[ RUN ] ResourceOffersTest.ResourceRequest
[ OK ] ResourceOffersTest.ResourceRequest (1 ms)
[----------] 7 tests from ResourceOffersTest (15 ms total)
[----------] 4 tests from MasterTest
[ RUN ] MasterTest.TaskRunning
[ OK ] MasterTest.TaskRunning (5 ms)
[ RUN ] MasterTest.KillTask
[ OK ] MasterTest.KillTask (4 ms)
[ RUN ] MasterTest.FrameworkMessage
[ OK ] MasterTest.FrameworkMessage (5 ms)
[ RUN ] MasterTest.MultipleExecutors
[ OK ] MasterTest.MultipleExecutors (6 ms)
[----------] 4 tests from MasterTest (20 ms total)
[----------] 5 tests from FrameworksManagerTestFixture
[ RUN ] FrameworksManagerTestFixture.AddFramework
[ OK ] FrameworksManagerTestFixture.AddFramework (1 ms)
[ RUN ] FrameworksManagerTestFixture.RemoveFramework
[ OK ] FrameworksManagerTestFixture.RemoveFramework (3 ms)
[ RUN ] FrameworksManagerTestFixture.ResurrectFramework
[ OK ] FrameworksManagerTestFixture.ResurrectFramework (1 ms)
[ RUN ] FrameworksManagerTestFixture.ResurrectExpiringFramework
[ OK ] FrameworksManagerTestFixture.ResurrectExpiringFramework (1 ms)
[ RUN ] FrameworksManagerTestFixture.ResurrectInterspersedExpiringFrameworks
[ OK ] FrameworksManagerTestFixture.ResurrectInterspersedExpiringFrameworks (1 ms)
[----------] 5 tests from FrameworksManagerTestFixture (7 ms total)
[----------] 1 test from FrameworksManagerTest
[ RUN ] FrameworksManagerTest.CacheFailure
E0201 17:52:52.173900 18569 frameworks_manager.cpp:213] Error getting framework info from underlying storage: Fake Caching Error.
E0201 17:52:52.174399 18567 frameworks_manager.cpp:213] Error getting framework info from underlying storage: Fake Caching Error.
[ OK ] FrameworksManagerTest.CacheFailure (1 ms)
[----------] 1 test from FrameworksManagerTest (1 ms total)
[----------] Global test environment tear-down
[==========] 120 tests from 21 test cases ran. (29548 ms total)
[ PASSED ] 118 tests.
[ FAILED ] 2 tests, listed below:
[ FAILED ] SampleFrameworks.JavaFramework
[ FAILED ] SampleFrameworks.JavaExceptionFramework
2 FAILED TESTS
YOU HAVE 6 DISABLED TESTS
FAIL: mesos-tests
==================
1 of 1 test failed
==================
make[3]: *** [check-TESTS] Error 1
make[3]: Leaving directory `<https://builds.apache.org/job/Mesos-Trunk-Ubuntu-Build-Out-Of-Src-Set-JAVA_HOME/ws/build/src'>
make[2]: *** [check-am] Error 2
make[2]: Leaving directory `<https://builds.apache.org/job/Mesos-Trunk-Ubuntu-Build-Out-Of-Src-Set-JAVA_HOME/ws/build/src'>
make[1]: *** [check] Error 2
make[1]: Leaving directory `<https://builds.apache.org/job/Mesos-Trunk-Ubuntu-Build-Out-Of-Src-Set-JAVA_HOME/ws/build/src'>
make: *** [check-recursive] Error 1
Build step 'Execute shell' marked build as failure
Publishing Clover coverage report...
Clover xml file does not exist in: <https://builds.apache.org/job/Mesos-Trunk-Ubuntu-Build-Out-Of-Src-Set-JAVA_HOME/ws/> called: clover.xml and will not be copied to: /home/hudson/hudson/jobs/Mesos-Trunk-Ubuntu-Build-Out-Of-Src-Set-JAVA_HOME/builds/2012-02-01_17-39-36/clover.xml
Could not find '/clover.xml'. Did you generate the XML report for Clover?
Jenkins build is back to normal :
Mesos-Trunk-Ubuntu-Build-Out-Of-Src-Set-JAVA_HOME #69
Posted by Apache Jenkins Server <je...@builds.apache.org>.
See <https://builds.apache.org/job/Mesos-Trunk-Ubuntu-Build-Out-Of-Src-Set-JAVA_HOME/69/>
Re: Build failed in Jenkins: Mesos-Trunk-Ubuntu-Build-Out-Of-Src-Set-JAVA_HOME
#68
Posted by Andy Konwinski <an...@berkeley.edu>.
I think this is an issue with not having the correct Java on the path in
the Jenkins script. I've updated it and am re-running now.
https://builds.apache.org/job/Mesos-Trunk-Ubuntu-Build-Out-Of-Src-Set-JAVA_HOME/69/console
On Wed, Feb 1, 2012 at 11:11 AM, Charles Reiss <ch...@eecs.berkeley.edu>wrote:
> On 2/1/12 9:52 AM, Apache Jenkins Server wrote:
> > See <
> https://builds.apache.org/job/Mesos-Trunk-Ubuntu-Build-Out-Of-Src-Set-JAVA_HOME/68/changes
> >
> [snip]
>
> From test_output/SampleFrameworks/JavaFrameworks/stderr for this build:
>
> Exception in thread "main" java.lang.UnsatisfiedLinkError:
>
> /x1/jenkins/jenkins-slave/workspace/Mesos-Trunk-Ubuntu-Build-Out-Of-Src-Set-JAVA_HOME/build/src/.libs/libmesos.so.0.0.0:
>
> /x1/jenkins/jenkins-slave/workspace/Mesos-Trunk-Ubuntu-Build-Out-Of-Src-Set-JAVA_HOME/build/src/.libs/libmesos.so.0.0.0:
> wrong ELF class: ELFCLASS64 (Possible cause: architecture word width
> mismatch)
> at java.lang.ClassLoader$NativeLibrary.load(Native Method)
> at java.lang.ClassLoader.loadLibrary0(ClassLoader.java:1807)
> at java.lang.ClassLoader.loadLibrary(ClassLoader.java:1732)
> at java.lang.Runtime.loadLibrary0(Runtime.java:823)
> at java.lang.System.loadLibrary(System.java:1028)
> at
>
> org.apache.mesos.MesosSchedulerDriver.<clinit>(MesosSchedulerDriver.java:51)
> at TestFramework.main(TestFramework.java:133)
>
>
Re: Build failed in Jenkins: Mesos-Trunk-Ubuntu-Build-Out-Of-Src-Set-JAVA_HOME
#68
Posted by Charles Reiss <ch...@eecs.berkeley.edu>.
On 2/1/12 9:52 AM, Apache Jenkins Server wrote:
> See <https://builds.apache.org/job/Mesos-Trunk-Ubuntu-Build-Out-Of-Src-Set-JAVA_HOME/68/changes>
[snip]
>From test_output/SampleFrameworks/JavaFrameworks/stderr for this build:
Exception in thread "main" java.lang.UnsatisfiedLinkError:
/x1/jenkins/jenkins-slave/workspace/Mesos-Trunk-Ubuntu-Build-Out-Of-Src-Set-JAVA_HOME/build/src/.libs/libmesos.so.0.0.0:
/x1/jenkins/jenkins-slave/workspace/Mesos-Trunk-Ubuntu-Build-Out-Of-Src-Set-JAVA_HOME/build/src/.libs/libmesos.so.0.0.0:
wrong ELF class: ELFCLASS64 (Possible cause: architecture word width
mismatch)
at java.lang.ClassLoader$NativeLibrary.load(Native Method)
at java.lang.ClassLoader.loadLibrary0(ClassLoader.java:1807)
at java.lang.ClassLoader.loadLibrary(ClassLoader.java:1732)
at java.lang.Runtime.loadLibrary0(Runtime.java:823)
at java.lang.System.loadLibrary(System.java:1028)
at
org.apache.mesos.MesosSchedulerDriver.<clinit>(MesosSchedulerDriver.java:51)
at TestFramework.main(TestFramework.java:133)