You are viewing a plain text version of this content. The canonical link for it is here.
Posted to dev@trafodion.apache.org by st...@esgyn.com on 2016/12/01 12:40:00 UTC
Trafodion master Daily Test Result - 409 - Still Failing
Daily Automated Testing master
Jenkins Job: https://jenkins.esgyn.com/job/Check-Daily-master/409/
Archived Logs: http://traf-testlogs.esgyn.com/Daily-master/409
Bld Downloads: http://traf-builds.esgyn.com
Changes since previous daily build:
[joshuamurdoc] Implement LOG() function for any base
[dbirdsall] [TRAFODION-2371] Fix ALTER TALBE RENAME for IDENTITY columns
[joshuamurdoc] Add tests for builtin function LOG() of any base
[dbirdsall] [TRAFODION-2378] Update Messages Guide for messages 1002-1015
[ming.liu] [TRAFODION-2355] document about IP address/hashing functions
[ming.liu] [TRAFODION-2355] fix copyTopN defect for other functions
Test Job Results:
FAILURE core-regress-compGeneral-cdh (47 min)
FAILURE core-regress-compGeneral-hdp (1 hr 19 min)
FAILURE core-regress-privs2-cdh (1 hr 3 min)
FAILURE core-regress-privs2-hdp (1 hr 26 min)
FAILURE core-regress-udr-cdh (27 min)
FAILURE core-regress-udr-hdp (41 min)
SUCCESS build-rh6-master-debug (40 min)
SUCCESS build-rh6-master-release (41 min)
SUCCESS core-regress-charsets-cdh (46 min)
SUCCESS core-regress-charsets-hdp (51 min)
SUCCESS core-regress-core-cdh (1 hr 9 min)
SUCCESS core-regress-core-hdp (1 hr 32 min)
SUCCESS core-regress-executor-cdh (1 hr 20 min)
SUCCESS core-regress-executor-hdp (1 hr 57 min)
SUCCESS core-regress-fullstack2-cdh (10 min)
SUCCESS core-regress-fullstack2-hdp (13 min)
SUCCESS core-regress-hive-cdh (53 min)
SUCCESS core-regress-hive-hdp (51 min)
SUCCESS core-regress-privs1-cdh (1 hr 1 min)
SUCCESS core-regress-privs1-hdp (1 hr 5 min)
SUCCESS core-regress-qat-cdh (29 min)
SUCCESS core-regress-qat-hdp (25 min)
SUCCESS core-regress-seabase-cdh (1 hr 27 min)
SUCCESS core-regress-seabase-hdp (2 hr 4 min)
SUCCESS jdbc_test-cdh (41 min)
SUCCESS jdbc_test-hdp (45 min)
SUCCESS phoenix_part1_T2-cdh (1 hr 7 min)
SUCCESS phoenix_part1_T2-hdp (1 hr 37 min)
SUCCESS phoenix_part1_T4-cdh (1 hr 3 min)
SUCCESS phoenix_part1_T4-hdp (1 hr 30 min)
SUCCESS phoenix_part2_T2-cdh (1 hr 5 min)
SUCCESS phoenix_part2_T2-hdp (1 hr 34 min)
SUCCESS phoenix_part2_T4-cdh (1 hr 10 min)
SUCCESS phoenix_part2_T4-hdp (1 hr 23 min)
SUCCESS pyodbc_test-cdh (17 min)
SUCCESS pyodbc_test-hdp (17 min)
Trafodion master Daily Test Result - 414 - Fixed
Posted by st...@esgyn.com.
Daily Automated Testing master
Jenkins Job: https://jenkins.esgyn.com/job/Check-Daily-master/414/
Archived Logs: http://traf-testlogs.esgyn.com/Daily-master/414
Bld Downloads: http://traf-builds.esgyn.com
Changes since previous daily build:
No changes
Test Job Results:
SUCCESS build-rh6-master-debug (38 min)
SUCCESS build-rh6-master-release (41 min)
SUCCESS core-regress-charsets-cdh (32 min)
SUCCESS core-regress-charsets-hdp (59 min)
SUCCESS core-regress-compGeneral-cdh (59 min)
SUCCESS core-regress-compGeneral-hdp (1 hr 12 min)
SUCCESS core-regress-core-cdh (1 hr 0 min)
SUCCESS core-regress-core-hdp (1 hr 35 min)
SUCCESS core-regress-executor-cdh (1 hr 34 min)
SUCCESS core-regress-executor-hdp (1 hr 43 min)
SUCCESS core-regress-fullstack2-cdh (10 min)
SUCCESS core-regress-fullstack2-hdp (21 min)
SUCCESS core-regress-hive-cdh (53 min)
SUCCESS core-regress-hive-hdp (49 min)
SUCCESS core-regress-privs1-cdh (56 min)
SUCCESS core-regress-privs1-hdp (1 hr 0 min)
SUCCESS core-regress-privs2-cdh (1 hr 13 min)
SUCCESS core-regress-privs2-hdp (1 hr 15 min)
SUCCESS core-regress-qat-cdh (18 min)
SUCCESS core-regress-qat-hdp (30 min)
SUCCESS core-regress-seabase-cdh (1 hr 33 min)
SUCCESS core-regress-seabase-hdp (2 hr 3 min)
SUCCESS core-regress-udr-cdh (33 min)
SUCCESS core-regress-udr-hdp (52 min)
SUCCESS jdbc_test-cdh (41 min)
SUCCESS jdbc_test-hdp (44 min)
SUCCESS phoenix_part1_T2-cdh (1 hr 4 min)
SUCCESS phoenix_part1_T2-hdp (1 hr 41 min)
SUCCESS phoenix_part1_T4-cdh (1 hr 9 min)
SUCCESS phoenix_part1_T4-hdp (1 hr 34 min)
SUCCESS phoenix_part2_T2-cdh (1 hr 8 min)
SUCCESS phoenix_part2_T2-hdp (1 hr 33 min)
SUCCESS phoenix_part2_T4-cdh (1 hr 5 min)
SUCCESS phoenix_part2_T4-hdp (1 hr 29 min)
SUCCESS pyodbc_test-cdh (18 min)
SUCCESS pyodbc_test-hdp (18 min)
Trafodion master Daily Test Result - 413 - Still Failing
Posted by st...@esgyn.com.
Daily Automated Testing master
Jenkins Job: https://jenkins.esgyn.com/job/Check-Daily-master/413/
Archived Logs: http://traf-testlogs.esgyn.com/Daily-master/413
Bld Downloads: http://traf-builds.esgyn.com
Changes since previous daily build:
[mashengchen] TRAFODION-2374
[mashengchen] add copyright & one more test case
[anoop.sharma] updated expected files that changed due to a previous err msg checkin
Test Job Results:
FAILURE phoenix_part1_T4-hdp (14 min)
SUCCESS build-rh6-master-debug (24 min)
SUCCESS build-rh6-master-release (40 min)
SUCCESS core-regress-charsets-cdh (46 min)
SUCCESS core-regress-charsets-hdp (46 min)
SUCCESS core-regress-compGeneral-cdh (47 min)
SUCCESS core-regress-compGeneral-hdp (1 hr 11 min)
SUCCESS core-regress-core-cdh (1 hr 13 min)
SUCCESS core-regress-core-hdp (1 hr 17 min)
SUCCESS core-regress-executor-cdh (1 hr 22 min)
SUCCESS core-regress-executor-hdp (1 hr 42 min)
SUCCESS core-regress-fullstack2-cdh (16 min)
SUCCESS core-regress-fullstack2-hdp (32 min)
SUCCESS core-regress-hive-cdh (45 min)
SUCCESS core-regress-hive-hdp (49 min)
SUCCESS core-regress-privs1-cdh (52 min)
SUCCESS core-regress-privs1-hdp (58 min)
SUCCESS core-regress-privs2-cdh (1 hr 10 min)
SUCCESS core-regress-privs2-hdp (1 hr 13 min)
SUCCESS core-regress-qat-cdh (24 min)
SUCCESS core-regress-qat-hdp (24 min)
SUCCESS core-regress-seabase-cdh (1 hr 24 min)
SUCCESS core-regress-seabase-hdp (1 hr 51 min)
SUCCESS core-regress-udr-cdh (38 min)
SUCCESS core-regress-udr-hdp (34 min)
SUCCESS jdbc_test-cdh (42 min)
SUCCESS jdbc_test-hdp (45 min)
SUCCESS phoenix_part1_T2-cdh (1 hr 5 min)
SUCCESS phoenix_part1_T2-hdp (1 hr 26 min)
SUCCESS phoenix_part1_T4-cdh (1 hr 4 min)
SUCCESS phoenix_part2_T2-cdh (1 hr 3 min)
SUCCESS phoenix_part2_T2-hdp (1 hr 22 min)
SUCCESS phoenix_part2_T4-cdh (1 hr 6 min)
SUCCESS phoenix_part2_T4-hdp (1 hr 33 min)
SUCCESS pyodbc_test-cdh (12 min)
SUCCESS pyodbc_test-hdp (17 min)
RE: Trafodion master Daily Test Result - 412 - Still Failing
Posted by "Liu, Ming (Ming)" <mi...@esgyn.cn>.
Seems all failure are due the error message text change for Error 1002. I can submit a simple fix.
thanks,
Ming
-----Original Message-----
From: steve.varnau@esgyn.com [mailto:steve.varnau@esgyn.com]
Sent: Sunday, December 04, 2016 8:20 PM
To: dev@trafodion.incubator.apache.org
Subject: Trafodion master Daily Test Result - 412 - Still Failing
Daily Automated Testing master
Jenkins Job: https://jenkins.esgyn.com/job/Check-Daily-master/412/
Archived Logs: http://traf-testlogs.esgyn.com/Daily-master/412
Bld Downloads: http://traf-builds.esgyn.com
Changes since previous daily build:
No changes
Test Job Results:
FAILURE core-regress-compGeneral-cdh (49 min)
FAILURE core-regress-compGeneral-hdp (1 hr 21 min)
FAILURE core-regress-privs2-cdh (58 min)
FAILURE core-regress-privs2-hdp (1 hr 29 min)
FAILURE core-regress-udr-cdh (41 min)
FAILURE core-regress-udr-hdp (51 min)
FAILURE phoenix_part1_T4-cdh (51 min)
SUCCESS build-rh6-master-debug (38 min)
SUCCESS build-rh6-master-release (39 min)
SUCCESS core-regress-charsets-cdh (33 min)
SUCCESS core-regress-charsets-hdp (59 min)
SUCCESS core-regress-core-cdh (1 hr 10 min)
SUCCESS core-regress-core-hdp (1 hr 35 min)
SUCCESS core-regress-executor-cdh (1 hr 26 min)
SUCCESS core-regress-executor-hdp (1 hr 43 min)
SUCCESS core-regress-fullstack2-cdh (22 min)
SUCCESS core-regress-fullstack2-hdp (32 min)
SUCCESS core-regress-hive-cdh (52 min)
SUCCESS core-regress-hive-hdp (52 min)
SUCCESS core-regress-privs1-cdh (48 min)
SUCCESS core-regress-privs1-hdp (1 hr 1 min)
SUCCESS core-regress-qat-cdh (31 min)
SUCCESS core-regress-qat-hdp (42 min)
SUCCESS core-regress-seabase-cdh (1 hr 38 min)
SUCCESS core-regress-seabase-hdp (1 hr 52 min)
SUCCESS jdbc_test-cdh (40 min)
SUCCESS jdbc_test-hdp (55 min)
SUCCESS phoenix_part1_T2-cdh (1 hr 6 min)
SUCCESS phoenix_part1_T2-hdp (1 hr 32 min)
SUCCESS phoenix_part1_T4-hdp (1 hr 20 min)
SUCCESS phoenix_part2_T2-cdh (1 hr 4 min)
SUCCESS phoenix_part2_T2-hdp (1 hr 25 min)
SUCCESS phoenix_part2_T4-cdh (1 hr 7 min)
SUCCESS phoenix_part2_T4-hdp (1 hr 22 min)
SUCCESS pyodbc_test-cdh (12 min)
SUCCESS pyodbc_test-hdp (18 min)
Trafodion master Daily Test Result - 412 - Still Failing
Posted by st...@esgyn.com.
Daily Automated Testing master
Jenkins Job: https://jenkins.esgyn.com/job/Check-Daily-master/412/
Archived Logs: http://traf-testlogs.esgyn.com/Daily-master/412
Bld Downloads: http://traf-builds.esgyn.com
Changes since previous daily build:
No changes
Test Job Results:
FAILURE core-regress-compGeneral-cdh (49 min)
FAILURE core-regress-compGeneral-hdp (1 hr 21 min)
FAILURE core-regress-privs2-cdh (58 min)
FAILURE core-regress-privs2-hdp (1 hr 29 min)
FAILURE core-regress-udr-cdh (41 min)
FAILURE core-regress-udr-hdp (51 min)
FAILURE phoenix_part1_T4-cdh (51 min)
SUCCESS build-rh6-master-debug (38 min)
SUCCESS build-rh6-master-release (39 min)
SUCCESS core-regress-charsets-cdh (33 min)
SUCCESS core-regress-charsets-hdp (59 min)
SUCCESS core-regress-core-cdh (1 hr 10 min)
SUCCESS core-regress-core-hdp (1 hr 35 min)
SUCCESS core-regress-executor-cdh (1 hr 26 min)
SUCCESS core-regress-executor-hdp (1 hr 43 min)
SUCCESS core-regress-fullstack2-cdh (22 min)
SUCCESS core-regress-fullstack2-hdp (32 min)
SUCCESS core-regress-hive-cdh (52 min)
SUCCESS core-regress-hive-hdp (52 min)
SUCCESS core-regress-privs1-cdh (48 min)
SUCCESS core-regress-privs1-hdp (1 hr 1 min)
SUCCESS core-regress-qat-cdh (31 min)
SUCCESS core-regress-qat-hdp (42 min)
SUCCESS core-regress-seabase-cdh (1 hr 38 min)
SUCCESS core-regress-seabase-hdp (1 hr 52 min)
SUCCESS jdbc_test-cdh (40 min)
SUCCESS jdbc_test-hdp (55 min)
SUCCESS phoenix_part1_T2-cdh (1 hr 6 min)
SUCCESS phoenix_part1_T2-hdp (1 hr 32 min)
SUCCESS phoenix_part1_T4-hdp (1 hr 20 min)
SUCCESS phoenix_part2_T2-cdh (1 hr 4 min)
SUCCESS phoenix_part2_T2-hdp (1 hr 25 min)
SUCCESS phoenix_part2_T4-cdh (1 hr 7 min)
SUCCESS phoenix_part2_T4-hdp (1 hr 22 min)
SUCCESS pyodbc_test-cdh (12 min)
SUCCESS pyodbc_test-hdp (18 min)
Trafodion master Daily Test Result - 411 - Still Failing
Posted by st...@esgyn.com.
Daily Automated Testing master
Jenkins Job: https://jenkins.esgyn.com/job/Check-Daily-master/411/
Archived Logs: http://traf-testlogs.esgyn.com/Daily-master/411
Bld Downloads: http://traf-builds.esgyn.com
Changes since previous daily build:
No changes
Test Job Results:
FAILURE core-regress-compGeneral-cdh (58 min)
FAILURE core-regress-compGeneral-hdp (1 hr 4 min)
FAILURE core-regress-privs2-cdh (1 hr 9 min)
FAILURE core-regress-privs2-hdp (1 hr 31 min)
FAILURE core-regress-udr-cdh (38 min)
FAILURE core-regress-udr-hdp (52 min)
SUCCESS build-rh6-master-debug (39 min)
SUCCESS build-rh6-master-release (40 min)
SUCCESS core-regress-charsets-cdh (45 min)
SUCCESS core-regress-charsets-hdp (46 min)
SUCCESS core-regress-core-cdh (59 min)
SUCCESS core-regress-core-hdp (1 hr 23 min)
SUCCESS core-regress-executor-cdh (1 hr 24 min)
SUCCESS core-regress-executor-hdp (1 hr 55 min)
SUCCESS core-regress-fullstack2-cdh (20 min)
SUCCESS core-regress-fullstack2-hdp (30 min)
SUCCESS core-regress-hive-cdh (41 min)
SUCCESS core-regress-hive-hdp (54 min)
SUCCESS core-regress-privs1-cdh (58 min)
SUCCESS core-regress-privs1-hdp (1 hr 8 min)
SUCCESS core-regress-qat-cdh (29 min)
SUCCESS core-regress-qat-hdp (26 min)
SUCCESS core-regress-seabase-cdh (1 hr 33 min)
SUCCESS core-regress-seabase-hdp (2 hr 3 min)
SUCCESS jdbc_test-cdh (39 min)
SUCCESS jdbc_test-hdp (45 min)
SUCCESS phoenix_part1_T2-cdh (1 hr 5 min)
SUCCESS phoenix_part1_T2-hdp (1 hr 37 min)
SUCCESS phoenix_part1_T4-cdh (1 hr 5 min)
SUCCESS phoenix_part1_T4-hdp (1 hr 16 min)
SUCCESS phoenix_part2_T2-cdh (1 hr 0 min)
SUCCESS phoenix_part2_T2-hdp (1 hr 31 min)
SUCCESS phoenix_part2_T4-cdh (1 hr 4 min)
SUCCESS phoenix_part2_T4-hdp (1 hr 18 min)
SUCCESS pyodbc_test-cdh (11 min)
SUCCESS pyodbc_test-hdp (25 min)
Trafodion master Daily Test Result - 410 - Still Failing
Posted by st...@esgyn.com.
Daily Automated Testing master
Jenkins Job: https://jenkins.esgyn.com/job/Check-Daily-master/410/
Archived Logs: http://traf-testlogs.esgyn.com/Daily-master/410
Bld Downloads: http://traf-builds.esgyn.com
Changes since previous daily build:
No changes
Test Job Results:
FAILURE core-regress-compGeneral-cdh (1 hr 1 min)
FAILURE core-regress-compGeneral-hdp (1 hr 18 min)
FAILURE core-regress-privs2-cdh (1 hr 8 min)
FAILURE core-regress-privs2-hdp (1 hr 26 min)
FAILURE core-regress-udr-cdh (28 min)
FAILURE core-regress-udr-hdp (35 min)
SUCCESS build-rh6-master-debug (41 min)
SUCCESS build-rh6-master-release (41 min)
SUCCESS core-regress-charsets-cdh (46 min)
SUCCESS core-regress-charsets-hdp (59 min)
SUCCESS core-regress-core-cdh (1 hr 5 min)
SUCCESS core-regress-core-hdp (1 hr 16 min)
SUCCESS core-regress-executor-cdh (1 hr 34 min)
SUCCESS core-regress-executor-hdp (1 hr 40 min)
SUCCESS core-regress-fullstack2-cdh (16 min)
SUCCESS core-regress-fullstack2-hdp (29 min)
SUCCESS core-regress-hive-cdh (54 min)
SUCCESS core-regress-hive-hdp (1 hr 13 min)
SUCCESS core-regress-privs1-cdh (48 min)
SUCCESS core-regress-privs1-hdp (1 hr 13 min)
SUCCESS core-regress-qat-cdh (19 min)
SUCCESS core-regress-qat-hdp (42 min)
SUCCESS core-regress-seabase-cdh (1 hr 36 min)
SUCCESS core-regress-seabase-hdp (1 hr 48 min)
SUCCESS jdbc_test-cdh (44 min)
SUCCESS jdbc_test-hdp (47 min)
SUCCESS phoenix_part1_T2-cdh (1 hr 4 min)
SUCCESS phoenix_part1_T2-hdp (1 hr 29 min)
SUCCESS phoenix_part1_T4-cdh (1 hr 9 min)
SUCCESS phoenix_part1_T4-hdp (1 hr 20 min)
SUCCESS phoenix_part2_T2-cdh (1 hr 2 min)
SUCCESS phoenix_part2_T2-hdp (1 hr 23 min)
SUCCESS phoenix_part2_T4-cdh (1 hr 12 min)
SUCCESS phoenix_part2_T4-hdp (1 hr 18 min)
SUCCESS pyodbc_test-cdh (18 min)
SUCCESS pyodbc_test-hdp (27 min)