You are viewing a plain text version of this content. The canonical link for it is here.
Posted to dev@jmeter.apache.org by Apache Jenkins Server <je...@builds.apache.org> on 2025/03/03 11:04:05 UTC
Build failed in Jenkins: JMeter » JMeter s390x #186
See <https://ci-builds.apache.org/job/JMeter/job/JMeter%20s390x/186/display/redirect?page=changes>
Changes:
[Vladimir Sitnikov] fix(deps): update dependency com.thoughtworks.xstream:xstream to v1.4.21
------------------------------------------
[...truncated 268.50 KiB...]
... end of run
WARNING: the task was configured to ignore errors in the output log
Logfile contents (errors during the test, see <https://ci-builds.apache.org/job/JMeter/job/JMeter%20s390x/ws/bin/TEST_HTTP.log)>:
2025-03-03 11:03:05,474 ERROR o.a.j.p.h.s.HTTPJavaImpl: readResponse: java.net.ProtocolException: Server redirected too many times (20)
2025-03-03 11:03:05,475 ERROR o.a.j.p.h.s.HTTPJavaImpl: Cause: java.net.ProtocolException: Server redirected too many times (20)
2025-03-03 11:03:05,488 ERROR o.a.j.p.h.c.HttpMirrorThread: Invalid request received:''
> Task :src:dist-check:batchTEST_HTTPS
WARN StatusConsoleListener The use of package scanning to locate plugins is deprecated and will be removed in a future release
WARN StatusConsoleListener The use of package scanning to locate plugins is deprecated and will be removed in a future release
WARN StatusConsoleListener The use of package scanning to locate plugins is deprecated and will be removed in a future release
WARN StatusConsoleListener The use of package scanning to locate plugins is deprecated and will be removed in a future release
Creating summariser <summary>
Created the tree successfully using <https://ci-builds.apache.org/job/JMeter/job/JMeter%20s390x/ws/bin/testfiles/TEST_HTTPS.jmx>
Starting standalone test @ 2025 Mar 3 11:03:08 UTC (1740999788722)
Waiting for possible Shutdown/StopTestNow/HeapDump/ThreadDump message on port 4445
WARN StatusConsoleListener The use of package scanning to locate plugins is deprecated and will be removed in a future release
WARN StatusConsoleListener The use of package scanning to locate plugins is deprecated and will be removed in a future release
WARN StatusConsoleListener The use of package scanning to locate plugins is deprecated and will be removed in a future release
WARN StatusConsoleListener The use of package scanning to locate plugins is deprecated and will be removed in a future release
summary = 2 in 00:00:01 = 1.7/s Avg: 480 Min: 203 Max: 757 Err: 0 (0.00%)
Tidying up ... @ 2025 Mar 3 11:03:10 UTC (1740999790072)
... end of run
No errors present in the logfile <https://ci-builds.apache.org/job/JMeter/job/JMeter%20s390x/ws/bin/TEST_HTTPS.log> (the file is empty)
> Task :src:dist-check:batchTestCookieManager
WARN StatusConsoleListener The use of package scanning to locate plugins is deprecated and will be removed in a future release
WARN StatusConsoleListener The use of package scanning to locate plugins is deprecated and will be removed in a future release
WARN StatusConsoleListener The use of package scanning to locate plugins is deprecated and will be removed in a future release
WARN StatusConsoleListener The use of package scanning to locate plugins is deprecated and will be removed in a future release
Creating summariser <summary>
Created the tree successfully using <https://ci-builds.apache.org/job/JMeter/job/JMeter%20s390x/ws/bin/testfiles/TestCookieManager.jmx>
Starting standalone test @ 2025 Mar 3 11:03:13 UTC (1740999793530)
Waiting for possible Shutdown/StopTestNow/HeapDump/ThreadDump message on port 4445
WARN StatusConsoleListener The use of package scanning to locate plugins is deprecated and will be removed in a future release
WARN StatusConsoleListener The use of package scanning to locate plugins is deprecated and will be removed in a future release
WARN StatusConsoleListener The use of package scanning to locate plugins is deprecated and will be removed in a future release
WARN StatusConsoleListener The use of package scanning to locate plugins is deprecated and will be removed in a future release
summary = 10 in 00:00:02 = 4.7/s Avg: 171 Min: 1 Max: 1263 Err: 0 (0.00%)
Tidying up ... @ 2025 Mar 3 11:03:16 UTC (1740999796168)
... end of run
No errors present in the logfile <https://ci-builds.apache.org/job/JMeter/job/JMeter%20s390x/ws/bin/TestCookieManager.log> (the file is empty)
> Task :src:dist-check:batchTestHeaderManagerHttpClient4
WARN StatusConsoleListener The use of package scanning to locate plugins is deprecated and will be removed in a future release
WARN StatusConsoleListener The use of package scanning to locate plugins is deprecated and will be removed in a future release
WARN StatusConsoleListener The use of package scanning to locate plugins is deprecated and will be removed in a future release
WARN StatusConsoleListener The use of package scanning to locate plugins is deprecated and will be removed in a future release
Creating summariser <summary>
Created the tree successfully using <https://ci-builds.apache.org/job/JMeter/job/JMeter%20s390x/ws/bin/testfiles/TestHeaderManager.jmx>
Starting standalone test @ 2025 Mar 3 11:03:19 UTC (1740999799762)
Waiting for possible Shutdown/StopTestNow/HeapDump/ThreadDump message on port 4445
WARN StatusConsoleListener The use of package scanning to locate plugins is deprecated and will be removed in a future release
WARN StatusConsoleListener The use of package scanning to locate plugins is deprecated and will be removed in a future release
WARN StatusConsoleListener The use of package scanning to locate plugins is deprecated and will be removed in a future release
WARN StatusConsoleListener The use of package scanning to locate plugins is deprecated and will be removed in a future release
summary = 3 in 00:00:00 = 10.3/s Avg: 19 Min: 1 Max: 37 Err: 0 (0.00%)
Tidying up ... @ 2025 Mar 3 11:03:20 UTC (1740999800234)
... end of run
No errors present in the logfile <https://ci-builds.apache.org/job/JMeter/job/JMeter%20s390x/ws/bin/TestHeaderManager.log> (the file is empty)
> Task :src:dist-check:batchTestHeaderManagerJava
WARN StatusConsoleListener The use of package scanning to locate plugins is deprecated and will be removed in a future release
WARN StatusConsoleListener The use of package scanning to locate plugins is deprecated and will be removed in a future release
WARN StatusConsoleListener The use of package scanning to locate plugins is deprecated and will be removed in a future release
WARN StatusConsoleListener The use of package scanning to locate plugins is deprecated and will be removed in a future release
Creating summariser <summary>
Created the tree successfully using <https://ci-builds.apache.org/job/JMeter/job/JMeter%20s390x/ws/bin/testfiles/TestHeaderManager.jmx>
Starting standalone test @ 2025 Mar 3 11:03:24 UTC (1740999804354)
Waiting for possible Shutdown/StopTestNow/HeapDump/ThreadDump message on port 4445
summary = 3 in 00:00:00 = 10.3/s Avg: 1 Min: 0 Max: 4 Err: 0 (0.00%)
Tidying up ... @ 2025 Mar 3 11:03:24 UTC (1740999804853)
... end of run
No errors present in the logfile <https://ci-builds.apache.org/job/JMeter/job/JMeter%20s390x/ws/bin/TestHeaderManager.log> (the file is empty)
> Task :src:dist-check:batchTestKeepAlive SKIPPED
> Task :src:dist-check:batchTestRedirectionPolicies SKIPPED
> Task :src:dist-check:batchTestResultStatusAction
WARN StatusConsoleListener The use of package scanning to locate plugins is deprecated and will be removed in a future release
WARN StatusConsoleListener The use of package scanning to locate plugins is deprecated and will be removed in a future release
WARN StatusConsoleListener The use of package scanning to locate plugins is deprecated and will be removed in a future release
WARN StatusConsoleListener The use of package scanning to locate plugins is deprecated and will be removed in a future release
Creating summariser <summary>
Created the tree successfully using <https://ci-builds.apache.org/job/JMeter/job/JMeter%20s390x/ws/bin/testfiles/TestResultStatusAction.jmx>
Starting standalone test @ 2025 Mar 3 11:03:28 UTC (1740999808428)
Waiting for possible Shutdown/StopTestNow/HeapDump/ThreadDump message on port 4445
summary = 135 in 00:00:01 = 109.2/s Avg: 1 Min: 0 Max: 133 Err: 18 (13.33%)
Tidying up ... @ 2025 Mar 3 11:03:29 UTC (1740999809987)
... end of run
No errors present in the logfile <https://ci-builds.apache.org/job/JMeter/job/JMeter%20s390x/ws/bin/TestResultStatusAction.log> (the file is empty)
> Task :src:dist-check:batchTestSchedulerWithTimer
WARN StatusConsoleListener The use of package scanning to locate plugins is deprecated and will be removed in a future release
WARN StatusConsoleListener The use of package scanning to locate plugins is deprecated and will be removed in a future release
WARN StatusConsoleListener The use of package scanning to locate plugins is deprecated and will be removed in a future release
WARN StatusConsoleListener The use of package scanning to locate plugins is deprecated and will be removed in a future release
Creating summariser <summary>
Created the tree successfully using <https://ci-builds.apache.org/job/JMeter/job/JMeter%20s390x/ws/bin/testfiles/TestSchedulerWithTimer.jmx>
Starting standalone test @ 2025 Mar 3 11:03:33 UTC (1740999813280)
Waiting for possible Shutdown/StopTestNow/HeapDump/ThreadDump message on port 4445
summary = 5 in 00:00:11 = 0.4/s Avg: 1101 Min: 0 Max: 4459 Err: 1 (20.00%)
Tidying up ... @ 2025 Mar 3 11:03:45 UTC (1740999825088)
... end of run
ERROR: unexpected output for TestSchedulerWithTimer.csv:
- expected 57 bytes, <https://ci-builds.apache.org/job/JMeter/job/JMeter%20s390x/ws/bin/testfiles/TestSchedulerWithTimer.csv>
+ actual 58 bytes, <https://ci-builds.apache.org/job/JMeter/job/JMeter%20s390x/ws/bin/TestSchedulerWithTimer.csv>
@@ -1 +1 @@
-JSRCheckDuration,200,tearDown Thread Group 1-1,text,true
+JSRCheckDuration,200,tearDown Thread Group 1-1,text,false
ERROR: unexpected output for TestSchedulerWithTimer.xml:
- expected 143 bytes, <https://ci-builds.apache.org/job/JMeter/job/JMeter%20s390x/ws/bin/testfiles/TestSchedulerWithTimer.xml>
+ actual 144 bytes, <https://ci-builds.apache.org/job/JMeter/job/JMeter%20s390x/ws/bin/TestSchedulerWithTimer.xml>
@@ -1,5 +1,5 @@
<?xml version="1.0" encoding="UTF-8"?>
<testResults version="1.2">
-<sample s="true" lb="JSRCheckDuration" rc="200" dt="text"/>
+<sample s="false" lb="JSRCheckDuration" rc="200" dt="text"/>
</testResults>
Logfile contents (errors during the test, see <https://ci-builds.apache.org/job/JMeter/job/JMeter%20s390x/ws/bin/TestSchedulerWithTimer.log)>:
2025-03-03 11:03:44,650 WARN o.a.j.p.j.s.J.JSRCheckDuration: Duration 7103 exceeded expected duration of 6000
> Task :src:dist-check:batchTestSchedulerWithTimer FAILED
checksum-dependency elapsed time: 9394ms, configurations processed: 69 (add -PchecksumTimingsPrint to print detailed timings)
checksum-dependency elapsed time: 77914ms, configurations processed: 645
SHA-512 computation time: 3ms (goes in parallel, it might exceed wall-clock time), files processed: 18, processed: 4MiB, skipped: 11068MiB
PGP signature resolution time: 26411ms (wall-clock), resolution requests: 381, signatures resolved: 391
PGP key resolution time: 21215ms (wall-clock), resolution requests: 381, download time: 0ms (goes in parallel, it might exceed wall-clock time), keys downloaded: 0
PGP signature verification time: 7395ms (goes in parallel, it might exceed wall-clock time), files processed: 495, processed: 593MiB, skipped: 10426MiB
Build [0;1mjmeter [0;1;31mFAILURE[0;1m[0m reason:
Execution [0;1;31mfailed[0m for task '[0;1m:src:dist-check:batchTestSchedulerWithTimer[0m':
Failures detected while testing <https://ci-builds.apache.org/job/JMeter/job/JMeter%20s390x/ws/bin/testfiles/TestSchedulerWithTimer.jmx>: [unexpected output TestSchedulerWithTimer.csv, unexpected output TestSchedulerWithTimer.xml, errors in TestSchedulerWithTimer.log]
at org.apache.jmeter.buildtools.batchtest.BatchTest.exec(BatchTest.kt:186)
[0;0;90mat org.gradle.internal.reflect.JavaMethod.invoke(JavaMethod.java:125)
[0m [0;0;90mat org.gradle.api.internal.project.taskfactory.StandardTaskAction.doExecute(StandardTaskAction.java:58)
[0m [0;0;90mat org.gradle.api.internal.project.taskfactory.StandardTaskAction.execute(StandardTaskAction.java:51)
[0m [0;0;90mat org.gradle.api.internal.project.taskfactory.StandardTaskAction.execute(StandardTaskAction.java:29)
[0m [0;0;90mat org.gradle.api.internal.tasks.execution.TaskExecution$3.run(TaskExecution.java:244)
[0m [0;0;90mat org.gradle.internal.operations.DefaultBuildOperationRunner$1.execute(DefaultBuildOperationRunner.java:29)
[0m [0;0;90mat org.gradle.internal.operations.DefaultBuildOperationRunner$1.execute(DefaultBuildOperationRunner.java:26)
[0m [0;0;90mat org.gradle.internal.operations.DefaultBuildOperationRunner$2.execute(DefaultBuildOperationRunner.java:66)
[0m [0;0;90mat org.gradle.internal.operations.DefaultBuildOperationRunner$2.execute(DefaultBuildOperationRunner.java:59)
[0m [0;0;90mat org.gradle.internal.operations.DefaultBuildOperationRunner.execute(DefaultBuildOperationRunner.java:166)
[0m [0;0;90mat org.gradle.internal.operations.DefaultBuildOperationRunner.execute(DefaultBuildOperationRunner.java:59)
[0m [0;0;90mat org.gradle.internal.operations.DefaultBuildOperationRunner.run(DefaultBuildOperationRunner.java:47)
[0m [0;0;90mat org.gradle.api.internal.tasks.execution.TaskExecution.executeAction(TaskExecution.java:229)
[0m [0;0;90mat org.gradle.api.internal.tasks.execution.TaskExecution.executeActions(TaskExecution.java:212)
[0m [0;0;90mat org.gradle.api.internal.tasks.execution.TaskExecution.executeWithPreviousOutputFiles(TaskExecution.java:195)
[0m [0;0;90mat org.gradle.api.internal.tasks.execution.TaskExecution.execute(TaskExecution.java:162)
[0m [0;0;90mat org.gradle.internal.execution.steps.ExecuteStep.executeInternal(ExecuteStep.java:105)
[0m [0;0;90mat org.gradle.internal.execution.steps.ExecuteStep.access$000(ExecuteStep.java:44)
[0m [0;0;90mat org.gradle.internal.execution.steps.ExecuteStep$1.call(ExecuteStep.java:59)
[0m [0;0;90mat org.gradle.internal.execution.steps.ExecuteStep$1.call(ExecuteStep.java:56)
[0m [0;0;90mat org.gradle.internal.operations.DefaultBuildOperationRunner$CallableBuildOperationWorker.execute(DefaultBuildOperationRunner.java:209)
[0m [0;0;90mat org.gradle.internal.operations.DefaultBuildOperationRunner$CallableBuildOperationWorker.execute(DefaultBuildOperationRunner.java:204)
[0m [0;0;90mat org.gradle.internal.operations.DefaultBuildOperationRunner$2.execute(DefaultBuildOperationRunner.java:66)
[0m [0;0;90mat org.gradle.internal.operations.DefaultBuildOperationRunner$2.execute(DefaultBuildOperationRunner.java:59)
[0m [0;0;90mat org.gradle.internal.operations.DefaultBuildOperationRunner.execute(DefaultBuildOperationRunner.java:166)
[0m [0;0;90mat org.gradle.internal.operations.DefaultBuildOperationRunner.execute(DefaultBuildOperationRunner.java:59)
[0m [0;0;90mat org.gradle.internal.operations.DefaultBuildOperationRunner.call(DefaultBuildOperationRunner.java:53)
[0m [0;0;90mat org.gradle.internal.execution.steps.ExecuteStep.execute(ExecuteStep.java:56)
[0m [0;0;90mat org.gradle.internal.execution.steps.ExecuteStep.execute(ExecuteStep.java:44)
[0m [0;0;90mat org.gradle.internal.execution.steps.CancelExecutionStep.execute(CancelExecutionStep.java:42)
[0m [0;0;90mat org.gradle.internal.execution.steps.TimeoutStep.executeWithoutTimeout(TimeoutStep.java:75)
[0m [0;0;90mat org.gradle.internal.execution.steps.TimeoutStep.execute(TimeoutStep.java:55)
[0m [0;0;90mat org.gradle.internal.execution.steps.PreCreateOutputParentsStep.execute(PreCreateOutputParentsStep.java:50)
[0m [0;0;90mat org.gradle.internal.execution.steps.PreCreateOutputParentsStep.execute(PreCreateOutputParentsStep.java:28)
[0m [0;0;90mat org.gradle.internal.execution.steps.RemovePreviousOutputsStep.execute(RemovePreviousOutputsStep.java:67)
[0m [0;0;90mat org.gradle.internal.execution.steps.RemovePreviousOutputsStep.execute(RemovePreviousOutputsStep.java:37)
[0m [0;0;90mat org.gradle.internal.execution.steps.BroadcastChangingOutputsStep.execute(BroadcastChangingOutputsStep.java:61)
[0m [0;0;90mat org.gradle.internal.execution.steps.BroadcastChangingOutputsStep.execute(BroadcastChangingOutputsStep.java:26)
[0m [0;0;90mat org.gradle.internal.execution.steps.CaptureOutputsAfterExecutionStep.execute(CaptureOutputsAfterExecutionStep.java:69)
[0m [0;0;90mat org.gradle.internal.execution.steps.CaptureOutputsAfterExecutionStep.execute(CaptureOutputsAfterExecutionStep.java:46)
[0m [0;0;90mat org.gradle.internal.execution.steps.ResolveInputChangesStep.execute(ResolveInputChangesStep.java:40)
[0m [0;0;90mat org.gradle.internal.execution.steps.ResolveInputChangesStep.execute(ResolveInputChangesStep.java:29)
[0m [0;0;90mat org.gradle.internal.execution.steps.BuildCacheStep.executeWithoutCache(BuildCacheStep.java:189)
[0m [0;0;90mat org.gradle.internal.execution.steps.BuildCacheStep.lambda$execute$1(BuildCacheStep.java:75)
[0m [0;0;90mat org.gradle.internal.Either$Right.fold(Either.java:175)
[0m [0;0;90mat org.gradle.internal.execution.caching.CachingState.fold(CachingState.java:62)
[0m [0;0;90mat org.gradle.internal.execution.steps.BuildCacheStep.execute(BuildCacheStep.java:73)
[0m [0;0;90mat org.gradle.internal.execution.steps.BuildCacheStep.execute(BuildCacheStep.java:48)
[0m [0;0;90mat org.gradle.internal.execution.steps.StoreExecutionStateStep.execute(StoreExecutionStateStep.java:46)
[0m [0;0;90mat org.gradle.internal.execution.steps.StoreExecutionStateStep.execute(StoreExecutionStateStep.java:35)
[0m [0;0;90mat org.gradle.internal.execution.steps.SkipUpToDateStep.executeBecause(SkipUpToDateStep.java:75)
[0m [0;0;90mat org.gradle.internal.execution.steps.SkipUpToDateStep.lambda$execute$2(SkipUpToDateStep.java:53)
[0m [0;0;90mat org.gradle.internal.execution.steps.SkipUpToDateStep.execute(SkipUpToDateStep.java:53)
[0m [0;0;90mat org.gradle.internal.execution.steps.SkipUpToDateStep.execute(SkipUpToDateStep.java:35)
[0m [0;0;90mat org.gradle.internal.execution.steps.legacy.MarkSnapshottingInputsFinishedStep.execute(MarkSnapshottingInputsFinishedStep.java:37)
[0m [0;0;90mat org.gradle.internal.execution.steps.legacy.MarkSnapshottingInputsFinishedStep.execute(MarkSnapshottingInputsFinishedStep.java:27)
[0m [0;0;90mat org.gradle.internal.execution.steps.ResolveIncrementalCachingStateStep.executeDelegate(ResolveIncrementalCachingStateStep.java:49)
[0m [0;0;90mat org.gradle.internal.execution.steps.ResolveIncrementalCachingStateStep.executeDelegate(ResolveIncrementalCachingStateStep.java:27)
[0m [0;0;90mat org.gradle.internal.execution.steps.AbstractResolveCachingStateStep.execute(AbstractResolveCachingStateStep.java:71)
[0m [0;0;90mat org.gradle.internal.execution.steps.AbstractResolveCachingStateStep.execute(AbstractResolveCachingStateStep.java:39)
[0m [0;0;90mat org.gradle.internal.execution.steps.ResolveChangesStep.execute(ResolveChangesStep.java:65)
[0m [0;0;90mat org.gradle.internal.execution.steps.ResolveChangesStep.execute(ResolveChangesStep.java:36)
[0m [0;0;90mat org.gradle.internal.execution.steps.ValidateStep.execute(ValidateStep.java:105)
[0m [0;0;90mat org.gradle.internal.execution.steps.ValidateStep.execute(ValidateStep.java:54)
[0m [0;0;90mat org.gradle.internal.execution.steps.AbstractCaptureStateBeforeExecutionStep.execute(AbstractCaptureStateBeforeExecutionStep.java:64)
[0m [0;0;90mat org.gradle.internal.execution.steps.AbstractCaptureStateBeforeExecutionStep.execute(AbstractCaptureStateBeforeExecutionStep.java:43)
[0m [0;0;90mat org.gradle.internal.execution.steps.AbstractSkipEmptyWorkStep.executeWithNonEmptySources(AbstractSkipEmptyWorkStep.java:125)
[0m [0;0;90mat org.gradle.internal.execution.steps.AbstractSkipEmptyWorkStep.execute(AbstractSkipEmptyWorkStep.java:56)
[0m [0;0;90mat org.gradle.internal.execution.steps.AbstractSkipEmptyWorkStep.execute(AbstractSkipEmptyWorkStep.java:36)
[0m [0;0;90mat org.gradle.internal.execution.steps.legacy.MarkSnapshottingInputsStartedStep.execute(MarkSnapshottingInputsStartedStep.java:38)
[0m [0;0;90mat org.gradle.internal.execution.steps.LoadPreviousExecutionStateStep.execute(LoadPreviousExecutionStateStep.java:36)
[0m [0;0;90mat org.gradle.internal.execution.steps.LoadPreviousExecutionStateStep.execute(LoadPreviousExecutionStateStep.java:23)
[0m [0;0;90mat org.gradle.internal.execution.steps.HandleStaleOutputsStep.execute(HandleStaleOutputsStep.java:75)
[0m [0;0;90mat org.gradle.internal.execution.steps.HandleStaleOutputsStep.execute(HandleStaleOutputsStep.java:41)
[0m [0;0;90mat org.gradle.internal.execution.steps.AssignMutableWorkspaceStep.lambda$execute$0(AssignMutableWorkspaceStep.java:35)
[0m [0;0;90mat org.gradle.api.internal.tasks.execution.TaskExecution$4.withWorkspace(TaskExecution.java:289)
[0m [0;0;90mat org.gradle.internal.execution.steps.AssignMutableWorkspaceStep.execute(AssignMutableWorkspaceStep.java:31)
[0m [0;0;90mat org.gradle.internal.execution.steps.AssignMutableWorkspaceStep.execute(AssignMutableWorkspaceStep.java:22)
[0m [0;0;90mat org.gradle.internal.execution.steps.ChoosePipelineStep.execute(ChoosePipelineStep.java:40)
[0m [0;0;90mat org.gradle.internal.execution.steps.ChoosePipelineStep.execute(ChoosePipelineStep.java:23)
[0m [0;0;90mat org.gradle.internal.execution.steps.ExecuteWorkBuildOperationFiringStep.lambda$execute$2(ExecuteWorkBuildOperationFiringStep.java:67)
[0m [0;0;90mat org.gradle.internal.execution.steps.ExecuteWorkBuildOperationFiringStep.execute(ExecuteWorkBuildOperationFiringStep.java:67)
[0m [0;0;90mat org.gradle.internal.execution.steps.ExecuteWorkBuildOperationFiringStep.execute(ExecuteWorkBuildOperationFiringStep.java:39)
[0m [0;0;90mat org.gradle.internal.execution.steps.IdentityCacheStep.execute(IdentityCacheStep.java:46)
[0m [0;0;90mat org.gradle.internal.execution.steps.IdentityCacheStep.execute(IdentityCacheStep.java:34)
[0m [0;0;90mat org.gradle.internal.execution.steps.IdentifyStep.execute(IdentifyStep.java:48)
[0m [0;0;90mat org.gradle.internal.execution.steps.IdentifyStep.execute(IdentifyStep.java:35)
[0m
FAILURE: Build failed with an exception.
* What went wrong:
Execution failed for task ':src:dist-check:batchTestSchedulerWithTimer'.
> Failures detected while testing <https://ci-builds.apache.org/job/JMeter/job/JMeter%20s390x/ws/bin/testfiles/TestSchedulerWithTimer.jmx>: [unexpected output TestSchedulerWithTimer.csv, unexpected output TestSchedulerWithTimer.xml, errors in TestSchedulerWithTimer.log]
* Try:
> Run with --stacktrace option to get the stack trace.
> Run with --info or --debug option to get more log output.
> Get more help at https://help.gradle.org.
Deprecated Gradle features were used in this build, making it incompatible with Gradle 9.0.
You can use '--warning-mode all' to show the individual deprecation warnings and determine if they come from your own scripts or plugins.
For more on this, please refer to https://docs.gradle.org/8.9/userguide/command_line_interface.html#sec:command_line_warnings in the Gradle documentation.
BUILD FAILED in 8m 21s
412 actionable tasks: 263 executed, 149 up-to-date
Publishing build scan...
https://develocity.apache.org/s/jwkjn4vdgpgvq
Build step 'Invoke Gradle script' changed build result to FAILURE
Build step 'Invoke Gradle script' marked build as failure
Jenkins build is back to normal : JMeter » JMeter s390x #187
Posted by Apache Jenkins Server <je...@builds.apache.org>.
See <https://ci-builds.apache.org/job/JMeter/job/JMeter%20s390x/187/display/redirect?page=changes>