You are viewing a plain text version of this content. The canonical link for it is here.
Posted to commits@myfaces.apache.org by Apache Hudson Server <hu...@hudson.apache.org> on 2011/01/30 01:24:38 UTC

Build failed in Hudson: myfaces-maven2-plugins #51

See <https://hudson.apache.org/hudson/job/myfaces-maven2-plugins/51/>

------------------------------------------
[...truncated 1627 lines...]
[INFO] Building Apache MyFaces Buildtools Maven2 Wagon Plugin 1.0.1-SNAPSHOT
[INFO] ------------------------------------------------------------------------
Downloaded: http://repo1.maven.org/maven2/org/apache/maven/maven-profile/2.0.2/maven-profile-2.0.2.jar (30 KB at 23.6 KB/sec)
Downloaded: http://repo1.maven.org/maven2/org/apache/maven/maven-plugin-api/2.0.2/maven-plugin-api-2.0.2.jar (9 KB at 3.7 KB/sec)
Downloaded: http://repo1.maven.org/maven2/org/apache/maven/maven-project/2.0.2/maven-project-2.0.2.jar (105 KB at 46.2 KB/sec)
[INFO] Executing tasks
[INFO]      [copy] Copying 2 files to <https://hudson.apache.org/hudson/job/myfaces-maven2-plugins/ws/maven2-plugins/myfaces-wagon-plugin/target/apidocs/META-INF>
[INFO] Executed tasks

[INFO] --- maven-antrun-plugin:1.3:run (javadoc.resources) @ myfaces-wagon-plugin ---
[INFO] [INFO] Using 'UTF-8' encoding to read mojo metadata.
[INFO] Applying mojo extractor for language: java
[INFO] Mojo extractor for language: java found 1 mojo descriptors.
[INFO] Applying mojo extractor for language: bsh
[INFO] Mojo extractor for language: bsh found 0 mojo descriptors.

[INFO] --- maven-plugin-plugin:2.5.1:descriptor (default-descriptor) @ myfaces-wagon-plugin ---
[INFO] 
[INFO] --- maven-remote-resources-plugin:1.1:process (default) @ myfaces-wagon-plugin ---
[INFO] [INFO] Using 'UTF-8' encoding to copy filtered resources.
[INFO] Copying 2 resources
[INFO] Copying 3 resources

[INFO] --- maven-resources-plugin:2.4.3:resources (default-resources) @ myfaces-wagon-plugin ---
[INFO] [INFO] Compiling 1 source file to <https://hudson.apache.org/hudson/job/myfaces-maven2-plugins/ws/maven2-plugins/myfaces-wagon-plugin/target/classes>

[INFO] --- maven-compiler-plugin:2.3.1:compile (default-compile) @ myfaces-wagon-plugin ---
[INFO] [INFO] Using 'UTF-8' encoding to copy filtered resources.
[INFO] skip non existing resourceDirectory <https://hudson.apache.org/hudson/job/myfaces-maven2-plugins/ws/maven2-plugins/myfaces-wagon-plugin/src/test/resources>
[INFO] Copying 3 resources

[INFO] --- maven-resources-plugin:2.4.3:testResources (default-testResources) @ myfaces-wagon-plugin ---
[INFO] [INFO] No sources to compile

[INFO] --- maven-compiler-plugin:2.3.1:testCompile (default-testCompile) @ myfaces-wagon-plugin ---
[INFO] [INFO] Surefire report directory: <https://hudson.apache.org/hudson/job/myfaces-maven2-plugins/ws/maven2-plugins/myfaces-wagon-plugin/target/surefire-reports>

[INFO] --- maven-surefire-plugin:2.5:test (default-test) @ myfaces-wagon-plugin ---

-------------------------------------------------------
 T E S T S
-------------------------------------------------------
There are no tests to run.

Results :

Tests run: 0, Failures: 0, Errors: 0, Skipped: 0

[HUDSON] Recording test results
[INFO] [INFO] Building jar: <https://hudson.apache.org/hudson/job/myfaces-maven2-plugins/ws/maven2-plugins/myfaces-wagon-plugin/target/myfaces-wagon-plugin-1.0.1-SNAPSHOT.jar>

[INFO] --- maven-jar-plugin:2.2:jar (default-jar) @ myfaces-wagon-plugin ---
[INFO] 
[INFO] --- maven-plugin-plugin:2.5.1:addPluginArtifactMetadata (default-addPluginArtifactMetadata) @ myfaces-wagon-plugin ---
mojo forkStarted org.apache.maven.plugins:maven-checkstyle-plugin:2.2(verify-style)
forkedProjectStarted org.apache.myfaces.buildtools:myfaces-wagon-plugin1.0.1-SNAPSHOT
[INFO] 
[INFO] --- maven-checkstyle-plugin:2.2:checkstyle (checkstyle) @ myfaces-wagon-plugin ---
forkedProjectSucceeded org.apache.myfaces.buildtools:myfaces-wagon-plugin1.0.1-SNAPSHOT
[HUDSON] Archiving <https://hudson.apache.org/hudson/job/myfaces-maven2-plugins/ws/maven2-plugins/myfaces-wagon-plugin/pom.xml> to /home/hudson/hudson/jobs/myfaces-maven2-plugins/modules/org.apache.myfaces.buildtools$myfaces-wagon-plugin/builds/2011-01-30_00-22-30/archive/org.apache.myfaces.buildtools/myfaces-wagon-plugin/1.0.1-SNAPSHOT/pom.xml
[HUDSON] Archiving <https://hudson.apache.org/hudson/job/myfaces-maven2-plugins/ws/maven2-plugins/myfaces-wagon-plugin/target/myfaces-wagon-plugin-1.0.1-SNAPSHOT.jar> to /home/hudson/hudson/jobs/myfaces-maven2-plugins/modules/org.apache.myfaces.buildtools$myfaces-wagon-plugin/builds/2011-01-30_00-22-30/archive/org.apache.myfaces.buildtools/myfaces-wagon-plugin/1.0.1-SNAPSHOT/myfaces-wagon-plugin-1.0.1-SNAPSHOT.jar
mojo forkSucceeded org.apache.maven.plugins:maven-checkstyle-plugin:2.2(verify-style)
[INFO] 
[INFO] --- maven-checkstyle-plugin:2.2:check (verify-style) @ myfaces-wagon-plugin ---
[INFO] [INFO] Installing <https://hudson.apache.org/hudson/job/myfaces-maven2-plugins/ws/maven2-plugins/myfaces-wagon-plugin/target/myfaces-wagon-plugin-1.0.1-SNAPSHOT.jar> to /home/hudson/.m2/repository/org/apache/myfaces/buildtools/myfaces-wagon-plugin/1.0.1-SNAPSHOT/myfaces-wagon-plugin-1.0.1-SNAPSHOT.jar
[INFO] Installing <https://hudson.apache.org/hudson/job/myfaces-maven2-plugins/ws/maven2-plugins/myfaces-wagon-plugin/pom.xml> to /home/hudson/.m2/repository/org/apache/myfaces/buildtools/myfaces-wagon-plugin/1.0.1-SNAPSHOT/myfaces-wagon-plugin-1.0.1-SNAPSHOT.pom

[INFO] --- maven-install-plugin:2.3:install (default-install) @ myfaces-wagon-plugin ---
projectSucceeded org.apache.myfaces.buildtools:myfaces-wagon-plugin:1.0.1-SNAPSHOT
[INFO] [INFO] Executing tasks
     [copy] Copying 2 files to <https://hudson.apache.org/hudson/job/myfaces-maven2-plugins/ws/maven2-plugins/myfaces-xrts-plugin/target/apidocs/META-INF>
[INFO] Executed tasks
                                                                        
[INFO] ------------------------------------------------------------------------
[INFO] Building Apache MyFaces Buildtools Maven2 XRTS Plugin 1.0.1-SNAPSHOT
[INFO] ------------------------------------------------------------------------
[INFO] 
[INFO] --- maven-antrun-plugin:1.3:run (javadoc.resources) @ myfaces-xrts-plugin ---
[INFO] [INFO] Using 2 extractors.
[INFO] Applying extractor for language: java
[INFO] Extractor for language: java found 2 mojo descriptors.
[INFO] Applying extractor for language: bsh
[INFO] Extractor for language: bsh found 0 mojo descriptors.

[INFO] --- maven-plugin-plugin:2.2:descriptor (default-descriptor) @ myfaces-xrts-plugin ---
[INFO] 
[INFO] --- maven-remote-resources-plugin:1.1:process (default) @ myfaces-xrts-plugin ---
[INFO] [INFO] Using 'UTF-8' encoding to copy filtered resources.
[INFO] Copying 0 resource
[INFO] Copying 3 resources

[INFO] --- maven-resources-plugin:2.4.3:resources (default-resources) @ myfaces-xrts-plugin ---
[INFO] [INFO] Compiling 8 source files to <https://hudson.apache.org/hudson/job/myfaces-maven2-plugins/ws/maven2-plugins/myfaces-xrts-plugin/target/classes>

[INFO] --- maven-compiler-plugin:2.3.1:compile (default-compile) @ myfaces-xrts-plugin ---
[WARNING]  no such file or directory
<https://hudson.apache.org/hudson/job/myfaces-maven2-plugins/ws/maven2-plugins/myfaces-xrts-plugin/src/main/java/org/apache/myfaces/buildtools/maven2/plugin/xrts/XRTSParser.java>:[26,18] [deprecation] org.xml.sax.AttributeList in org.xml.sax has been deprecated

[WARNING] <https://hudson.apache.org/hudson/job/myfaces-maven2-plugins/ws/maven2-plugins/myfaces-xrts-plugin/src/main/java/org/apache/myfaces/buildtools/maven2/plugin/xrts/XRTSParser.java>:[27,18] [deprecation] org.xml.sax.HandlerBase in org.xml.sax has been deprecated

[WARNING] <https://hudson.apache.org/hudson/job/myfaces-maven2-plugins/ws/maven2-plugins/myfaces-xrts-plugin/src/main/java/org/apache/myfaces/buildtools/maven2/plugin/xrts/XRTSParser.java>:[33,31] [deprecation] org.xml.sax.HandlerBase in org.xml.sax has been deprecated

[WARNING] <https://hudson.apache.org/hudson/job/myfaces-maven2-plugins/ws/maven2-plugins/myfaces-xrts-plugin/src/main/java/org/apache/myfaces/buildtools/maven2/plugin/xrts/XRTSParser.java>:[97,40] [deprecation] org.xml.sax.AttributeList in org.xml.sax has been deprecated

[WARNING] <https://hudson.apache.org/hudson/job/myfaces-maven2-plugins/ws/maven2-plugins/myfaces-xrts-plugin/src/main/java/org/apache/myfaces/buildtools/maven2/plugin/xrts/AbstractGenerateSourcesMojo.java>:[99,25] [unchecked] unchecked call to LinkedList(java.util.Collection<? extends E>) as a member of the raw type java.util.LinkedList

[WARNING] <https://hudson.apache.org/hudson/job/myfaces-maven2-plugins/ws/maven2-plugins/myfaces-xrts-plugin/src/main/java/org/apache/myfaces/buildtools/maven2/plugin/xrts/AbstractGenerateSourcesMojo.java>:[132,22] [unchecked] unchecked call to put(K,V) as a member of the raw type java.util.Map

[WARNING] <https://hudson.apache.org/hudson/job/myfaces-maven2-plugins/ws/maven2-plugins/myfaces-xrts-plugin/src/main/java/org/apache/myfaces/buildtools/maven2/plugin/xrts/AbstractGenerateSourcesMojo.java>:[133,22] [unchecked] unchecked call to put(K,V) as a member of the raw type java.util.Map

[WARNING] <https://hudson.apache.org/hudson/job/myfaces-maven2-plugins/ws/maven2-plugins/myfaces-xrts-plugin/src/main/java/org/apache/myfaces/buildtools/maven2/plugin/xrts/AbstractGenerateSourcesMojo.java>:[134,22] [unchecked] unchecked call to put(K,V) as a member of the raw type java.util.Map

[WARNING] <https://hudson.apache.org/hudson/job/myfaces-maven2-plugins/ws/maven2-plugins/myfaces-xrts-plugin/src/main/java/org/apache/myfaces/buildtools/maven2/plugin/xrts/AbstractGenerateSourcesMojo.java>:[135,22] [unchecked] unchecked call to put(K,V) as a member of the raw type java.util.Map

[WARNING] <https://hudson.apache.org/hudson/job/myfaces-maven2-plugins/ws/maven2-plugins/myfaces-xrts-plugin/src/main/java/org/apache/myfaces/buildtools/maven2/plugin/xrts/AbstractGenerateSourcesMojo.java>:[136,22] [unchecked] unchecked call to put(K,V) as a member of the raw type java.util.Map

[WARNING] <https://hudson.apache.org/hudson/job/myfaces-maven2-plugins/ws/maven2-plugins/myfaces-xrts-plugin/src/main/java/org/apache/myfaces/buildtools/maven2/plugin/xrts/AbstractGenerateSourcesMojo.java>:[139,57] [deprecation] toURL() in java.io.File has been deprecated

[INFO] Using 'UTF-8' encoding to copy filtered resources.
[INFO] [INFO] skip non existing resourceDirectory <https://hudson.apache.org/hudson/job/myfaces-maven2-plugins/ws/maven2-plugins/myfaces-xrts-plugin/src/test/resources>
[INFO] Copying 3 resources

[INFO] --- maven-resources-plugin:2.4.3:testResources (default-testResources) @ myfaces-xrts-plugin ---
[INFO] [INFO] No sources to compile

[INFO] --- maven-compiler-plugin:2.3.1:testCompile (default-testCompile) @ myfaces-xrts-plugin ---
[INFO] [INFO] Surefire report directory: <https://hudson.apache.org/hudson/job/myfaces-maven2-plugins/ws/maven2-plugins/myfaces-xrts-plugin/target/surefire-reports>

[INFO] --- maven-surefire-plugin:2.5:test (default-test) @ myfaces-xrts-plugin ---

-------------------------------------------------------
 T E S T S
-------------------------------------------------------
There are no tests to run.

Results :

Tests run: 0, Failures: 0, Errors: 0, Skipped: 0

[HUDSON] Recording test results
[INFO] [INFO] Building jar: <https://hudson.apache.org/hudson/job/myfaces-maven2-plugins/ws/maven2-plugins/myfaces-xrts-plugin/target/myfaces-xrts-plugin-1.0.1-SNAPSHOT.jar>

[INFO] --- maven-jar-plugin:2.2:jar (default-jar) @ myfaces-xrts-plugin ---
[INFO] 
[INFO] --- maven-plugin-plugin:2.2:addPluginArtifactMetadata (default-addPluginArtifactMetadata) @ myfaces-xrts-plugin ---
mojo forkStarted org.apache.maven.plugins:maven-checkstyle-plugin:2.2(verify-style)
forkedProjectStarted org.apache.myfaces.buildtools:myfaces-xrts-plugin1.0.1-SNAPSHOT
[INFO] 
[INFO] --- maven-checkstyle-plugin:2.2:checkstyle (checkstyle) @ myfaces-xrts-plugin ---
[WARNING] Unable to locate Source XRef to link to - DISABLED
forkedProjectSucceeded org.apache.myfaces.buildtools:myfaces-xrts-plugin1.0.1-SNAPSHOT
[HUDSON] Archiving <https://hudson.apache.org/hudson/job/myfaces-maven2-plugins/ws/maven2-plugins/myfaces-xrts-plugin/pom.xml> to /home/hudson/hudson/jobs/myfaces-maven2-plugins/modules/org.apache.myfaces.buildtools$myfaces-xrts-plugin/builds/2011-01-30_00-22-30/archive/org.apache.myfaces.buildtools/myfaces-xrts-plugin/1.0.1-SNAPSHOT/pom.xml
[HUDSON] Archiving <https://hudson.apache.org/hudson/job/myfaces-maven2-plugins/ws/maven2-plugins/myfaces-xrts-plugin/target/myfaces-xrts-plugin-1.0.1-SNAPSHOT.jar> to /home/hudson/hudson/jobs/myfaces-maven2-plugins/modules/org.apache.myfaces.buildtools$myfaces-xrts-plugin/builds/2011-01-30_00-22-30/archive/org.apache.myfaces.buildtools/myfaces-xrts-plugin/1.0.1-SNAPSHOT/myfaces-xrts-plugin-1.0.1-SNAPSHOT.jar
mojo forkSucceeded org.apache.maven.plugins:maven-checkstyle-plugin:2.2(verify-style)
[INFO] 
[INFO] --- maven-checkstyle-plugin:2.2:check (verify-style) @ myfaces-xrts-plugin ---
[INFO] [INFO] Installing <https://hudson.apache.org/hudson/job/myfaces-maven2-plugins/ws/maven2-plugins/myfaces-xrts-plugin/target/myfaces-xrts-plugin-1.0.1-SNAPSHOT.jar> to /home/hudson/.m2/repository/org/apache/myfaces/buildtools/myfaces-xrts-plugin/1.0.1-SNAPSHOT/myfaces-xrts-plugin-1.0.1-SNAPSHOT.jar
[INFO] Installing <https://hudson.apache.org/hudson/job/myfaces-maven2-plugins/ws/maven2-plugins/myfaces-xrts-plugin/pom.xml> to /home/hudson/.m2/repository/org/apache/myfaces/buildtools/myfaces-xrts-plugin/1.0.1-SNAPSHOT/myfaces-xrts-plugin-1.0.1-SNAPSHOT.pom

[INFO] --- maven-install-plugin:2.3:install (default-install) @ myfaces-xrts-plugin ---
projectSucceeded org.apache.myfaces.buildtools:myfaces-xrts-plugin:1.0.1-SNAPSHOT
[INFO]                                                                         
[INFO] ------------------------------------------------------------------------
[INFO] Building Apache MyFaces Buildtools Maven2 Plugin Module 1-SNAPSHOT
[INFO] ------------------------------------------------------------------------
[INFO] 
[INFO] --- maven-remote-resources-plugin:1.1:process (default) @ myfaces-plugin-module ---
[INFO] [INFO] Installing <https://hudson.apache.org/hudson/job/myfaces-maven2-plugins/ws/maven2-plugins/pom.xml> to /home/hudson/.m2/repository/org/apache/myfaces/buildtools/myfaces-plugin-module/1-SNAPSHOT/myfaces-plugin-module-1-SNAPSHOT.pom

[INFO] --- maven-install-plugin:2.3:install (default-install) @ myfaces-plugin-module ---
projectSucceeded org.apache.myfaces.buildtools:myfaces-plugin-module:1-SNAPSHOT
[HUDSON] Archiving <https://hudson.apache.org/hudson/job/myfaces-maven2-plugins/ws/maven2-plugins/pom.xml> to /home/hudson/hudson/jobs/myfaces-maven2-plugins/modules/org.apache.myfaces.buildtools$myfaces-plugin-module/builds/2011-01-30_00-22-30/archive/org.apache.myfaces.buildtools/myfaces-plugin-module/1-SNAPSHOT/pom.xml
sessionEnded
[INFO] ------------------------------------------------------------------------
[INFO] Reactor Summary:
[INFO] 
[INFO] Apache MyFaces Buildtools Maven2 Plugin Parent .... SUCCESS [11.798s]
[INFO] Apache MyFaces Buildtools Maven2 Builder Annotations  SUCCESS [6.383s]
[INFO] Apache MyFaces Buildtools Maven2 Builder Plugin ... SUCCESS [22.187s]
[INFO] Apache MyFaces Buildtools Maven2 Faces Plugin ..... SUCCESS [8.284s]
[INFO] Apache MyFaces Buildtools Maven2 i18n Plugin ...... SUCCESS [5.173s]
[INFO] Apache MyFaces Buildtools Maven2 Javacc Plugin .... SUCCESS [5.500s]
[INFO] Apache MyFaces Buildtools Maven2 Javascript Plugin  SUCCESS [19.635s]
[INFO] Apache MyFaces Buildtools Maven2 JDev Plugin ...... SUCCESS [5.132s]
[INFO] Apache MyFaces Buildtools Maven2 Tag Documentation Report  SUCCESS [5.368s]
[INFO] Apache MyFaces Buildtools Maven2 Wagon Plugin ..... SUCCESS [7.541s]
[INFO] Apache MyFaces Buildtools Maven2 XRTS Plugin ...... SUCCESS [4.863s]
[INFO] Apache MyFaces Buildtools Maven2 Plugin Module .... SUCCESS [0.589s]
[INFO] ------------------------------------------------------------------------
[INFO] BUILD SUCCESS
[INFO] ------------------------------------------------------------------------
[INFO] Total time: 1:55.808s
[INFO] Finished at: Sat Jan 29 16:24:37 PST 2011
[INFO] Final Memory: 69M/262M
[INFO] ------------------------------------------------------------------------
channel stopped
Deploying artifacts to https://repository.apache.org/content/repositories/snapshots
uniqueVersion == false is not anymore supported in maven 3
Deploying the main artifact myfaces-builder-annotations-1.0.8-SNAPSHOT.jar
ERROR: Error retrieving previous build number for artifact 'org.apache.myfaces.buildtools:myfaces-builder-annotations:jar': repository metadata for: 'snapshot org.apache.myfaces.buildtools:myfaces-builder-annotations:1.0.8-SNAPSHOT' could not be retrieved from repository: apache.snapshots.https due to an error: Error transferring file: Server returned HTTP response code: 502 for URL: https://repository.apache.org/content/repositories/snapshots/org/apache/myfaces/buildtools/myfaces-builder-annotations/1.0.8-SNAPSHOT/maven-metadata.xml
org.apache.maven.artifact.deployer.ArtifactDeploymentException: Error retrieving previous build number for artifact 'org.apache.myfaces.buildtools:myfaces-builder-annotations:jar': repository metadata for: 'snapshot org.apache.myfaces.buildtools:myfaces-builder-annotations:1.0.8-SNAPSHOT' could not be retrieved from repository: apache.snapshots.https due to an error: Error transferring file: Server returned HTTP response code: 502 for URL: https://repository.apache.org/content/repositories/snapshots/org/apache/myfaces/buildtools/myfaces-builder-annotations/1.0.8-SNAPSHOT/maven-metadata.xml
	at hudson.maven.artifact.transform.SnapshotTransformation.transformForDeployment(SnapshotTransformation.java:110)
	at hudson.maven.artifact.transform.DefaultArtifactTransformationManager.transformForDeployment(DefaultArtifactTransformationManager.java:71)
	at hudson.maven.artifact.deployer.DefaultArtifactDeployer.deploy(DefaultArtifactDeployer.java:92)
	at hudson.maven.reporters.MavenArtifactRecord.deployMavenArtifact(MavenArtifactRecord.java:139)
	at hudson.maven.reporters.MavenArtifactRecord.deploy(MavenArtifactRecord.java:126)
	at hudson.maven.RedeployPublisher.perform(RedeployPublisher.java:128)
	at hudson.tasks.BuildStepMonitor$1.perform(BuildStepMonitor.java:19)
	at hudson.model.AbstractBuild$AbstractRunner.perform(AbstractBuild.java:622)
	at hudson.model.AbstractBuild$AbstractRunner.performAllBuildSteps(AbstractBuild.java:601)
	at hudson.maven.MavenModuleSetBuild$RunnerImpl.post2(MavenModuleSetBuild.java:762)
	at hudson.model.AbstractBuild$AbstractRunner.post(AbstractBuild.java:548)
	at hudson.model.Run.run(Run.java:1386)
	at hudson.maven.MavenModuleSetBuild.run(MavenModuleSetBuild.java:405)
	at hudson.model.ResourceController.execute(ResourceController.java:88)
	at hudson.model.Executor.run(Executor.java:145)
Caused by: org.apache.maven.artifact.repository.metadata.RepositoryMetadataResolutionException: repository metadata for: 'snapshot org.apache.myfaces.buildtools:myfaces-builder-annotations:1.0.8-SNAPSHOT' could not be retrieved from repository: apache.snapshots.https due to an error: Error transferring file: Server returned HTTP response code: 502 for URL: https://repository.apache.org/content/repositories/snapshots/org/apache/myfaces/buildtools/myfaces-builder-annotations/1.0.8-SNAPSHOT/maven-metadata.xml
	at org.apache.maven.artifact.repository.metadata.DefaultRepositoryMetadataManager.resolveAlways(DefaultRepositoryMetadataManager.java:400)
	at hudson.maven.artifact.transform.SnapshotTransformation.resolveLatestSnapshotBuildNumber(SnapshotTransformation.java:158)
	at hudson.maven.artifact.transform.SnapshotTransformation.transformForDeployment(SnapshotTransformation.java:104)
	... 14 more
Caused by: org.apache.maven.wagon.TransferFailedException: Error transferring file: Server returned HTTP response code: 502 for URL: https://repository.apache.org/content/repositories/snapshots/org/apache/myfaces/buildtools/myfaces-builder-annotations/1.0.8-SNAPSHOT/maven-metadata.xml
	at org.apache.maven.wagon.providers.http.LightweightHttpWagon.fillInputData(LightweightHttpWagon.java:143)
	at org.apache.maven.wagon.StreamWagon.getInputStream(StreamWagon.java:116)
	at org.apache.maven.wagon.StreamWagon.getIfNewer(StreamWagon.java:88)
	at org.apache.maven.wagon.StreamWagon.get(StreamWagon.java:61)
	at org.apache.maven.repository.legacy.DefaultWagonManager.getRemoteFile(DefaultWagonManager.java:351)
	at org.apache.maven.repository.legacy.DefaultWagonManager.getArtifactMetadataFromDeploymentRepository(DefaultWagonManager.java:215)
	at org.apache.maven.artifact.repository.metadata.DefaultRepositoryMetadataManager.getArtifactMetadataFromDeploymentRepository(DefaultRepositoryMetadataManager.java:424)
	at org.apache.maven.artifact.repository.metadata.DefaultRepositoryMetadataManager.resolveAlways(DefaultRepositoryMetadataManager.java:396)
	... 16 more
Caused by: java.io.IOException: Server returned HTTP response code: 502 for URL: https://repository.apache.org/content/repositories/snapshots/org/apache/myfaces/buildtools/myfaces-builder-annotations/1.0.8-SNAPSHOT/maven-metadata.xml
	at sun.reflect.NativeConstructorAccessorImpl.newInstance0(Native Method)
	at sun.reflect.NativeConstructorAccessorImpl.newInstance(NativeConstructorAccessorImpl.java:39)
	at sun.reflect.DelegatingConstructorAccessorImpl.newInstance(DelegatingConstructorAccessorImpl.java:27)
	at java.lang.reflect.Constructor.newInstance(Constructor.java:513)
	at sun.net.www.protocol.http.HttpURLConnection$6.run(HttpURLConnection.java:1496)
	at java.security.AccessController.doPrivileged(Native Method)
	at sun.net.www.protocol.http.HttpURLConnection.getChainedException(HttpURLConnection.java:1490)
	at sun.net.www.protocol.http.HttpURLConnection.getInputStream(HttpURLConnection.java:1144)
	at sun.net.www.protocol.https.HttpsURLConnectionImpl.getInputStream(HttpsURLConnectionImpl.java:234)
	at org.apache.maven.wagon.providers.http.LightweightHttpWagon.fillInputData(LightweightHttpWagon.java:122)
	... 23 more
Caused by: java.io.IOException: Server returned HTTP response code: 502 for URL: https://repository.apache.org/content/repositories/snapshots/org/apache/myfaces/buildtools/myfaces-builder-annotations/1.0.8-SNAPSHOT/maven-metadata.xml
	at sun.net.www.protocol.http.HttpURLConnection.getInputStream(HttpURLConnection.java:1441)
	at java.net.HttpURLConnection.getResponseCode(HttpURLConnection.java:379)
	at sun.net.www.protocol.https.HttpsURLConnectionImpl.getResponseCode(HttpsURLConnectionImpl.java:318)
	at org.apache.maven.wagon.providers.http.LightweightHttpWagon.fillInputData(LightweightHttpWagon.java:115)
	... 23 more


Hudson build is back to normal : myfaces-maven2-plugins #52

Posted by Apache Hudson Server <hu...@hudson.apache.org>.
See <https://hudson.apache.org/hudson/job/myfaces-maven2-plugins/52/>