You are viewing a plain text version of this content. The canonical link for it is here.
Posted to issues@tez.apache.org by Apache Jenkins Server <je...@builds.apache.org> on 2015/07/07 17:43:09 UTC

Failed: TEZ-2496 PreCommit Build #888

Jira: https://issues.apache.org/jira/browse/TEZ-2496
Build: https://builds.apache.org/job/PreCommit-TEZ-Build/888/

###################################################################################
########################## LAST 60 LINES OF THE CONSOLE ###########################
[...truncated 3031 lines...]




{color:red}-1 overall{color}.  Here are the results of testing the latest attachment
  http://issues.apache.org/jira/secure/attachment/12743967/TEZ-2496.8.patch
  against master revision cb59851.

    {color:green}+1 @author{color}.  The patch does not contain any @author tags.

    {color:green}+1 tests included{color}.  The patch appears to include 5 new or modified test files.

    {color:green}+1 javac{color}.  The applied patch does not increase the total number of javac compiler warnings.

    {color:green}+1 javadoc{color}.  There were no new javadoc warning messages.

    {color:red}-1 findbugs{color}.  The patch appears to introduce 1 new Findbugs (version 3.0.1) warnings.

    {color:green}+1 release audit{color}.  The applied patch does not increase the total number of release audit warnings.

    {color:green}+1 core tests{color}.  The patch passed unit tests in .

Test results: https://builds.apache.org/job/PreCommit-TEZ-Build/888//testReport/
Findbugs warnings: https://builds.apache.org/job/PreCommit-TEZ-Build/888//artifact/patchprocess/newPatchFindbugsWarningstez-runtime-library.html
Console output: https://builds.apache.org/job/PreCommit-TEZ-Build/888//console

This message is automatically generated.


======================================================================
======================================================================
    Adding comment to Jira.
======================================================================
======================================================================


Comment added.
272bccd126b7eae25bc48b9a20d825929d1390e9 logged out


======================================================================
======================================================================
    Finished build.
======================================================================
======================================================================


Build step 'Execute shell' marked build as failure
Archiving artifacts
Sending artifact delta relative to PreCommit-TEZ-Build #886
Archived 47 artifacts
Archive block size is 32768
Received 6 blocks and 2745509 bytes
Compression is 6.7%
Took 0.64 sec
[description-setter] Could not determine description.
Recording test results
Email was triggered for: Failure
Sending email for trigger: Failure



###################################################################################
############################## FAILED TESTS (if any) ##############################
All tests passed

Success: TEZ-2496 PreCommit Build #890

Posted by Apache Jenkins Server <je...@builds.apache.org>.
Jira: https://issues.apache.org/jira/browse/TEZ-2496
Build: https://builds.apache.org/job/PreCommit-TEZ-Build/890/

###################################################################################
########################## LAST 60 LINES OF THE CONSOLE ###########################
[...truncated 3029 lines...]
[INFO] Final Memory: 85M/1464M
[INFO] ------------------------------------------------------------------------




{color:green}+1 overall{color}.  Here are the results of testing the latest attachment
  http://issues.apache.org/jira/secure/attachment/12744190/TEZ-2496.8.patch
  against master revision cb59851.

    {color:green}+1 @author{color}.  The patch does not contain any @author tags.

    {color:green}+1 tests included{color}.  The patch appears to include 6 new or modified test files.

    {color:green}+1 javac{color}.  The applied patch does not increase the total number of javac compiler warnings.

    {color:green}+1 javadoc{color}.  There were no new javadoc warning messages.

    {color:green}+1 findbugs{color}.  The patch does not introduce any new Findbugs (version 3.0.1) warnings.

    {color:green}+1 release audit{color}.  The applied patch does not increase the total number of release audit warnings.

    {color:green}+1 core tests{color}.  The patch passed unit tests in .

Test results: https://builds.apache.org/job/PreCommit-TEZ-Build/890//testReport/
Console output: https://builds.apache.org/job/PreCommit-TEZ-Build/890//console

This message is automatically generated.


======================================================================
======================================================================
    Adding comment to Jira.
======================================================================
======================================================================


Comment added.
a041db5de48539f7497f6675e61e9a36fcbe8099 logged out


======================================================================
======================================================================
    Finished build.
======================================================================
======================================================================


Archiving artifacts
Sending artifact delta relative to PreCommit-TEZ-Build #886
Archived 47 artifacts
Archive block size is 32768
Received 6 blocks and 2732155 bytes
Compression is 6.7%
Took 0.73 sec
Description set: TEZ-2496
Recording test results
Email was triggered for: Success
Sending email for trigger: Success



###################################################################################
############################## FAILED TESTS (if any) ##############################
All tests passed

Failed: TEZ-2604 PreCommit Build #889

Posted by Apache Jenkins Server <je...@builds.apache.org>.
Jira: https://issues.apache.org/jira/browse/TEZ-2604
Build: https://builds.apache.org/job/PreCommit-TEZ-Build/889/

###################################################################################
########################## LAST 60 LINES OF THE CONSOLE ###########################
[...truncated 3015 lines...]



{color:red}-1 overall{color}.  Here are the results of testing the latest attachment
  http://issues.apache.org/jira/secure/attachment/12744119/TEZ-2604.001.patch
  against master revision cb59851.

    {color:green}+1 @author{color}.  The patch does not contain any @author tags.

    {color:red}-1 tests included{color}.  The patch doesn't appear to include any new or modified tests.
                        Please justify why no new tests are needed for this patch.
                        Also please list what manual steps were performed to verify this patch.

    {color:green}+1 javac{color}.  The applied patch does not increase the total number of javac compiler warnings.

    {color:green}+1 javadoc{color}.  There were no new javadoc warning messages.

    {color:green}+1 findbugs{color}.  The patch does not introduce any new Findbugs (version 3.0.1) warnings.

    {color:green}+1 release audit{color}.  The applied patch does not increase the total number of release audit warnings.

    {color:green}+1 core tests{color}.  The patch passed unit tests in .

Test results: https://builds.apache.org/job/PreCommit-TEZ-Build/889//testReport/
Console output: https://builds.apache.org/job/PreCommit-TEZ-Build/889//console

This message is automatically generated.


======================================================================
======================================================================
    Adding comment to Jira.
======================================================================
======================================================================


Comment added.
d8f2eb00984aa18daa203db3a0bb37cd2f6cb106 logged out


======================================================================
======================================================================
    Finished build.
======================================================================
======================================================================


Build step 'Execute shell' marked build as failure
Archiving artifacts
Sending artifact delta relative to PreCommit-TEZ-Build #886
Archived 47 artifacts
Archive block size is 32768
Received 6 blocks and 2752653 bytes
Compression is 6.7%
Took 0.7 sec
[description-setter] Could not determine description.
Recording test results
Email was triggered for: Failure
Sending email for trigger: Failure



###################################################################################
############################## FAILED TESTS (if any) ##############################
All tests passed