You are viewing a plain text version of this content. The canonical link for it is here.
Posted to builds@beam.apache.org by Apache Jenkins Server <je...@builds.apache.org> on 2022/04/22 10:17:45 UTC
Build failed in Jenkins: beam_LoadTests_Go_GBK_Dataflow_Batch #488
See <https://ci-beam.apache.org/job/beam_LoadTests_Go_GBK_Dataflow_Batch/488/display/redirect?page=changes>
Changes:
[mmack] [BEAM-14335] Spotless Spark sources
[mmack] [BEAM-14345] Force paranamer 2.8 for Spark Hadoop version tests to avoid
[noreply] BEAM-13582 Fixing broken links in the documentation (#17300)
[kamil.bregula] Revert "[BEAM-14300] Fix Java precommit failure"
[kamil.bregula] Revert "Merge pull request #17223 from [BEAM-14215] Improve argument
[noreply] [BEAM-13657] Sunset python 3.6 (#17252)
[noreply] Removes unsupported Python 3.6 from the release validation script
[noreply] [BEAM-13984] Implement RunInference for PyTorch (#17196)
[noreply] [BEAM-13945] add json type support for java bigquery connector (#17209)
[noreply] [BEAM-14346] Fix incorrect error case index in ret2() (#17425)
[noreply] [BEAM-14342] Fix wrong default buffer type in fn_runner (#17420)
[noreply] Updates opencensus-api dependency to the latest version - 0.31.0
[noreply] [BEAM-14306] Add unit testing to pane coder (#17370)
[noreply] Updated the dep and golden for screen diff integration tests (#17442)
------------------------------------------
[...truncated 17.37 KB...]
>
environments: <
key: "go"
value: <
urn: "beam:env:docker:v1"
payload: "\n\035apache/beam_go_sdk:2.39.0.dev"
capabilities: "beam:protocol:progress_reporting:v0"
capabilities: "beam:protocol:multi_core_bundle_processing:v1"
capabilities: "beam:version:sdk_base:go"
capabilities: "beam:coder:bytes:v1"
capabilities: "beam:coder:bool:v1"
capabilities: "beam:coder:varint:v1"
capabilities: "beam:coder:double:v1"
capabilities: "beam:coder:string_utf8:v1"
capabilities: "beam:coder:length_prefix:v1"
capabilities: "beam:coder:kv:v1"
capabilities: "beam:coder:iterable:v1"
capabilities: "beam:coder:state_backed_iterable:v1"
capabilities: "beam:coder:windowed_value:v1"
capabilities: "beam:coder:global_window:v1"
capabilities: "beam:coder:interval_window:v1"
capabilities: "beam:coder:row:v1"
capabilities: "beam:coder:nullable:v1"
dependencies: <
type_urn: "beam:artifact:type:url:v1"
type_payload: "\nJgs://temp-storage-for-perf-tests/loadtests/go-1-1650622481416444787/****\022@3a4cbf3600490040a5fec86a009479d6e8a1446c1bf27308ed57924bbe115df4"
role_urn: "beam:artifact:role:go_****_binary:v1"
>
>
>
>
root_transform_ids: "s1"
root_transform_ids: "e4"
root_transform_ids: "e5"
root_transform_ids: "e6"
root_transform_ids: "e7"
requirements: "beam:requirement:pardo:splittable_dofn:v1"
2022/04/22 10:14:42 Staged model pipeline: gs://temp-storage-for-perf-tests/loadtests/go-1-1650622481416444787/model
2022/04/22 10:14:42 {
"environment": {
"experiments": [
"use_unified_****",
"use_portable_job_submission",
"beam_fn_api"
],
"sdkPipelineOptions": {
"display_data": [
{
"key": "name",
"namespace": "options",
"type": "STRING",
"value": "load-tests-go-dataflow-batch-gbk-1-0422100253"
},
{
"key": "experiments",
"namespace": "options",
"type": "STRING",
"value": "use_unified_****,use_portable_job_submission"
},
{
"key": "project",
"namespace": "options",
"type": "STRING",
"value": "apache-beam-testing"
},
{
"key": "region",
"namespace": "options",
"type": "STRING",
"value": "us-central1"
},
{
"key": "container_images",
"namespace": "options",
"type": "STRING",
"value": "apache/beam_go_sdk:2.39.0.dev"
},
{
"key": "temp_location",
"namespace": "options",
"type": "STRING",
"value": "gs://temp-storage-for-perf-tests/loadtests"
},
{
"key": "influx_hostname",
"namespace": "go_options",
"type": "STRING",
"value": "http://10.128.0.96:8086"
},
{
"key": "iterations",
"namespace": "go_options",
"type": "STRING",
"value": "1"
},
{
"key": "hookOrder",
"namespace": "go_options",
"type": "STRING",
"value": "[\"default_remote_logging\"]"
},
{
"key": "fanout",
"namespace": "go_options",
"type": "STRING",
"value": "1"
},
{
"key": "hooks",
"namespace": "go_options",
"type": "STRING",
"value": "{\"default_remote_logging\":null}"
},
{
"key": "input_options",
"namespace": "go_options",
"type": "STRING",
"value": "{\"num_records\": 200000000,\"key_size\": 1,\"value_size\": 9}"
},
{
"key": "****_binary",
"namespace": "go_options",
"type": "STRING",
"value": "linux_amd64/group_by_key"
},
{
"key": "influx_db_name",
"namespace": "go_options",
"type": "STRING",
"value": "beam_test_metrics"
},
{
"key": "influx_measurement",
"namespace": "go_options",
"type": "STRING",
"value": "go_batch_gbk_1"
},
{
"key": "influx_namespace",
"namespace": "go_options",
"type": "STRING",
"value": "dataflow"
}
],
"options": {
"experiments": [
"use_unified_****",
"use_portable_job_submission",
"beam_fn_api"
],
"pipelineUrl": "gs://temp-storage-for-perf-tests/loadtests/go-1-1650622481416444787/model",
"region": "us-central1",
"tempLocation": "gs://temp-storage-for-perf-tests/loadtests"
},
"beam:option:go_options:v1": {
"options": {
"fanout": "1",
"hookOrder": "[\"default_remote_logging\"]",
"hooks": "{\"default_remote_logging\":null}",
"influx_db_name": "beam_test_metrics",
"influx_hostname": "http://10.128.0.96:8086",
"influx_measurement": "go_batch_gbk_1",
"influx_namespace": "dataflow",
"input_options": "{\"num_records\": 200000000,\"key_size\": 1,\"value_size\": 9}",
"iterations": "1",
"****_binary": "linux_amd64/group_by_key"
}
}
},
"tempStoragePrefix": "gs://temp-storage-for-perf-tests/loadtests",
"userAgent": {
"name": "Apache Beam SDK for Go",
"version": "2.39.0.dev"
},
"version": {
"job_type": "FNAPI_BATCH",
"major": "6"
},
"****Pools": [
{
"autoscalingSettings": {
"algorithm": "AUTOSCALING_ALGORITHM_NONE"
},
"ipConfiguration": "WORKER_IP_UNSPECIFIED",
"kind": "harness",
"numWorkers": 5,
"packages": [
{
"location": "gs://temp-storage-for-perf-tests/loadtests/go-1-1650622481416444787/****",
"name": "****"
}
],
"sdkHarnessContainerImages": [
{
"containerImage": "apache/beam_go_sdk:2.39.0.dev"
}
],
"****HarnessContainerImage": "apache/beam_go_sdk:2.39.0.dev"
}
]
},
"name": "load-tests-go-dataflow-batch-gbk-1-0422100253",
"projectId": "apache-beam-testing",
"type": "JOB_TYPE_BATCH"
}
2022/04/22 10:14:42 Submitted job: 2022-04-22_03_14_42-6805910100148431205
2022/04/22 10:14:42 Console: https://console.cloud.google.com/dataflow/jobs/us-central1/2022-04-22_03_14_42-6805910100148431205?project=apache-beam-testing
2022/04/22 10:14:42 Logs: https://console.cloud.google.com/logs/viewer?project=apache-beam-testing&resource=dataflow_step%2Fjob_id%2F2022-04-22_03_14_42-6805910100148431205
2022/04/22 10:14:42 Job state: JOB_STATE_PENDING ...
2022/04/22 10:15:13 Job still running ...
2022/04/22 10:15:43 Job still running ...
2022/04/22 10:16:13 Job still running ...
2022/04/22 10:16:43 Job still running ...
2022/04/22 10:17:13 Job still running ...
2022/04/22 10:17:43 Failed to execute job: job 2022-04-22_03_14_42-6805910100148431205 failed
panic: Failed to execute job: job 2022-04-22_03_14_42-6805910100148431205 failed
goroutine 1 [running]:
github.com/apache/beam/sdks/v2/go/pkg/beam/log.Fatalf(0x1202fa8, 0xc000120000, 0x10e17e5, 0x19, 0xc0004d1e00, 0x1, 0x1)
<https://ci-beam.apache.org/job/beam_LoadTests_Go_GBK_Dataflow_Batch/ws/src/sdks/go/pkg/beam/log/log.go>:153 +0xec
main.main()
<https://ci-beam.apache.org/job/beam_LoadTests_Go_GBK_Dataflow_Batch/ws/src/sdks/go/test/load/group_by_key/group_by_key.go>:82 +0x418
> Task :sdks:go:test:load:run FAILED
FAILURE: Build failed with an exception.
* Where:
Build file '<https://ci-beam.apache.org/job/beam_LoadTests_Go_GBK_Dataflow_Batch/ws/src/sdks/go/test/load/build.gradle'> line: 31
* What went wrong:
Execution failed for task ':sdks:go:test:load:run'.
> Process 'command 'sh'' finished with non-zero exit value 2
* Try:
> Run with --stacktrace option to get the stack trace.
> Run with --info or --debug option to get more log output.
> Run with --scan to get full insights.
* Get more help at https://help.gradle.org
BUILD FAILED in 3m 21s
12 actionable tasks: 6 executed, 4 from cache, 2 up-to-date
Publishing build scan...
https://gradle.com/s/otpyzep6gqcvu
Build step 'Invoke Gradle script' changed build result to FAILURE
Build step 'Invoke Gradle script' marked build as failure
---------------------------------------------------------------------
To unsubscribe, e-mail: builds-unsubscribe@beam.apache.org
For additional commands, e-mail: builds-help@beam.apache.org
Jenkins build is back to normal : beam_LoadTests_Go_GBK_Dataflow_Batch #503
Posted by Apache Jenkins Server <je...@builds.apache.org>.
See <https://ci-beam.apache.org/job/beam_LoadTests_Go_GBK_Dataflow_Batch/503/display/redirect>
---------------------------------------------------------------------
To unsubscribe, e-mail: builds-unsubscribe@beam.apache.org
For additional commands, e-mail: builds-help@beam.apache.org
Build failed in Jenkins: beam_LoadTests_Go_GBK_Dataflow_Batch #502
Posted by Apache Jenkins Server <je...@builds.apache.org>.
See <https://ci-beam.apache.org/job/beam_LoadTests_Go_GBK_Dataflow_Batch/502/display/redirect?page=changes>
Changes:
[zyichi] Move master readme.md to 2.40.0
[noreply] [BEAM-14173] Fix Go Loadtests on Dataflow & partial fix for Flink
------------------------------------------
[...truncated 17.87 KB...]
urn: "beam:env:docker:v1"
payload: "\n\035apache/beam_go_sdk:2.40.0.dev"
capabilities: "beam:protocol:progress_reporting:v0"
capabilities: "beam:protocol:multi_core_bundle_processing:v1"
capabilities: "beam:version:sdk_base:go"
capabilities: "beam:coder:bytes:v1"
capabilities: "beam:coder:bool:v1"
capabilities: "beam:coder:varint:v1"
capabilities: "beam:coder:double:v1"
capabilities: "beam:coder:string_utf8:v1"
capabilities: "beam:coder:length_prefix:v1"
capabilities: "beam:coder:kv:v1"
capabilities: "beam:coder:iterable:v1"
capabilities: "beam:coder:state_backed_iterable:v1"
capabilities: "beam:coder:windowed_value:v1"
capabilities: "beam:coder:global_window:v1"
capabilities: "beam:coder:interval_window:v1"
capabilities: "beam:coder:row:v1"
capabilities: "beam:coder:nullable:v1"
dependencies: <
type_urn: "beam:artifact:type:url:v1"
type_payload: "\nJgs://temp-storage-for-perf-tests/loadtests/go-1-1651770359940525884/****\022@d5e3302be53953788970a45089f4c84e179c393666cc6a221e16c83b8609a7ea"
role_urn: "beam:artifact:role:go_****_binary:v1"
>
>
>
>
root_transform_ids: "s1"
root_transform_ids: "e4"
root_transform_ids: "e5"
root_transform_ids: "e6"
root_transform_ids: "e7"
requirements: "beam:requirement:pardo:splittable_dofn:v1"
2022/05/05 17:06:00 Staged model pipeline: gs://temp-storage-for-perf-tests/loadtests/go-1-1651770359940525884/model
2022/05/05 17:06:00 {
"environment": {
"experiments": [
"use_unified_****",
"use_portable_job_submission",
"beam_fn_api"
],
"sdkPipelineOptions": {
"display_data": [
{
"key": "name",
"namespace": "options",
"type": "STRING",
"value": "load-tests-go-dataflow-batch-gbk-1-0505150310"
},
{
"key": "experiments",
"namespace": "options",
"type": "STRING",
"value": "use_unified_****,use_portable_job_submission"
},
{
"key": "project",
"namespace": "options",
"type": "STRING",
"value": "apache-beam-testing"
},
{
"key": "region",
"namespace": "options",
"type": "STRING",
"value": "us-central1"
},
{
"key": "container_images",
"namespace": "options",
"type": "STRING",
"value": "apache/beam_go_sdk:2.40.0.dev"
},
{
"key": "temp_location",
"namespace": "options",
"type": "STRING",
"value": "gs://temp-storage-for-perf-tests/loadtests"
},
{
"key": "fanout",
"namespace": "go_options",
"type": "STRING",
"value": "1"
},
{
"key": "iterations",
"namespace": "go_options",
"type": "STRING",
"value": "1"
},
{
"key": "influx_db_name",
"namespace": "go_options",
"type": "STRING",
"value": "beam_test_metrics"
},
{
"key": "influx_hostname",
"namespace": "go_options",
"type": "STRING",
"value": "http://10.128.0.96:8086"
},
{
"key": "hookOrder",
"namespace": "go_options",
"type": "STRING",
"value": "[\"default_remote_logging\"]"
},
{
"key": "****_binary",
"namespace": "go_options",
"type": "STRING",
"value": "linux_amd64/group_by_key"
},
{
"key": "hooks",
"namespace": "go_options",
"type": "STRING",
"value": "{\"default_remote_logging\":null}"
},
{
"key": "influx_measurement",
"namespace": "go_options",
"type": "STRING",
"value": "go_batch_gbk_1"
},
{
"key": "influx_namespace",
"namespace": "go_options",
"type": "STRING",
"value": "dataflow"
},
{
"key": "input_options",
"namespace": "go_options",
"type": "STRING",
"value": "{\"num_records\": 200000000,\"key_size\": 1,\"value_size\": 9}"
}
],
"options": {
"experiments": [
"use_unified_****",
"use_portable_job_submission",
"beam_fn_api"
],
"pipelineUrl": "gs://temp-storage-for-perf-tests/loadtests/go-1-1651770359940525884/model",
"region": "us-central1",
"tempLocation": "gs://temp-storage-for-perf-tests/loadtests"
},
"beam:option:go_options:v1": {
"options": {
"fanout": "1",
"hookOrder": "[\"default_remote_logging\"]",
"hooks": "{\"default_remote_logging\":null}",
"influx_db_name": "beam_test_metrics",
"influx_hostname": "http://10.128.0.96:8086",
"influx_measurement": "go_batch_gbk_1",
"influx_namespace": "dataflow",
"input_options": "{\"num_records\": 200000000,\"key_size\": 1,\"value_size\": 9}",
"iterations": "1",
"****_binary": "linux_amd64/group_by_key"
}
}
},
"tempStoragePrefix": "gs://temp-storage-for-perf-tests/loadtests",
"userAgent": {
"name": "Apache Beam SDK for Go",
"version": "2.40.0.dev"
},
"version": {
"job_type": "FNAPI_BATCH",
"major": "6"
},
"****Pools": [
{
"autoscalingSettings": {
"algorithm": "AUTOSCALING_ALGORITHM_NONE"
},
"ipConfiguration": "WORKER_IP_UNSPECIFIED",
"kind": "harness",
"numWorkers": 5,
"packages": [
{
"location": "gs://temp-storage-for-perf-tests/loadtests/go-1-1651770359940525884/****",
"name": "****"
}
],
"sdkHarnessContainerImages": [
{
"containerImage": "apache/beam_go_sdk:2.40.0.dev"
}
],
"****HarnessContainerImage": "apache/beam_go_sdk:2.40.0.dev"
}
]
},
"name": "load-tests-go-dataflow-batch-gbk-1-0505150310",
"projectId": "apache-beam-testing",
"type": "JOB_TYPE_BATCH"
}
2022/05/05 17:06:01 Submitted job: 2022-05-05_10_06_00-5280983618146128895
2022/05/05 17:06:01 Console: https://console.cloud.google.com/dataflow/jobs/us-central1/2022-05-05_10_06_00-5280983618146128895?project=apache-beam-testing
2022/05/05 17:06:01 Logs: https://console.cloud.google.com/logs/viewer?project=apache-beam-testing&resource=dataflow_step%2Fjob_id%2F2022-05-05_10_06_00-5280983618146128895
2022/05/05 17:06:01 Job state: JOB_STATE_PENDING ...
2022/05/05 17:06:31 Job still running ...
2022/05/05 17:07:01 Job still running ...
2022/05/05 17:07:31 Job still running ...
2022/05/05 17:08:01 Job still running ...
2022/05/05 17:08:31 Job still running ...
2022/05/05 17:09:01 Job still running ...
2022/05/05 17:09:31 Job still running ...
2022/05/05 17:10:01 Job still running ...
2022/05/05 17:10:31 Job still running ...
2022/05/05 17:11:01 Failed to execute job: job 2022-05-05_10_06_00-5280983618146128895 failed
panic: Failed to execute job: job 2022-05-05_10_06_00-5280983618146128895 failed
goroutine 1 [running]:
github.com/apache/beam/sdks/v2/go/pkg/beam/log.Fatalf(0x1231ac8, 0xc000120000, 0x110e7c4, 0x19, 0xc000445e78, 0x1, 0x1)
<https://ci-beam.apache.org/job/beam_LoadTests_Go_GBK_Dataflow_Batch/ws/src/sdks/go/pkg/beam/log/log.go>:153 +0xec
main.main()
<https://ci-beam.apache.org/job/beam_LoadTests_Go_GBK_Dataflow_Batch/ws/src/sdks/go/test/load/group_by_key/group_by_key.go>:82 +0x418
> Task :sdks:go:test:load:run FAILED
FAILURE: Build failed with an exception.
* Where:
Build file '<https://ci-beam.apache.org/job/beam_LoadTests_Go_GBK_Dataflow_Batch/ws/src/sdks/go/test/load/build.gradle'> line: 31
* What went wrong:
Execution failed for task ':sdks:go:test:load:run'.
> Process 'command 'sh'' finished with non-zero exit value 2
* Try:
> Run with --stacktrace option to get the stack trace.
> Run with --info or --debug option to get more log output.
> Run with --scan to get full insights.
* Get more help at https://help.gradle.org
BUILD FAILED in 5m 20s
12 actionable tasks: 6 executed, 4 from cache, 2 up-to-date
Publishing build scan...
https://gradle.com/s/7dzf33qxlt6um
Build step 'Invoke Gradle script' changed build result to FAILURE
Build step 'Invoke Gradle script' marked build as failure
---------------------------------------------------------------------
To unsubscribe, e-mail: builds-unsubscribe@beam.apache.org
For additional commands, e-mail: builds-help@beam.apache.org
Build failed in Jenkins: beam_LoadTests_Go_GBK_Dataflow_Batch #501
Posted by Apache Jenkins Server <je...@builds.apache.org>.
See <https://ci-beam.apache.org/job/beam_LoadTests_Go_GBK_Dataflow_Batch/501/display/redirect?page=changes>
Changes:
[Heejong Lee] [BEAM-9245] Unable to pull datatore Entity which contains dict
[bulat.safiullin] [BEAM-14382] [Website] add banner container for with css, images, html
[Jan Lukavský] [BEAM-14196] add test verifying output watermark propagation in bundle
[Jan Lukavský] [BEAM-14196] Fix FlinkRunner mid-bundle output watermark handling
[nielm] [BEAM-14405] Fix NPE when ProjectID is not specified in a template
[bulat.safiullin] [BEAM-14382] change mobile banner img, add padding to banner section
[ahmedabualsaud] fix test decotrator typo
[noreply] Merge pull request #17440 from [BEAM-14329] Enable exponential backoff
[noreply] [BEAM-11104] Fix output forwarding issue for ProcessContinuations
[noreply] re-add testing package to pydoc (#17524)
[Heejong Lee] add test
[noreply] [BEAM-14250] Amended the workaround (#17531)
[noreply] [BEAM-11104] Fix broken split result validation (#17546)
[noreply] Fixed a SQL and screenshots in the Beam SQL blog (#17545)
[noreply] Merge pull request #17417: [BEAM-14388] Address some performance
[noreply] [BEAM-14386] [Flink] Support for scala 2.12 (#17512)
[noreply] [BEAM-14294] Worker changes to support trivial Batched DoFns (#17384)
[zyichi] Moving to 2.40.0-SNAPSHOT on master branch.
[noreply] [BEAM-14048] [CdapIO] Add ConfigWrapper for building CDAP PluginConfigs
------------------------------------------
[...truncated 17.66 KB...]
>
environments: <
key: "go"
value: <
urn: "beam:env:docker:v1"
payload: "\n\035apache/beam_go_sdk:2.40.0.dev"
capabilities: "beam:protocol:progress_reporting:v0"
capabilities: "beam:protocol:multi_core_bundle_processing:v1"
capabilities: "beam:version:sdk_base:go"
capabilities: "beam:coder:bytes:v1"
capabilities: "beam:coder:bool:v1"
capabilities: "beam:coder:varint:v1"
capabilities: "beam:coder:double:v1"
capabilities: "beam:coder:string_utf8:v1"
capabilities: "beam:coder:length_prefix:v1"
capabilities: "beam:coder:kv:v1"
capabilities: "beam:coder:iterable:v1"
capabilities: "beam:coder:state_backed_iterable:v1"
capabilities: "beam:coder:windowed_value:v1"
capabilities: "beam:coder:global_window:v1"
capabilities: "beam:coder:interval_window:v1"
capabilities: "beam:coder:row:v1"
capabilities: "beam:coder:nullable:v1"
dependencies: <
type_urn: "beam:artifact:type:url:v1"
type_payload: "\nJgs://temp-storage-for-perf-tests/loadtests/go-1-1651745682185912279/****\022@69432aee790707f01f5db56364a6c14676b5f0a8d05487850b8dad0ff4e3e4ce"
role_urn: "beam:artifact:role:go_****_binary:v1"
>
>
>
>
root_transform_ids: "s1"
root_transform_ids: "e4"
root_transform_ids: "e5"
root_transform_ids: "e6"
root_transform_ids: "e7"
requirements: "beam:requirement:pardo:splittable_dofn:v1"
2022/05/05 10:14:43 Staged model pipeline: gs://temp-storage-for-perf-tests/loadtests/go-1-1651745682185912279/model
2022/05/05 10:14:43 {
"environment": {
"experiments": [
"use_unified_****",
"use_portable_job_submission",
"beam_fn_api"
],
"sdkPipelineOptions": {
"display_data": [
{
"key": "name",
"namespace": "options",
"type": "STRING",
"value": "load-tests-go-dataflow-batch-gbk-1-0505100250"
},
{
"key": "experiments",
"namespace": "options",
"type": "STRING",
"value": "use_unified_****,use_portable_job_submission"
},
{
"key": "project",
"namespace": "options",
"type": "STRING",
"value": "apache-beam-testing"
},
{
"key": "region",
"namespace": "options",
"type": "STRING",
"value": "us-central1"
},
{
"key": "container_images",
"namespace": "options",
"type": "STRING",
"value": "apache/beam_go_sdk:2.40.0.dev"
},
{
"key": "temp_location",
"namespace": "options",
"type": "STRING",
"value": "gs://temp-storage-for-perf-tests/loadtests"
},
{
"key": "fanout",
"namespace": "go_options",
"type": "STRING",
"value": "1"
},
{
"key": "****_binary",
"namespace": "go_options",
"type": "STRING",
"value": "linux_amd64/group_by_key"
},
{
"key": "influx_hostname",
"namespace": "go_options",
"type": "STRING",
"value": "http://10.128.0.96:8086"
},
{
"key": "influx_namespace",
"namespace": "go_options",
"type": "STRING",
"value": "dataflow"
},
{
"key": "iterations",
"namespace": "go_options",
"type": "STRING",
"value": "1"
},
{
"key": "hooks",
"namespace": "go_options",
"type": "STRING",
"value": "{\"default_remote_logging\":null}"
},
{
"key": "influx_db_name",
"namespace": "go_options",
"type": "STRING",
"value": "beam_test_metrics"
},
{
"key": "influx_measurement",
"namespace": "go_options",
"type": "STRING",
"value": "go_batch_gbk_1"
},
{
"key": "input_options",
"namespace": "go_options",
"type": "STRING",
"value": "{\"num_records\": 200000000,\"key_size\": 1,\"value_size\": 9}"
},
{
"key": "hookOrder",
"namespace": "go_options",
"type": "STRING",
"value": "[\"default_remote_logging\"]"
}
],
"options": {
"experiments": [
"use_unified_****",
"use_portable_job_submission",
"beam_fn_api"
],
"pipelineUrl": "gs://temp-storage-for-perf-tests/loadtests/go-1-1651745682185912279/model",
"region": "us-central1",
"tempLocation": "gs://temp-storage-for-perf-tests/loadtests"
},
"beam:option:go_options:v1": {
"options": {
"fanout": "1",
"hookOrder": "[\"default_remote_logging\"]",
"hooks": "{\"default_remote_logging\":null}",
"influx_db_name": "beam_test_metrics",
"influx_hostname": "http://10.128.0.96:8086",
"influx_measurement": "go_batch_gbk_1",
"influx_namespace": "dataflow",
"input_options": "{\"num_records\": 200000000,\"key_size\": 1,\"value_size\": 9}",
"iterations": "1",
"****_binary": "linux_amd64/group_by_key"
}
}
},
"tempStoragePrefix": "gs://temp-storage-for-perf-tests/loadtests",
"userAgent": {
"name": "Apache Beam SDK for Go",
"version": "2.40.0.dev"
},
"version": {
"job_type": "FNAPI_BATCH",
"major": "6"
},
"****Pools": [
{
"autoscalingSettings": {
"algorithm": "AUTOSCALING_ALGORITHM_NONE"
},
"ipConfiguration": "WORKER_IP_UNSPECIFIED",
"kind": "harness",
"numWorkers": 5,
"packages": [
{
"location": "gs://temp-storage-for-perf-tests/loadtests/go-1-1651745682185912279/****",
"name": "****"
}
],
"sdkHarnessContainerImages": [
{
"containerImage": "apache/beam_go_sdk:2.40.0.dev"
}
],
"****HarnessContainerImage": "apache/beam_go_sdk:2.40.0.dev"
}
]
},
"name": "load-tests-go-dataflow-batch-gbk-1-0505100250",
"projectId": "apache-beam-testing",
"type": "JOB_TYPE_BATCH"
}
2022/05/05 10:14:43 Submitted job: 2022-05-05_03_14_43-4748960088116013041
2022/05/05 10:14:43 Console: https://console.cloud.google.com/dataflow/jobs/us-central1/2022-05-05_03_14_43-4748960088116013041?project=apache-beam-testing
2022/05/05 10:14:43 Logs: https://console.cloud.google.com/logs/viewer?project=apache-beam-testing&resource=dataflow_step%2Fjob_id%2F2022-05-05_03_14_43-4748960088116013041
2022/05/05 10:14:43 Job state: JOB_STATE_PENDING ...
2022/05/05 10:15:13 Job still running ...
2022/05/05 10:15:43 Job still running ...
2022/05/05 10:16:13 Job still running ...
2022/05/05 10:16:43 Job still running ...
2022/05/05 10:17:13 Job still running ...
2022/05/05 10:17:43 Failed to execute job: job 2022-05-05_03_14_43-4748960088116013041 failed
panic: Failed to execute job: job 2022-05-05_03_14_43-4748960088116013041 failed
goroutine 1 [running]:
github.com/apache/beam/sdks/v2/go/pkg/beam/log.Fatalf(0x1231a68, 0xc000120000, 0x110e764, 0x19, 0xc00040fe78, 0x1, 0x1)
<https://ci-beam.apache.org/job/beam_LoadTests_Go_GBK_Dataflow_Batch/ws/src/sdks/go/pkg/beam/log/log.go>:153 +0xec
main.main()
<https://ci-beam.apache.org/job/beam_LoadTests_Go_GBK_Dataflow_Batch/ws/src/sdks/go/test/load/group_by_key/group_by_key.go>:82 +0x418
> Task :sdks:go:test:load:run FAILED
FAILURE: Build failed with an exception.
* Where:
Build file '<https://ci-beam.apache.org/job/beam_LoadTests_Go_GBK_Dataflow_Batch/ws/src/sdks/go/test/load/build.gradle'> line: 31
* What went wrong:
Execution failed for task ':sdks:go:test:load:run'.
> Process 'command 'sh'' finished with non-zero exit value 2
* Try:
> Run with --stacktrace option to get the stack trace.
> Run with --info or --debug option to get more log output.
> Run with --scan to get full insights.
* Get more help at https://help.gradle.org
BUILD FAILED in 3m 20s
12 actionable tasks: 6 executed, 4 from cache, 2 up-to-date
Publishing build scan...
https://gradle.com/s/am77tcufz7a4e
Build step 'Invoke Gradle script' changed build result to FAILURE
Build step 'Invoke Gradle script' marked build as failure
---------------------------------------------------------------------
To unsubscribe, e-mail: builds-unsubscribe@beam.apache.org
For additional commands, e-mail: builds-help@beam.apache.org
Build failed in Jenkins: beam_LoadTests_Go_GBK_Dataflow_Batch #500
Posted by Apache Jenkins Server <je...@builds.apache.org>.
See <https://ci-beam.apache.org/job/beam_LoadTests_Go_GBK_Dataflow_Batch/500/display/redirect?page=changes>
Changes:
[noreply] fix: JDBC config schema fields order
[Brian Hulette] Revert "Merge pull request #17255 from kileys/test-revert"
[Brian Hulette] BEAM-14231: bypass schema cache for
[noreply] [BEAM-13657] Follow up update version warning in __init__ (#17493)
[noreply] Merge pull request #17431 from [BEAM-14273] Add integration tests for BQ
[noreply] Merge pull request #17205 from [BEAM-14145] [Website] add carousel to
[noreply] [BEAM-14064] fix es io windowing (#17112)
[noreply] [BEAM-13670] Upgraded ipython from v7 to v8 (#17529)
[noreply] [BEAM-11104] Enable ProcessContinuation return values, add unit test
[Robert Bradshaw] [BEAM-14403] Allow Prime to be used with legacy workers.
[noreply] [BEAM-11106] Support drain in Go SDK (#17432)
[noreply] add __Init__ to inference. (#17514)
------------------------------------------
[...truncated 17.64 KB...]
urn: "beam:env:docker:v1"
payload: "\n\035apache/beam_go_sdk:2.39.0.dev"
capabilities: "beam:protocol:progress_reporting:v0"
capabilities: "beam:protocol:multi_core_bundle_processing:v1"
capabilities: "beam:version:sdk_base:go"
capabilities: "beam:coder:bytes:v1"
capabilities: "beam:coder:bool:v1"
capabilities: "beam:coder:varint:v1"
capabilities: "beam:coder:double:v1"
capabilities: "beam:coder:string_utf8:v1"
capabilities: "beam:coder:length_prefix:v1"
capabilities: "beam:coder:kv:v1"
capabilities: "beam:coder:iterable:v1"
capabilities: "beam:coder:state_backed_iterable:v1"
capabilities: "beam:coder:windowed_value:v1"
capabilities: "beam:coder:global_window:v1"
capabilities: "beam:coder:interval_window:v1"
capabilities: "beam:coder:row:v1"
capabilities: "beam:coder:nullable:v1"
dependencies: <
type_urn: "beam:artifact:type:url:v1"
type_payload: "\nJgs://temp-storage-for-perf-tests/loadtests/go-1-1651659279750722512/****\022@d766422b0dc71d2a087cb20896017c6b19fac3763be4352964a8ac35fbeaf558"
role_urn: "beam:artifact:role:go_****_binary:v1"
>
>
>
>
root_transform_ids: "s1"
root_transform_ids: "e4"
root_transform_ids: "e5"
root_transform_ids: "e6"
root_transform_ids: "e7"
requirements: "beam:requirement:pardo:splittable_dofn:v1"
2022/05/04 10:14:40 Staged model pipeline: gs://temp-storage-for-perf-tests/loadtests/go-1-1651659279750722512/model
2022/05/04 10:14:40 {
"environment": {
"experiments": [
"use_unified_****",
"use_portable_job_submission",
"beam_fn_api"
],
"sdkPipelineOptions": {
"display_data": [
{
"key": "name",
"namespace": "options",
"type": "STRING",
"value": "load-tests-go-dataflow-batch-gbk-1-0428110920"
},
{
"key": "experiments",
"namespace": "options",
"type": "STRING",
"value": "use_unified_****,use_portable_job_submission"
},
{
"key": "project",
"namespace": "options",
"type": "STRING",
"value": "apache-beam-testing"
},
{
"key": "region",
"namespace": "options",
"type": "STRING",
"value": "us-central1"
},
{
"key": "container_images",
"namespace": "options",
"type": "STRING",
"value": "apache/beam_go_sdk:2.39.0.dev"
},
{
"key": "temp_location",
"namespace": "options",
"type": "STRING",
"value": "gs://temp-storage-for-perf-tests/loadtests"
},
{
"key": "iterations",
"namespace": "go_options",
"type": "STRING",
"value": "1"
},
{
"key": "hooks",
"namespace": "go_options",
"type": "STRING",
"value": "{\"default_remote_logging\":null}"
},
{
"key": "influx_hostname",
"namespace": "go_options",
"type": "STRING",
"value": "http://10.128.0.96:8086"
},
{
"key": "influx_measurement",
"namespace": "go_options",
"type": "STRING",
"value": "go_batch_gbk_1"
},
{
"key": "influx_namespace",
"namespace": "go_options",
"type": "STRING",
"value": "dataflow"
},
{
"key": "input_options",
"namespace": "go_options",
"type": "STRING",
"value": "{\"num_records\": 200000000,\"key_size\": 1,\"value_size\": 9}"
},
{
"key": "hookOrder",
"namespace": "go_options",
"type": "STRING",
"value": "[\"default_remote_logging\"]"
},
{
"key": "****_binary",
"namespace": "go_options",
"type": "STRING",
"value": "linux_amd64/group_by_key"
},
{
"key": "fanout",
"namespace": "go_options",
"type": "STRING",
"value": "1"
},
{
"key": "influx_db_name",
"namespace": "go_options",
"type": "STRING",
"value": "beam_test_metrics"
}
],
"options": {
"experiments": [
"use_unified_****",
"use_portable_job_submission",
"beam_fn_api"
],
"pipelineUrl": "gs://temp-storage-for-perf-tests/loadtests/go-1-1651659279750722512/model",
"region": "us-central1",
"tempLocation": "gs://temp-storage-for-perf-tests/loadtests"
},
"beam:option:go_options:v1": {
"options": {
"fanout": "1",
"hookOrder": "[\"default_remote_logging\"]",
"hooks": "{\"default_remote_logging\":null}",
"influx_db_name": "beam_test_metrics",
"influx_hostname": "http://10.128.0.96:8086",
"influx_measurement": "go_batch_gbk_1",
"influx_namespace": "dataflow",
"input_options": "{\"num_records\": 200000000,\"key_size\": 1,\"value_size\": 9}",
"iterations": "1",
"****_binary": "linux_amd64/group_by_key"
}
}
},
"tempStoragePrefix": "gs://temp-storage-for-perf-tests/loadtests",
"userAgent": {
"name": "Apache Beam SDK for Go",
"version": "2.39.0.dev"
},
"version": {
"job_type": "FNAPI_BATCH",
"major": "6"
},
"****Pools": [
{
"autoscalingSettings": {
"algorithm": "AUTOSCALING_ALGORITHM_NONE"
},
"ipConfiguration": "WORKER_IP_UNSPECIFIED",
"kind": "harness",
"numWorkers": 5,
"packages": [
{
"location": "gs://temp-storage-for-perf-tests/loadtests/go-1-1651659279750722512/****",
"name": "****"
}
],
"sdkHarnessContainerImages": [
{
"containerImage": "apache/beam_go_sdk:2.39.0.dev"
}
],
"****HarnessContainerImage": "apache/beam_go_sdk:2.39.0.dev"
}
]
},
"name": "load-tests-go-dataflow-batch-gbk-1-0428110920",
"projectId": "apache-beam-testing",
"type": "JOB_TYPE_BATCH"
}
2022/05/04 10:14:41 Submitted job: 2022-05-04_03_14_40-10883133014636012091
2022/05/04 10:14:41 Console: https://console.cloud.google.com/dataflow/jobs/us-central1/2022-05-04_03_14_40-10883133014636012091?project=apache-beam-testing
2022/05/04 10:14:41 Logs: https://console.cloud.google.com/logs/viewer?project=apache-beam-testing&resource=dataflow_step%2Fjob_id%2F2022-05-04_03_14_40-10883133014636012091
2022/05/04 10:14:41 Job state: JOB_STATE_PENDING ...
2022/05/04 10:15:11 Job still running ...
2022/05/04 10:15:41 Job still running ...
2022/05/04 10:16:11 Job still running ...
2022/05/04 10:16:41 Job still running ...
2022/05/04 10:17:11 Job still running ...
2022/05/04 10:17:41 Job still running ...
2022/05/04 10:18:11 Job still running ...
2022/05/04 10:18:41 Job still running ...
2022/05/04 10:19:11 Job still running ...
2022/05/04 10:19:42 Failed to execute job: job 2022-05-04_03_14_40-10883133014636012091 failed
panic: Failed to execute job: job 2022-05-04_03_14_40-10883133014636012091 failed
goroutine 1 [running]:
github.com/apache/beam/sdks/v2/go/pkg/beam/log.Fatalf(0x1231a68, 0xc000120000, 0x110e764, 0x19, 0xc00087fe78, 0x1, 0x1)
<https://ci-beam.apache.org/job/beam_LoadTests_Go_GBK_Dataflow_Batch/ws/src/sdks/go/pkg/beam/log/log.go>:153 +0xec
main.main()
<https://ci-beam.apache.org/job/beam_LoadTests_Go_GBK_Dataflow_Batch/ws/src/sdks/go/test/load/group_by_key/group_by_key.go>:82 +0x418
> Task :sdks:go:test:load:run FAILED
FAILURE: Build failed with an exception.
* Where:
Build file '<https://ci-beam.apache.org/job/beam_LoadTests_Go_GBK_Dataflow_Batch/ws/src/sdks/go/test/load/build.gradle'> line: 31
* What went wrong:
Execution failed for task ':sdks:go:test:load:run'.
> Process 'command 'sh'' finished with non-zero exit value 2
* Try:
> Run with --stacktrace option to get the stack trace.
> Run with --info or --debug option to get more log output.
> Run with --scan to get full insights.
* Get more help at https://help.gradle.org
BUILD FAILED in 5m 19s
12 actionable tasks: 6 executed, 4 from cache, 2 up-to-date
Publishing build scan...
https://gradle.com/s/nojhwy2wmgvce
Build step 'Invoke Gradle script' changed build result to FAILURE
Build step 'Invoke Gradle script' marked build as failure
---------------------------------------------------------------------
To unsubscribe, e-mail: builds-unsubscribe@beam.apache.org
For additional commands, e-mail: builds-help@beam.apache.org
Build failed in Jenkins: beam_LoadTests_Go_GBK_Dataflow_Batch #499
Posted by Apache Jenkins Server <je...@builds.apache.org>.
See <https://ci-beam.apache.org/job/beam_LoadTests_Go_GBK_Dataflow_Batch/499/display/redirect?page=changes>
Changes:
[yathu] [BEAM-14375] Fix Java Wordcount Dataflow postcommit
[Robert Bradshaw] Allow arithmetic between deferred scalars.
[noreply] [BEAM-14390] Set user-agent when pulling licenses to avoid 403s (#17521)
[noreply] [BEAM-8688] Upgrade GCSIO to 2.2.6 (#17486)
[noreply] [BEAM-14253] patch SubscriptionPartitionLoader to work around a dataflow
[noreply] Add website link log to notify user of pre-build workflow. (#17498)
[noreply] [BEAM-11105] Add timestamp observing watermark estimation (#17476)
[noreply] Merge pull request #17487 from Adding user-agent to GCS client in Python
[noreply] [BEAM-10265] Display error message if trying to infer recursive schema
[noreply] [BEAM-12575] Upgraded ipykernel from v5 to v6 (#17526)
[noreply] [BEAM-11105] Add docs + CHANGES.md entry for Go Watermark Estimation
[noreply] Merge pull request #17380 from [BEAM-14314][BEAM-9532] Add last_updated
------------------------------------------
[...truncated 17.71 KB...]
urn: "beam:env:docker:v1"
payload: "\n\035apache/beam_go_sdk:2.39.0.dev"
capabilities: "beam:protocol:progress_reporting:v0"
capabilities: "beam:protocol:multi_core_bundle_processing:v1"
capabilities: "beam:version:sdk_base:go"
capabilities: "beam:coder:bytes:v1"
capabilities: "beam:coder:bool:v1"
capabilities: "beam:coder:varint:v1"
capabilities: "beam:coder:double:v1"
capabilities: "beam:coder:string_utf8:v1"
capabilities: "beam:coder:length_prefix:v1"
capabilities: "beam:coder:kv:v1"
capabilities: "beam:coder:iterable:v1"
capabilities: "beam:coder:state_backed_iterable:v1"
capabilities: "beam:coder:windowed_value:v1"
capabilities: "beam:coder:global_window:v1"
capabilities: "beam:coder:interval_window:v1"
capabilities: "beam:coder:row:v1"
capabilities: "beam:coder:nullable:v1"
dependencies: <
type_urn: "beam:artifact:type:url:v1"
type_payload: "\nJgs://temp-storage-for-perf-tests/loadtests/go-1-1651572878913216548/****\022@d3274d4a0ed4ad37465faa13319515ddde5ba80f38ba7bf56e0bf6ca45f03ffb"
role_urn: "beam:artifact:role:go_****_binary:v1"
>
>
>
>
root_transform_ids: "s1"
root_transform_ids: "e4"
root_transform_ids: "e5"
root_transform_ids: "e6"
root_transform_ids: "e7"
requirements: "beam:requirement:pardo:splittable_dofn:v1"
2022/05/03 10:14:39 Staged model pipeline: gs://temp-storage-for-perf-tests/loadtests/go-1-1651572878913216548/model
2022/05/03 10:14:39 {
"environment": {
"experiments": [
"use_unified_****",
"use_portable_job_submission",
"beam_fn_api"
],
"sdkPipelineOptions": {
"display_data": [
{
"key": "name",
"namespace": "options",
"type": "STRING",
"value": "load-tests-go-dataflow-batch-gbk-1-0428110920"
},
{
"key": "experiments",
"namespace": "options",
"type": "STRING",
"value": "use_unified_****,use_portable_job_submission"
},
{
"key": "project",
"namespace": "options",
"type": "STRING",
"value": "apache-beam-testing"
},
{
"key": "region",
"namespace": "options",
"type": "STRING",
"value": "us-central1"
},
{
"key": "container_images",
"namespace": "options",
"type": "STRING",
"value": "apache/beam_go_sdk:2.39.0.dev"
},
{
"key": "temp_location",
"namespace": "options",
"type": "STRING",
"value": "gs://temp-storage-for-perf-tests/loadtests"
},
{
"key": "influx_namespace",
"namespace": "go_options",
"type": "STRING",
"value": "dataflow"
},
{
"key": "influx_hostname",
"namespace": "go_options",
"type": "STRING",
"value": "http://10.128.0.96:8086"
},
{
"key": "influx_measurement",
"namespace": "go_options",
"type": "STRING",
"value": "go_batch_gbk_1"
},
{
"key": "hooks",
"namespace": "go_options",
"type": "STRING",
"value": "{\"default_remote_logging\":null}"
},
{
"key": "input_options",
"namespace": "go_options",
"type": "STRING",
"value": "{\"num_records\": 200000000,\"key_size\": 1,\"value_size\": 9}"
},
{
"key": "hookOrder",
"namespace": "go_options",
"type": "STRING",
"value": "[\"default_remote_logging\"]"
},
{
"key": "iterations",
"namespace": "go_options",
"type": "STRING",
"value": "1"
},
{
"key": "****_binary",
"namespace": "go_options",
"type": "STRING",
"value": "linux_amd64/group_by_key"
},
{
"key": "fanout",
"namespace": "go_options",
"type": "STRING",
"value": "1"
},
{
"key": "influx_db_name",
"namespace": "go_options",
"type": "STRING",
"value": "beam_test_metrics"
}
],
"options": {
"experiments": [
"use_unified_****",
"use_portable_job_submission",
"beam_fn_api"
],
"pipelineUrl": "gs://temp-storage-for-perf-tests/loadtests/go-1-1651572878913216548/model",
"region": "us-central1",
"tempLocation": "gs://temp-storage-for-perf-tests/loadtests"
},
"beam:option:go_options:v1": {
"options": {
"fanout": "1",
"hookOrder": "[\"default_remote_logging\"]",
"hooks": "{\"default_remote_logging\":null}",
"influx_db_name": "beam_test_metrics",
"influx_hostname": "http://10.128.0.96:8086",
"influx_measurement": "go_batch_gbk_1",
"influx_namespace": "dataflow",
"input_options": "{\"num_records\": 200000000,\"key_size\": 1,\"value_size\": 9}",
"iterations": "1",
"****_binary": "linux_amd64/group_by_key"
}
}
},
"tempStoragePrefix": "gs://temp-storage-for-perf-tests/loadtests",
"userAgent": {
"name": "Apache Beam SDK for Go",
"version": "2.39.0.dev"
},
"version": {
"job_type": "FNAPI_BATCH",
"major": "6"
},
"****Pools": [
{
"autoscalingSettings": {
"algorithm": "AUTOSCALING_ALGORITHM_NONE"
},
"ipConfiguration": "WORKER_IP_UNSPECIFIED",
"kind": "harness",
"numWorkers": 5,
"packages": [
{
"location": "gs://temp-storage-for-perf-tests/loadtests/go-1-1651572878913216548/****",
"name": "****"
}
],
"sdkHarnessContainerImages": [
{
"containerImage": "apache/beam_go_sdk:2.39.0.dev"
}
],
"****HarnessContainerImage": "apache/beam_go_sdk:2.39.0.dev"
}
]
},
"name": "load-tests-go-dataflow-batch-gbk-1-0428110920",
"projectId": "apache-beam-testing",
"type": "JOB_TYPE_BATCH"
}
2022/05/03 10:14:40 Submitted job: 2022-05-03_03_14_39-5735440478104037852
2022/05/03 10:14:40 Console: https://console.cloud.google.com/dataflow/jobs/us-central1/2022-05-03_03_14_39-5735440478104037852?project=apache-beam-testing
2022/05/03 10:14:40 Logs: https://console.cloud.google.com/logs/viewer?project=apache-beam-testing&resource=dataflow_step%2Fjob_id%2F2022-05-03_03_14_39-5735440478104037852
2022/05/03 10:14:40 Job state: JOB_STATE_PENDING ...
2022/05/03 10:15:10 Job still running ...
2022/05/03 10:15:40 Job still running ...
2022/05/03 10:16:10 Job still running ...
2022/05/03 10:16:40 Job still running ...
2022/05/03 10:17:10 Job still running ...
2022/05/03 10:17:40 Job still running ...
2022/05/03 10:18:10 Job still running ...
2022/05/03 10:18:40 Job still running ...
2022/05/03 10:19:10 Job still running ...
2022/05/03 10:19:40 Failed to execute job: job 2022-05-03_03_14_39-5735440478104037852 failed
panic: Failed to execute job: job 2022-05-03_03_14_39-5735440478104037852 failed
goroutine 1 [running]:
github.com/apache/beam/sdks/v2/go/pkg/beam/log.Fatalf(0x122e048, 0xc0000480c0, 0x110b251, 0x19, 0xc00033fe78, 0x1, 0x1)
<https://ci-beam.apache.org/job/beam_LoadTests_Go_GBK_Dataflow_Batch/ws/src/sdks/go/pkg/beam/log/log.go>:153 +0xec
main.main()
<https://ci-beam.apache.org/job/beam_LoadTests_Go_GBK_Dataflow_Batch/ws/src/sdks/go/test/load/group_by_key/group_by_key.go>:82 +0x418
> Task :sdks:go:test:load:run FAILED
FAILURE: Build failed with an exception.
* Where:
Build file '<https://ci-beam.apache.org/job/beam_LoadTests_Go_GBK_Dataflow_Batch/ws/src/sdks/go/test/load/build.gradle'> line: 31
* What went wrong:
Execution failed for task ':sdks:go:test:load:run'.
> Process 'command 'sh'' finished with non-zero exit value 2
* Try:
> Run with --stacktrace option to get the stack trace.
> Run with --info or --debug option to get more log output.
> Run with --scan to get full insights.
* Get more help at https://help.gradle.org
BUILD FAILED in 5m 19s
12 actionable tasks: 6 executed, 4 from cache, 2 up-to-date
Publishing build scan...
https://gradle.com/s/5wmhztp64b2ta
Build step 'Invoke Gradle script' changed build result to FAILURE
Build step 'Invoke Gradle script' marked build as failure
---------------------------------------------------------------------
To unsubscribe, e-mail: builds-unsubscribe@beam.apache.org
For additional commands, e-mail: builds-help@beam.apache.org
Build failed in Jenkins: beam_LoadTests_Go_GBK_Dataflow_Batch #498
Posted by Apache Jenkins Server <je...@builds.apache.org>.
See <https://ci-beam.apache.org/job/beam_LoadTests_Go_GBK_Dataflow_Batch/498/display/redirect?page=changes>
Changes:
[noreply] [BEAM-11105] Add manual watermark estimation (#17475)
------------------------------------------
[...truncated 17.57 KB...]
urn: "beam:env:docker:v1"
payload: "\n\035apache/beam_go_sdk:2.39.0.dev"
capabilities: "beam:protocol:progress_reporting:v0"
capabilities: "beam:protocol:multi_core_bundle_processing:v1"
capabilities: "beam:version:sdk_base:go"
capabilities: "beam:coder:bytes:v1"
capabilities: "beam:coder:bool:v1"
capabilities: "beam:coder:varint:v1"
capabilities: "beam:coder:double:v1"
capabilities: "beam:coder:string_utf8:v1"
capabilities: "beam:coder:length_prefix:v1"
capabilities: "beam:coder:kv:v1"
capabilities: "beam:coder:iterable:v1"
capabilities: "beam:coder:state_backed_iterable:v1"
capabilities: "beam:coder:windowed_value:v1"
capabilities: "beam:coder:global_window:v1"
capabilities: "beam:coder:interval_window:v1"
capabilities: "beam:coder:row:v1"
capabilities: "beam:coder:nullable:v1"
dependencies: <
type_urn: "beam:artifact:type:url:v1"
type_payload: "\nJgs://temp-storage-for-perf-tests/loadtests/go-1-1651486471958308263/****\022@8e1b4e734558eb3232ce336c1248294e83431eaa80a62b1107910de9ac24cdb2"
role_urn: "beam:artifact:role:go_****_binary:v1"
>
>
>
>
root_transform_ids: "s1"
root_transform_ids: "e4"
root_transform_ids: "e5"
root_transform_ids: "e6"
root_transform_ids: "e7"
requirements: "beam:requirement:pardo:splittable_dofn:v1"
2022/05/02 10:14:32 Staged model pipeline: gs://temp-storage-for-perf-tests/loadtests/go-1-1651486471958308263/model
2022/05/02 10:14:32 {
"environment": {
"experiments": [
"use_unified_****",
"use_portable_job_submission",
"beam_fn_api"
],
"sdkPipelineOptions": {
"display_data": [
{
"key": "name",
"namespace": "options",
"type": "STRING",
"value": "load-tests-go-dataflow-batch-gbk-1-0428110920"
},
{
"key": "experiments",
"namespace": "options",
"type": "STRING",
"value": "use_unified_****,use_portable_job_submission"
},
{
"key": "project",
"namespace": "options",
"type": "STRING",
"value": "apache-beam-testing"
},
{
"key": "region",
"namespace": "options",
"type": "STRING",
"value": "us-central1"
},
{
"key": "container_images",
"namespace": "options",
"type": "STRING",
"value": "apache/beam_go_sdk:2.39.0.dev"
},
{
"key": "temp_location",
"namespace": "options",
"type": "STRING",
"value": "gs://temp-storage-for-perf-tests/loadtests"
},
{
"key": "hooks",
"namespace": "go_options",
"type": "STRING",
"value": "{\"default_remote_logging\":null}"
},
{
"key": "hookOrder",
"namespace": "go_options",
"type": "STRING",
"value": "[\"default_remote_logging\"]"
},
{
"key": "fanout",
"namespace": "go_options",
"type": "STRING",
"value": "1"
},
{
"key": "input_options",
"namespace": "go_options",
"type": "STRING",
"value": "{\"num_records\": 200000000,\"key_size\": 1,\"value_size\": 9}"
},
{
"key": "influx_hostname",
"namespace": "go_options",
"type": "STRING",
"value": "http://10.128.0.96:8086"
},
{
"key": "influx_db_name",
"namespace": "go_options",
"type": "STRING",
"value": "beam_test_metrics"
},
{
"key": "influx_namespace",
"namespace": "go_options",
"type": "STRING",
"value": "dataflow"
},
{
"key": "iterations",
"namespace": "go_options",
"type": "STRING",
"value": "1"
},
{
"key": "influx_measurement",
"namespace": "go_options",
"type": "STRING",
"value": "go_batch_gbk_1"
},
{
"key": "****_binary",
"namespace": "go_options",
"type": "STRING",
"value": "linux_amd64/group_by_key"
}
],
"options": {
"experiments": [
"use_unified_****",
"use_portable_job_submission",
"beam_fn_api"
],
"pipelineUrl": "gs://temp-storage-for-perf-tests/loadtests/go-1-1651486471958308263/model",
"region": "us-central1",
"tempLocation": "gs://temp-storage-for-perf-tests/loadtests"
},
"beam:option:go_options:v1": {
"options": {
"fanout": "1",
"hookOrder": "[\"default_remote_logging\"]",
"hooks": "{\"default_remote_logging\":null}",
"influx_db_name": "beam_test_metrics",
"influx_hostname": "http://10.128.0.96:8086",
"influx_measurement": "go_batch_gbk_1",
"influx_namespace": "dataflow",
"input_options": "{\"num_records\": 200000000,\"key_size\": 1,\"value_size\": 9}",
"iterations": "1",
"****_binary": "linux_amd64/group_by_key"
}
}
},
"tempStoragePrefix": "gs://temp-storage-for-perf-tests/loadtests",
"userAgent": {
"name": "Apache Beam SDK for Go",
"version": "2.39.0.dev"
},
"version": {
"job_type": "FNAPI_BATCH",
"major": "6"
},
"****Pools": [
{
"autoscalingSettings": {
"algorithm": "AUTOSCALING_ALGORITHM_NONE"
},
"ipConfiguration": "WORKER_IP_UNSPECIFIED",
"kind": "harness",
"numWorkers": 5,
"packages": [
{
"location": "gs://temp-storage-for-perf-tests/loadtests/go-1-1651486471958308263/****",
"name": "****"
}
],
"sdkHarnessContainerImages": [
{
"containerImage": "apache/beam_go_sdk:2.39.0.dev"
}
],
"****HarnessContainerImage": "apache/beam_go_sdk:2.39.0.dev"
}
]
},
"name": "load-tests-go-dataflow-batch-gbk-1-0428110920",
"projectId": "apache-beam-testing",
"type": "JOB_TYPE_BATCH"
}
2022/05/02 10:14:33 Submitted job: 2022-05-02_03_14_32-6512839335185940481
2022/05/02 10:14:33 Console: https://console.cloud.google.com/dataflow/jobs/us-central1/2022-05-02_03_14_32-6512839335185940481?project=apache-beam-testing
2022/05/02 10:14:33 Logs: https://console.cloud.google.com/logs/viewer?project=apache-beam-testing&resource=dataflow_step%2Fjob_id%2F2022-05-02_03_14_32-6512839335185940481
2022/05/02 10:14:33 Job state: JOB_STATE_PENDING ...
2022/05/02 10:15:03 Job still running ...
2022/05/02 10:15:33 Job still running ...
2022/05/02 10:16:03 Job still running ...
2022/05/02 10:16:33 Job still running ...
2022/05/02 10:17:03 Job still running ...
2022/05/02 10:17:33 Job still running ...
2022/05/02 10:18:03 Job still running ...
2022/05/02 10:18:34 Job still running ...
2022/05/02 10:19:04 Job still running ...
2022/05/02 10:19:34 Failed to execute job: job 2022-05-02_03_14_32-6512839335185940481 failed
panic: Failed to execute job: job 2022-05-02_03_14_32-6512839335185940481 failed
goroutine 1 [running]:
github.com/apache/beam/sdks/v2/go/pkg/beam/log.Fatalf(0x120a8a8, 0xc0000480c0, 0x10e7eee, 0x19, 0xc0003ffe78, 0x1, 0x1)
<https://ci-beam.apache.org/job/beam_LoadTests_Go_GBK_Dataflow_Batch/ws/src/sdks/go/pkg/beam/log/log.go>:153 +0xec
main.main()
<https://ci-beam.apache.org/job/beam_LoadTests_Go_GBK_Dataflow_Batch/ws/src/sdks/go/test/load/group_by_key/group_by_key.go>:82 +0x418
> Task :sdks:go:test:load:run FAILED
FAILURE: Build failed with an exception.
* Where:
Build file '<https://ci-beam.apache.org/job/beam_LoadTests_Go_GBK_Dataflow_Batch/ws/src/sdks/go/test/load/build.gradle'> line: 31
* What went wrong:
Execution failed for task ':sdks:go:test:load:run'.
> Process 'command 'sh'' finished with non-zero exit value 2
* Try:
> Run with --stacktrace option to get the stack trace.
> Run with --info or --debug option to get more log output.
> Run with --scan to get full insights.
* Get more help at https://help.gradle.org
BUILD FAILED in 5m 12s
12 actionable tasks: 6 executed, 4 from cache, 2 up-to-date
Publishing build scan...
https://gradle.com/s/a27yok7kxo44c
Build step 'Invoke Gradle script' changed build result to FAILURE
Build step 'Invoke Gradle script' marked build as failure
---------------------------------------------------------------------
To unsubscribe, e-mail: builds-unsubscribe@beam.apache.org
For additional commands, e-mail: builds-help@beam.apache.org
Build failed in Jenkins: beam_LoadTests_Go_GBK_Dataflow_Batch #497
Posted by Apache Jenkins Server <je...@builds.apache.org>.
See <https://ci-beam.apache.org/job/beam_LoadTests_Go_GBK_Dataflow_Batch/497/display/redirect?page=changes>
Changes:
[noreply] Revert "Improvement to Seed job configuration to launch against PRs
[ilion.beyst] Minor: fix typo
[noreply] Merge pull request #17422 from [BEAM-14344]: remove tracing from
------------------------------------------
[...truncated 17.65 KB...]
urn: "beam:env:docker:v1"
payload: "\n\035apache/beam_go_sdk:2.39.0.dev"
capabilities: "beam:protocol:progress_reporting:v0"
capabilities: "beam:protocol:multi_core_bundle_processing:v1"
capabilities: "beam:version:sdk_base:go"
capabilities: "beam:coder:bytes:v1"
capabilities: "beam:coder:bool:v1"
capabilities: "beam:coder:varint:v1"
capabilities: "beam:coder:double:v1"
capabilities: "beam:coder:string_utf8:v1"
capabilities: "beam:coder:length_prefix:v1"
capabilities: "beam:coder:kv:v1"
capabilities: "beam:coder:iterable:v1"
capabilities: "beam:coder:state_backed_iterable:v1"
capabilities: "beam:coder:windowed_value:v1"
capabilities: "beam:coder:global_window:v1"
capabilities: "beam:coder:interval_window:v1"
capabilities: "beam:coder:row:v1"
capabilities: "beam:coder:nullable:v1"
dependencies: <
type_urn: "beam:artifact:type:url:v1"
type_payload: "\nJgs://temp-storage-for-perf-tests/loadtests/go-1-1651400069749517579/****\022@228c544e4b7d6d1e7d2921751bd6bdb52fb7d3c87d23de1f7e3d0486ac384666"
role_urn: "beam:artifact:role:go_****_binary:v1"
>
>
>
>
root_transform_ids: "s1"
root_transform_ids: "e4"
root_transform_ids: "e5"
root_transform_ids: "e6"
root_transform_ids: "e7"
requirements: "beam:requirement:pardo:splittable_dofn:v1"
2022/05/01 10:14:30 Staged model pipeline: gs://temp-storage-for-perf-tests/loadtests/go-1-1651400069749517579/model
2022/05/01 10:14:30 {
"environment": {
"experiments": [
"use_unified_****",
"use_portable_job_submission",
"beam_fn_api"
],
"sdkPipelineOptions": {
"display_data": [
{
"key": "name",
"namespace": "options",
"type": "STRING",
"value": "load-tests-go-dataflow-batch-gbk-1-0428110920"
},
{
"key": "experiments",
"namespace": "options",
"type": "STRING",
"value": "use_unified_****,use_portable_job_submission"
},
{
"key": "project",
"namespace": "options",
"type": "STRING",
"value": "apache-beam-testing"
},
{
"key": "region",
"namespace": "options",
"type": "STRING",
"value": "us-central1"
},
{
"key": "container_images",
"namespace": "options",
"type": "STRING",
"value": "apache/beam_go_sdk:2.39.0.dev"
},
{
"key": "temp_location",
"namespace": "options",
"type": "STRING",
"value": "gs://temp-storage-for-perf-tests/loadtests"
},
{
"key": "influx_measurement",
"namespace": "go_options",
"type": "STRING",
"value": "go_batch_gbk_1"
},
{
"key": "hooks",
"namespace": "go_options",
"type": "STRING",
"value": "{\"default_remote_logging\":null}"
},
{
"key": "input_options",
"namespace": "go_options",
"type": "STRING",
"value": "{\"num_records\": 200000000,\"key_size\": 1,\"value_size\": 9}"
},
{
"key": "iterations",
"namespace": "go_options",
"type": "STRING",
"value": "1"
},
{
"key": "****_binary",
"namespace": "go_options",
"type": "STRING",
"value": "linux_amd64/group_by_key"
},
{
"key": "hookOrder",
"namespace": "go_options",
"type": "STRING",
"value": "[\"default_remote_logging\"]"
},
{
"key": "fanout",
"namespace": "go_options",
"type": "STRING",
"value": "1"
},
{
"key": "influx_db_name",
"namespace": "go_options",
"type": "STRING",
"value": "beam_test_metrics"
},
{
"key": "influx_hostname",
"namespace": "go_options",
"type": "STRING",
"value": "http://10.128.0.96:8086"
},
{
"key": "influx_namespace",
"namespace": "go_options",
"type": "STRING",
"value": "dataflow"
}
],
"options": {
"experiments": [
"use_unified_****",
"use_portable_job_submission",
"beam_fn_api"
],
"pipelineUrl": "gs://temp-storage-for-perf-tests/loadtests/go-1-1651400069749517579/model",
"region": "us-central1",
"tempLocation": "gs://temp-storage-for-perf-tests/loadtests"
},
"beam:option:go_options:v1": {
"options": {
"fanout": "1",
"hookOrder": "[\"default_remote_logging\"]",
"hooks": "{\"default_remote_logging\":null}",
"influx_db_name": "beam_test_metrics",
"influx_hostname": "http://10.128.0.96:8086",
"influx_measurement": "go_batch_gbk_1",
"influx_namespace": "dataflow",
"input_options": "{\"num_records\": 200000000,\"key_size\": 1,\"value_size\": 9}",
"iterations": "1",
"****_binary": "linux_amd64/group_by_key"
}
}
},
"tempStoragePrefix": "gs://temp-storage-for-perf-tests/loadtests",
"userAgent": {
"name": "Apache Beam SDK for Go",
"version": "2.39.0.dev"
},
"version": {
"job_type": "FNAPI_BATCH",
"major": "6"
},
"****Pools": [
{
"autoscalingSettings": {
"algorithm": "AUTOSCALING_ALGORITHM_NONE"
},
"ipConfiguration": "WORKER_IP_UNSPECIFIED",
"kind": "harness",
"numWorkers": 5,
"packages": [
{
"location": "gs://temp-storage-for-perf-tests/loadtests/go-1-1651400069749517579/****",
"name": "****"
}
],
"sdkHarnessContainerImages": [
{
"containerImage": "apache/beam_go_sdk:2.39.0.dev"
}
],
"****HarnessContainerImage": "apache/beam_go_sdk:2.39.0.dev"
}
]
},
"name": "load-tests-go-dataflow-batch-gbk-1-0428110920",
"projectId": "apache-beam-testing",
"type": "JOB_TYPE_BATCH"
}
2022/05/01 10:14:30 Submitted job: 2022-05-01_03_14_30-15038427463710332215
2022/05/01 10:14:30 Console: https://console.cloud.google.com/dataflow/jobs/us-central1/2022-05-01_03_14_30-15038427463710332215?project=apache-beam-testing
2022/05/01 10:14:30 Logs: https://console.cloud.google.com/logs/viewer?project=apache-beam-testing&resource=dataflow_step%2Fjob_id%2F2022-05-01_03_14_30-15038427463710332215
2022/05/01 10:14:30 Job state: JOB_STATE_PENDING ...
2022/05/01 10:15:01 Job still running ...
2022/05/01 10:15:31 Job still running ...
2022/05/01 10:16:01 Job still running ...
2022/05/01 10:16:31 Job still running ...
2022/05/01 10:17:01 Job still running ...
2022/05/01 10:17:31 Job still running ...
2022/05/01 10:18:01 Job still running ...
2022/05/01 10:18:31 Job still running ...
2022/05/01 10:19:01 Job still running ...
2022/05/01 10:19:31 Failed to execute job: job 2022-05-01_03_14_30-15038427463710332215 failed
panic: Failed to execute job: job 2022-05-01_03_14_30-15038427463710332215 failed
goroutine 1 [running]:
github.com/apache/beam/sdks/v2/go/pkg/beam/log.Fatalf(0x1209588, 0xc000120000, 0x10e6e1c, 0x19, 0xc0005c5e78, 0x1, 0x1)
<https://ci-beam.apache.org/job/beam_LoadTests_Go_GBK_Dataflow_Batch/ws/src/sdks/go/pkg/beam/log/log.go>:153 +0xec
main.main()
<https://ci-beam.apache.org/job/beam_LoadTests_Go_GBK_Dataflow_Batch/ws/src/sdks/go/test/load/group_by_key/group_by_key.go>:82 +0x418
> Task :sdks:go:test:load:run FAILED
FAILURE: Build failed with an exception.
* Where:
Build file '<https://ci-beam.apache.org/job/beam_LoadTests_Go_GBK_Dataflow_Batch/ws/src/sdks/go/test/load/build.gradle'> line: 31
* What went wrong:
Execution failed for task ':sdks:go:test:load:run'.
> Process 'command 'sh'' finished with non-zero exit value 2
* Try:
> Run with --stacktrace option to get the stack trace.
> Run with --info or --debug option to get more log output.
> Run with --scan to get full insights.
* Get more help at https://help.gradle.org
BUILD FAILED in 5m 8s
12 actionable tasks: 6 executed, 4 from cache, 2 up-to-date
Publishing build scan...
https://gradle.com/s/o44wcpmqsnroy
Build step 'Invoke Gradle script' changed build result to FAILURE
Build step 'Invoke Gradle script' marked build as failure
---------------------------------------------------------------------
To unsubscribe, e-mail: builds-unsubscribe@beam.apache.org
For additional commands, e-mail: builds-help@beam.apache.org
Build failed in Jenkins: beam_LoadTests_Go_GBK_Dataflow_Batch #496
Posted by Apache Jenkins Server <je...@builds.apache.org>.
See <https://ci-beam.apache.org/job/beam_LoadTests_Go_GBK_Dataflow_Batch/496/display/redirect?page=changes>
Changes:
[Robert Bradshaw] Add element weighting parameter to BatchElements.
[Robert Bradshaw] Clearer test.
[noreply] Revert "Merge pull request #17260 from [BEAM-13229] [Website] bug side
[noreply] [BEAM-14001] Add missing test cases to existing suites in exec package
[noreply] [BEAM-14243] Add staticcheck to Github Actions Precommits (#17479)
[noreply] [BEAM-14368][BEAM-13984]Change model loading from constructor to
[noreply] [BEAM-13983] changed file name from sklearn_loader to sklearn_inference
[noreply] Add SQL in Notebooks blog post (#17481)
[noreply] Merge pull request #17404: [BEAM-13990] support date and timestamp
------------------------------------------
[...truncated 17.61 KB...]
>
environments: <
key: "go"
value: <
urn: "beam:env:docker:v1"
payload: "\n\035apache/beam_go_sdk:2.39.0.dev"
capabilities: "beam:protocol:progress_reporting:v0"
capabilities: "beam:protocol:multi_core_bundle_processing:v1"
capabilities: "beam:version:sdk_base:go"
capabilities: "beam:coder:bytes:v1"
capabilities: "beam:coder:bool:v1"
capabilities: "beam:coder:varint:v1"
capabilities: "beam:coder:double:v1"
capabilities: "beam:coder:string_utf8:v1"
capabilities: "beam:coder:length_prefix:v1"
capabilities: "beam:coder:kv:v1"
capabilities: "beam:coder:iterable:v1"
capabilities: "beam:coder:state_backed_iterable:v1"
capabilities: "beam:coder:windowed_value:v1"
capabilities: "beam:coder:global_window:v1"
capabilities: "beam:coder:interval_window:v1"
capabilities: "beam:coder:row:v1"
capabilities: "beam:coder:nullable:v1"
dependencies: <
type_urn: "beam:artifact:type:url:v1"
type_payload: "\nJgs://temp-storage-for-perf-tests/loadtests/go-1-1651313682584612348/****\022@228c544e4b7d6d1e7d2921751bd6bdb52fb7d3c87d23de1f7e3d0486ac384666"
role_urn: "beam:artifact:role:go_****_binary:v1"
>
>
>
>
root_transform_ids: "s1"
root_transform_ids: "e4"
root_transform_ids: "e5"
root_transform_ids: "e6"
root_transform_ids: "e7"
requirements: "beam:requirement:pardo:splittable_dofn:v1"
2022/04/30 10:14:43 Staged model pipeline: gs://temp-storage-for-perf-tests/loadtests/go-1-1651313682584612348/model
2022/04/30 10:14:43 {
"environment": {
"experiments": [
"use_unified_****",
"use_portable_job_submission",
"beam_fn_api"
],
"sdkPipelineOptions": {
"display_data": [
{
"key": "name",
"namespace": "options",
"type": "STRING",
"value": "load-tests-go-dataflow-batch-gbk-1-0428110920"
},
{
"key": "experiments",
"namespace": "options",
"type": "STRING",
"value": "use_unified_****,use_portable_job_submission"
},
{
"key": "project",
"namespace": "options",
"type": "STRING",
"value": "apache-beam-testing"
},
{
"key": "region",
"namespace": "options",
"type": "STRING",
"value": "us-central1"
},
{
"key": "container_images",
"namespace": "options",
"type": "STRING",
"value": "apache/beam_go_sdk:2.39.0.dev"
},
{
"key": "temp_location",
"namespace": "options",
"type": "STRING",
"value": "gs://temp-storage-for-perf-tests/loadtests"
},
{
"key": "hooks",
"namespace": "go_options",
"type": "STRING",
"value": "{\"default_remote_logging\":null}"
},
{
"key": "influx_hostname",
"namespace": "go_options",
"type": "STRING",
"value": "http://10.128.0.96:8086"
},
{
"key": "influx_namespace",
"namespace": "go_options",
"type": "STRING",
"value": "dataflow"
},
{
"key": "hookOrder",
"namespace": "go_options",
"type": "STRING",
"value": "[\"default_remote_logging\"]"
},
{
"key": "influx_db_name",
"namespace": "go_options",
"type": "STRING",
"value": "beam_test_metrics"
},
{
"key": "iterations",
"namespace": "go_options",
"type": "STRING",
"value": "1"
},
{
"key": "input_options",
"namespace": "go_options",
"type": "STRING",
"value": "{\"num_records\": 200000000,\"key_size\": 1,\"value_size\": 9}"
},
{
"key": "****_binary",
"namespace": "go_options",
"type": "STRING",
"value": "linux_amd64/group_by_key"
},
{
"key": "fanout",
"namespace": "go_options",
"type": "STRING",
"value": "1"
},
{
"key": "influx_measurement",
"namespace": "go_options",
"type": "STRING",
"value": "go_batch_gbk_1"
}
],
"options": {
"experiments": [
"use_unified_****",
"use_portable_job_submission",
"beam_fn_api"
],
"pipelineUrl": "gs://temp-storage-for-perf-tests/loadtests/go-1-1651313682584612348/model",
"region": "us-central1",
"tempLocation": "gs://temp-storage-for-perf-tests/loadtests"
},
"beam:option:go_options:v1": {
"options": {
"fanout": "1",
"hookOrder": "[\"default_remote_logging\"]",
"hooks": "{\"default_remote_logging\":null}",
"influx_db_name": "beam_test_metrics",
"influx_hostname": "http://10.128.0.96:8086",
"influx_measurement": "go_batch_gbk_1",
"influx_namespace": "dataflow",
"input_options": "{\"num_records\": 200000000,\"key_size\": 1,\"value_size\": 9}",
"iterations": "1",
"****_binary": "linux_amd64/group_by_key"
}
}
},
"tempStoragePrefix": "gs://temp-storage-for-perf-tests/loadtests",
"userAgent": {
"name": "Apache Beam SDK for Go",
"version": "2.39.0.dev"
},
"version": {
"job_type": "FNAPI_BATCH",
"major": "6"
},
"****Pools": [
{
"autoscalingSettings": {
"algorithm": "AUTOSCALING_ALGORITHM_NONE"
},
"ipConfiguration": "WORKER_IP_UNSPECIFIED",
"kind": "harness",
"numWorkers": 5,
"packages": [
{
"location": "gs://temp-storage-for-perf-tests/loadtests/go-1-1651313682584612348/****",
"name": "****"
}
],
"sdkHarnessContainerImages": [
{
"containerImage": "apache/beam_go_sdk:2.39.0.dev"
}
],
"****HarnessContainerImage": "apache/beam_go_sdk:2.39.0.dev"
}
]
},
"name": "load-tests-go-dataflow-batch-gbk-1-0428110920",
"projectId": "apache-beam-testing",
"type": "JOB_TYPE_BATCH"
}
2022/04/30 10:14:43 Submitted job: 2022-04-30_03_14_43-865874495203774760
2022/04/30 10:14:43 Console: https://console.cloud.google.com/dataflow/jobs/us-central1/2022-04-30_03_14_43-865874495203774760?project=apache-beam-testing
2022/04/30 10:14:43 Logs: https://console.cloud.google.com/logs/viewer?project=apache-beam-testing&resource=dataflow_step%2Fjob_id%2F2022-04-30_03_14_43-865874495203774760
2022/04/30 10:14:43 Job state: JOB_STATE_PENDING ...
2022/04/30 10:15:13 Job still running ...
2022/04/30 10:15:44 Job still running ...
2022/04/30 10:16:14 Job still running ...
2022/04/30 10:16:44 Job still running ...
2022/04/30 10:17:14 Job still running ...
2022/04/30 10:17:44 Failed to execute job: job 2022-04-30_03_14_43-865874495203774760 failed
panic: Failed to execute job: job 2022-04-30_03_14_43-865874495203774760 failed
goroutine 1 [running]:
github.com/apache/beam/sdks/v2/go/pkg/beam/log.Fatalf(0x1209588, 0xc0000480c0, 0x10e6e1c, 0x19, 0xc00056be78, 0x1, 0x1)
<https://ci-beam.apache.org/job/beam_LoadTests_Go_GBK_Dataflow_Batch/ws/src/sdks/go/pkg/beam/log/log.go>:153 +0xec
main.main()
<https://ci-beam.apache.org/job/beam_LoadTests_Go_GBK_Dataflow_Batch/ws/src/sdks/go/test/load/group_by_key/group_by_key.go>:82 +0x418
> Task :sdks:go:test:load:run FAILED
FAILURE: Build failed with an exception.
* Where:
Build file '<https://ci-beam.apache.org/job/beam_LoadTests_Go_GBK_Dataflow_Batch/ws/src/sdks/go/test/load/build.gradle'> line: 31
* What went wrong:
Execution failed for task ':sdks:go:test:load:run'.
> Process 'command 'sh'' finished with non-zero exit value 2
* Try:
> Run with --stacktrace option to get the stack trace.
> Run with --info or --debug option to get more log output.
> Run with --scan to get full insights.
* Get more help at https://help.gradle.org
BUILD FAILED in 3m 20s
12 actionable tasks: 6 executed, 4 from cache, 2 up-to-date
Publishing build scan...
https://gradle.com/s/k742amgc6u23k
Build step 'Invoke Gradle script' changed build result to FAILURE
Build step 'Invoke Gradle script' marked build as failure
---------------------------------------------------------------------
To unsubscribe, e-mail: builds-unsubscribe@beam.apache.org
For additional commands, e-mail: builds-help@beam.apache.org
Build failed in Jenkins: beam_LoadTests_Go_GBK_Dataflow_Batch #495
Posted by Apache Jenkins Server <je...@builds.apache.org>.
See <https://ci-beam.apache.org/job/beam_LoadTests_Go_GBK_Dataflow_Batch/495/display/redirect?page=changes>
Changes:
[ihr] Update Java katas to Beam 2.38
[noreply] [BEAM-14369] Fix "target/options: no such file or directory" error while
[noreply] [BEAM-14351] Inherit from Coder. (#17437)
[noreply] [BEAM-14297] Enable nullable key and value arrays for xlang kafka io
[noreply] Merge pull request #17444 from [BEAM-14310] [Website] bug home
[noreply] Merge pull request #17388 from [BEAM-14311] [Website] Home Page
[noreply] [BEAM-14376] Typo in method description doc
[noreply] Add default classpath when not present (#17491)
[thiagotnunes] fix: update javadocs for ChangeStreamMetrics
[noreply] Merge pull request #17443 from [BEAM-12164]: use the end timestamp for
[noreply] Merge pull request #17260 from [BEAM-13229] [Website] bug side nav
[noreply] [BEAM-14351] Fix the template and move the announcement to the next
------------------------------------------
[...truncated 17.65 KB...]
>
environments: <
key: "go"
value: <
urn: "beam:env:docker:v1"
payload: "\n\035apache/beam_go_sdk:2.39.0.dev"
capabilities: "beam:protocol:progress_reporting:v0"
capabilities: "beam:protocol:multi_core_bundle_processing:v1"
capabilities: "beam:version:sdk_base:go"
capabilities: "beam:coder:bytes:v1"
capabilities: "beam:coder:bool:v1"
capabilities: "beam:coder:varint:v1"
capabilities: "beam:coder:double:v1"
capabilities: "beam:coder:string_utf8:v1"
capabilities: "beam:coder:length_prefix:v1"
capabilities: "beam:coder:kv:v1"
capabilities: "beam:coder:iterable:v1"
capabilities: "beam:coder:state_backed_iterable:v1"
capabilities: "beam:coder:windowed_value:v1"
capabilities: "beam:coder:global_window:v1"
capabilities: "beam:coder:interval_window:v1"
capabilities: "beam:coder:row:v1"
capabilities: "beam:coder:nullable:v1"
dependencies: <
type_urn: "beam:artifact:type:url:v1"
type_payload: "\nJgs://temp-storage-for-perf-tests/loadtests/go-1-1651227276943319292/****\022@228c544e4b7d6d1e7d2921751bd6bdb52fb7d3c87d23de1f7e3d0486ac384666"
role_urn: "beam:artifact:role:go_****_binary:v1"
>
>
>
>
root_transform_ids: "s1"
root_transform_ids: "e4"
root_transform_ids: "e5"
root_transform_ids: "e6"
root_transform_ids: "e7"
requirements: "beam:requirement:pardo:splittable_dofn:v1"
2022/04/29 10:14:37 Staged model pipeline: gs://temp-storage-for-perf-tests/loadtests/go-1-1651227276943319292/model
2022/04/29 10:14:37 {
"environment": {
"experiments": [
"use_unified_****",
"use_portable_job_submission",
"beam_fn_api"
],
"sdkPipelineOptions": {
"display_data": [
{
"key": "name",
"namespace": "options",
"type": "STRING",
"value": "load-tests-go-dataflow-batch-gbk-1-0428110920"
},
{
"key": "experiments",
"namespace": "options",
"type": "STRING",
"value": "use_unified_****,use_portable_job_submission"
},
{
"key": "project",
"namespace": "options",
"type": "STRING",
"value": "apache-beam-testing"
},
{
"key": "region",
"namespace": "options",
"type": "STRING",
"value": "us-central1"
},
{
"key": "container_images",
"namespace": "options",
"type": "STRING",
"value": "apache/beam_go_sdk:2.39.0.dev"
},
{
"key": "temp_location",
"namespace": "options",
"type": "STRING",
"value": "gs://temp-storage-for-perf-tests/loadtests"
},
{
"key": "influx_measurement",
"namespace": "go_options",
"type": "STRING",
"value": "go_batch_gbk_1"
},
{
"key": "input_options",
"namespace": "go_options",
"type": "STRING",
"value": "{\"num_records\": 200000000,\"key_size\": 1,\"value_size\": 9}"
},
{
"key": "influx_hostname",
"namespace": "go_options",
"type": "STRING",
"value": "http://10.128.0.96:8086"
},
{
"key": "fanout",
"namespace": "go_options",
"type": "STRING",
"value": "1"
},
{
"key": "****_binary",
"namespace": "go_options",
"type": "STRING",
"value": "linux_amd64/group_by_key"
},
{
"key": "hooks",
"namespace": "go_options",
"type": "STRING",
"value": "{\"default_remote_logging\":null}"
},
{
"key": "iterations",
"namespace": "go_options",
"type": "STRING",
"value": "1"
},
{
"key": "hookOrder",
"namespace": "go_options",
"type": "STRING",
"value": "[\"default_remote_logging\"]"
},
{
"key": "influx_db_name",
"namespace": "go_options",
"type": "STRING",
"value": "beam_test_metrics"
},
{
"key": "influx_namespace",
"namespace": "go_options",
"type": "STRING",
"value": "dataflow"
}
],
"options": {
"experiments": [
"use_unified_****",
"use_portable_job_submission",
"beam_fn_api"
],
"pipelineUrl": "gs://temp-storage-for-perf-tests/loadtests/go-1-1651227276943319292/model",
"region": "us-central1",
"tempLocation": "gs://temp-storage-for-perf-tests/loadtests"
},
"beam:option:go_options:v1": {
"options": {
"fanout": "1",
"hookOrder": "[\"default_remote_logging\"]",
"hooks": "{\"default_remote_logging\":null}",
"influx_db_name": "beam_test_metrics",
"influx_hostname": "http://10.128.0.96:8086",
"influx_measurement": "go_batch_gbk_1",
"influx_namespace": "dataflow",
"input_options": "{\"num_records\": 200000000,\"key_size\": 1,\"value_size\": 9}",
"iterations": "1",
"****_binary": "linux_amd64/group_by_key"
}
}
},
"tempStoragePrefix": "gs://temp-storage-for-perf-tests/loadtests",
"userAgent": {
"name": "Apache Beam SDK for Go",
"version": "2.39.0.dev"
},
"version": {
"job_type": "FNAPI_BATCH",
"major": "6"
},
"****Pools": [
{
"autoscalingSettings": {
"algorithm": "AUTOSCALING_ALGORITHM_NONE"
},
"ipConfiguration": "WORKER_IP_UNSPECIFIED",
"kind": "harness",
"numWorkers": 5,
"packages": [
{
"location": "gs://temp-storage-for-perf-tests/loadtests/go-1-1651227276943319292/****",
"name": "****"
}
],
"sdkHarnessContainerImages": [
{
"containerImage": "apache/beam_go_sdk:2.39.0.dev"
}
],
"****HarnessContainerImage": "apache/beam_go_sdk:2.39.0.dev"
}
]
},
"name": "load-tests-go-dataflow-batch-gbk-1-0428110920",
"projectId": "apache-beam-testing",
"type": "JOB_TYPE_BATCH"
}
2022/04/29 10:14:38 Submitted job: 2022-04-29_03_14_37-18171854532606500240
2022/04/29 10:14:38 Console: https://console.cloud.google.com/dataflow/jobs/us-central1/2022-04-29_03_14_37-18171854532606500240?project=apache-beam-testing
2022/04/29 10:14:38 Logs: https://console.cloud.google.com/logs/viewer?project=apache-beam-testing&resource=dataflow_step%2Fjob_id%2F2022-04-29_03_14_37-18171854532606500240
2022/04/29 10:14:38 Job state: JOB_STATE_PENDING ...
2022/04/29 10:15:08 Job still running ...
2022/04/29 10:15:38 Job still running ...
2022/04/29 10:16:08 Job still running ...
2022/04/29 10:16:38 Job still running ...
2022/04/29 10:17:08 Job still running ...
2022/04/29 10:17:38 Failed to execute job: job 2022-04-29_03_14_37-18171854532606500240 failed
panic: Failed to execute job: job 2022-04-29_03_14_37-18171854532606500240 failed
goroutine 1 [running]:
github.com/apache/beam/sdks/v2/go/pkg/beam/log.Fatalf(0x1209588, 0xc000120000, 0x10e6e1c, 0x19, 0xc00044be78, 0x1, 0x1)
<https://ci-beam.apache.org/job/beam_LoadTests_Go_GBK_Dataflow_Batch/ws/src/sdks/go/pkg/beam/log/log.go>:153 +0xec
main.main()
<https://ci-beam.apache.org/job/beam_LoadTests_Go_GBK_Dataflow_Batch/ws/src/sdks/go/test/load/group_by_key/group_by_key.go>:82 +0x418
> Task :sdks:go:test:load:run FAILED
FAILURE: Build failed with an exception.
* Where:
Build file '<https://ci-beam.apache.org/job/beam_LoadTests_Go_GBK_Dataflow_Batch/ws/src/sdks/go/test/load/build.gradle'> line: 31
* What went wrong:
Execution failed for task ':sdks:go:test:load:run'.
> Process 'command 'sh'' finished with non-zero exit value 2
* Try:
> Run with --stacktrace option to get the stack trace.
> Run with --info or --debug option to get more log output.
> Run with --scan to get full insights.
* Get more help at https://help.gradle.org
BUILD FAILED in 3m 16s
12 actionable tasks: 6 executed, 4 from cache, 2 up-to-date
Publishing build scan...
https://gradle.com/s/dunbd4b3m4l72
Build step 'Invoke Gradle script' changed build result to FAILURE
Build step 'Invoke Gradle script' marked build as failure
---------------------------------------------------------------------
To unsubscribe, e-mail: builds-unsubscribe@beam.apache.org
For additional commands, e-mail: builds-help@beam.apache.org
Build failed in Jenkins: beam_LoadTests_Go_GBK_Dataflow_Batch #494
Posted by Apache Jenkins Server <je...@builds.apache.org>.
See <https://ci-beam.apache.org/job/beam_LoadTests_Go_GBK_Dataflow_Batch/494/display/redirect?page=changes>
Changes:
[nick.caballero] [BEAM-14363] Fixes WatermarkParameters builder for Kinesis
[noreply] [BEAM-11104] Add Checkpointing split to Go SDK (#17386)
[noreply] Merge pull request #17226 from [BEAM-14204] [Playground] Tests for
[noreply] [BEAM-13015, BEAM-14184] Address unbounded number of messages being
[noreply] Improvement to Seed job configuration to launch against PRs (#17468)
[noreply] [BEAM-13983] Small changes to sklearn runinference (#17459)
[chamikaramj] Renames ExternalPythonTransform to PythonExternalTransform
------------------------------------------
[...truncated 17.70 KB...]
urn: "beam:env:docker:v1"
payload: "\n\035apache/beam_go_sdk:2.39.0.dev"
capabilities: "beam:protocol:progress_reporting:v0"
capabilities: "beam:protocol:multi_core_bundle_processing:v1"
capabilities: "beam:version:sdk_base:go"
capabilities: "beam:coder:bytes:v1"
capabilities: "beam:coder:bool:v1"
capabilities: "beam:coder:varint:v1"
capabilities: "beam:coder:double:v1"
capabilities: "beam:coder:string_utf8:v1"
capabilities: "beam:coder:length_prefix:v1"
capabilities: "beam:coder:kv:v1"
capabilities: "beam:coder:iterable:v1"
capabilities: "beam:coder:state_backed_iterable:v1"
capabilities: "beam:coder:windowed_value:v1"
capabilities: "beam:coder:global_window:v1"
capabilities: "beam:coder:interval_window:v1"
capabilities: "beam:coder:row:v1"
capabilities: "beam:coder:nullable:v1"
dependencies: <
type_urn: "beam:artifact:type:url:v1"
type_payload: "\nJgs://temp-storage-for-perf-tests/loadtests/go-1-1651140879170173611/****\022@228c544e4b7d6d1e7d2921751bd6bdb52fb7d3c87d23de1f7e3d0486ac384666"
role_urn: "beam:artifact:role:go_****_binary:v1"
>
>
>
>
root_transform_ids: "s1"
root_transform_ids: "e4"
root_transform_ids: "e5"
root_transform_ids: "e6"
root_transform_ids: "e7"
requirements: "beam:requirement:pardo:splittable_dofn:v1"
2022/04/28 10:14:39 Staged model pipeline: gs://temp-storage-for-perf-tests/loadtests/go-1-1651140879170173611/model
2022/04/28 10:14:39 {
"environment": {
"experiments": [
"use_unified_****",
"use_portable_job_submission",
"beam_fn_api"
],
"sdkPipelineOptions": {
"display_data": [
{
"key": "name",
"namespace": "options",
"type": "STRING",
"value": "load-tests-go-dataflow-batch-gbk-1-0428000303"
},
{
"key": "experiments",
"namespace": "options",
"type": "STRING",
"value": "use_unified_****,use_portable_job_submission"
},
{
"key": "project",
"namespace": "options",
"type": "STRING",
"value": "apache-beam-testing"
},
{
"key": "region",
"namespace": "options",
"type": "STRING",
"value": "us-central1"
},
{
"key": "container_images",
"namespace": "options",
"type": "STRING",
"value": "apache/beam_go_sdk:2.39.0.dev"
},
{
"key": "temp_location",
"namespace": "options",
"type": "STRING",
"value": "gs://temp-storage-for-perf-tests/loadtests"
},
{
"key": "input_options",
"namespace": "go_options",
"type": "STRING",
"value": "{\"num_records\": 200000000,\"key_size\": 1,\"value_size\": 9}"
},
{
"key": "****_binary",
"namespace": "go_options",
"type": "STRING",
"value": "linux_amd64/group_by_key"
},
{
"key": "influx_db_name",
"namespace": "go_options",
"type": "STRING",
"value": "beam_test_metrics"
},
{
"key": "iterations",
"namespace": "go_options",
"type": "STRING",
"value": "1"
},
{
"key": "hookOrder",
"namespace": "go_options",
"type": "STRING",
"value": "[\"default_remote_logging\"]"
},
{
"key": "influx_measurement",
"namespace": "go_options",
"type": "STRING",
"value": "go_batch_gbk_1"
},
{
"key": "fanout",
"namespace": "go_options",
"type": "STRING",
"value": "1"
},
{
"key": "influx_hostname",
"namespace": "go_options",
"type": "STRING",
"value": "http://10.128.0.96:8086"
},
{
"key": "influx_namespace",
"namespace": "go_options",
"type": "STRING",
"value": "dataflow"
},
{
"key": "hooks",
"namespace": "go_options",
"type": "STRING",
"value": "{\"default_remote_logging\":null}"
}
],
"options": {
"experiments": [
"use_unified_****",
"use_portable_job_submission",
"beam_fn_api"
],
"pipelineUrl": "gs://temp-storage-for-perf-tests/loadtests/go-1-1651140879170173611/model",
"region": "us-central1",
"tempLocation": "gs://temp-storage-for-perf-tests/loadtests"
},
"beam:option:go_options:v1": {
"options": {
"fanout": "1",
"hookOrder": "[\"default_remote_logging\"]",
"hooks": "{\"default_remote_logging\":null}",
"influx_db_name": "beam_test_metrics",
"influx_hostname": "http://10.128.0.96:8086",
"influx_measurement": "go_batch_gbk_1",
"influx_namespace": "dataflow",
"input_options": "{\"num_records\": 200000000,\"key_size\": 1,\"value_size\": 9}",
"iterations": "1",
"****_binary": "linux_amd64/group_by_key"
}
}
},
"tempStoragePrefix": "gs://temp-storage-for-perf-tests/loadtests",
"userAgent": {
"name": "Apache Beam SDK for Go",
"version": "2.39.0.dev"
},
"version": {
"job_type": "FNAPI_BATCH",
"major": "6"
},
"****Pools": [
{
"autoscalingSettings": {
"algorithm": "AUTOSCALING_ALGORITHM_NONE"
},
"ipConfiguration": "WORKER_IP_UNSPECIFIED",
"kind": "harness",
"numWorkers": 5,
"packages": [
{
"location": "gs://temp-storage-for-perf-tests/loadtests/go-1-1651140879170173611/****",
"name": "****"
}
],
"sdkHarnessContainerImages": [
{
"containerImage": "apache/beam_go_sdk:2.39.0.dev"
}
],
"****HarnessContainerImage": "apache/beam_go_sdk:2.39.0.dev"
}
]
},
"name": "load-tests-go-dataflow-batch-gbk-1-0428000303",
"projectId": "apache-beam-testing",
"type": "JOB_TYPE_BATCH"
}
2022/04/28 10:14:40 Submitted job: 2022-04-28_03_14_39-10004262055355952387
2022/04/28 10:14:40 Console: https://console.cloud.google.com/dataflow/jobs/us-central1/2022-04-28_03_14_39-10004262055355952387?project=apache-beam-testing
2022/04/28 10:14:40 Logs: https://console.cloud.google.com/logs/viewer?project=apache-beam-testing&resource=dataflow_step%2Fjob_id%2F2022-04-28_03_14_39-10004262055355952387
2022/04/28 10:14:40 Job state: JOB_STATE_PENDING ...
2022/04/28 10:15:10 Job still running ...
2022/04/28 10:15:40 Job still running ...
2022/04/28 10:16:10 Job still running ...
2022/04/28 10:16:40 Job still running ...
2022/04/28 10:17:10 Job still running ...
2022/04/28 10:17:40 Job still running ...
2022/04/28 10:18:10 Job still running ...
2022/04/28 10:18:41 Job still running ...
2022/04/28 10:19:11 Job still running ...
2022/04/28 10:19:41 Failed to execute job: job 2022-04-28_03_14_39-10004262055355952387 failed
panic: Failed to execute job: job 2022-04-28_03_14_39-10004262055355952387 failed
goroutine 1 [running]:
github.com/apache/beam/sdks/v2/go/pkg/beam/log.Fatalf(0x1209588, 0xc000120000, 0x10e6e1c, 0x19, 0xc0003ffe78, 0x1, 0x1)
<https://ci-beam.apache.org/job/beam_LoadTests_Go_GBK_Dataflow_Batch/ws/src/sdks/go/pkg/beam/log/log.go>:153 +0xec
main.main()
<https://ci-beam.apache.org/job/beam_LoadTests_Go_GBK_Dataflow_Batch/ws/src/sdks/go/test/load/group_by_key/group_by_key.go>:82 +0x418
> Task :sdks:go:test:load:run FAILED
FAILURE: Build failed with an exception.
* Where:
Build file '<https://ci-beam.apache.org/job/beam_LoadTests_Go_GBK_Dataflow_Batch/ws/src/sdks/go/test/load/build.gradle'> line: 31
* What went wrong:
Execution failed for task ':sdks:go:test:load:run'.
> Process 'command 'sh'' finished with non-zero exit value 2
* Try:
> Run with --stacktrace option to get the stack trace.
> Run with --info or --debug option to get more log output.
> Run with --scan to get full insights.
* Get more help at https://help.gradle.org
BUILD FAILED in 5m 18s
12 actionable tasks: 6 executed, 4 from cache, 2 up-to-date
Publishing build scan...
https://gradle.com/s/q3bujxaby7vws
Build step 'Invoke Gradle script' changed build result to FAILURE
Build step 'Invoke Gradle script' marked build as failure
---------------------------------------------------------------------
To unsubscribe, e-mail: builds-unsubscribe@beam.apache.org
For additional commands, e-mail: builds-help@beam.apache.org
Build failed in Jenkins: beam_LoadTests_Go_GBK_Dataflow_Batch #493
Posted by Apache Jenkins Server <je...@builds.apache.org>.
See <https://ci-beam.apache.org/job/beam_LoadTests_Go_GBK_Dataflow_Batch/493/display/redirect?page=changes>
Changes:
[msbukal] FhirIO: use .search() or .searchType instead of .setResourceType()
[noreply] Remove unnecessary decorator from RunInference interface (#17463)
[noreply] [BEAM-13590] Minor deprecated warning fix (#17453)
[noreply] [BEAM-12164]: fix the negative throughput issue (#17461)
[noreply] Updated goldens for the screen diff integration tests (#17467)
[noreply] fixes copy by value error for bytes.Buffer in Error (#17469)
[noreply] Merge pull request #17354 from [BEAM-14170] - Create a test that runs
[noreply] Merge pull request #17447 from [BEAM-14357] Fix
[noreply] [BEAM-14324, BEAM-14325] Staticcheck cleanup in test files (#17393)
[noreply] BEAM-14187 Fix NPE (#17454)
[noreply] [BEAM-11105] Stateful watermark estimation (#17374)
[noreply] [BEAM-14304] implement parquetio to read/write parquet files (#17347)
------------------------------------------
[...truncated 17.67 KB...]
urn: "beam:env:docker:v1"
payload: "\n\035apache/beam_go_sdk:2.39.0.dev"
capabilities: "beam:protocol:progress_reporting:v0"
capabilities: "beam:protocol:multi_core_bundle_processing:v1"
capabilities: "beam:version:sdk_base:go"
capabilities: "beam:coder:bytes:v1"
capabilities: "beam:coder:bool:v1"
capabilities: "beam:coder:varint:v1"
capabilities: "beam:coder:double:v1"
capabilities: "beam:coder:string_utf8:v1"
capabilities: "beam:coder:length_prefix:v1"
capabilities: "beam:coder:kv:v1"
capabilities: "beam:coder:iterable:v1"
capabilities: "beam:coder:state_backed_iterable:v1"
capabilities: "beam:coder:windowed_value:v1"
capabilities: "beam:coder:global_window:v1"
capabilities: "beam:coder:interval_window:v1"
capabilities: "beam:coder:row:v1"
capabilities: "beam:coder:nullable:v1"
dependencies: <
type_urn: "beam:artifact:type:url:v1"
type_payload: "\nJgs://temp-storage-for-perf-tests/loadtests/go-1-1651054480905275410/****\022@1a8cbf0d1eec68004ef3d2259969cc9225c3ae810d67e5f51a826bd24e620942"
role_urn: "beam:artifact:role:go_****_binary:v1"
>
>
>
>
root_transform_ids: "s1"
root_transform_ids: "e4"
root_transform_ids: "e5"
root_transform_ids: "e6"
root_transform_ids: "e7"
requirements: "beam:requirement:pardo:splittable_dofn:v1"
2022/04/27 10:14:41 Staged model pipeline: gs://temp-storage-for-perf-tests/loadtests/go-1-1651054480905275410/model
2022/04/27 10:14:41 {
"environment": {
"experiments": [
"use_unified_****",
"use_portable_job_submission",
"beam_fn_api"
],
"sdkPipelineOptions": {
"display_data": [
{
"key": "name",
"namespace": "options",
"type": "STRING",
"value": "load-tests-go-dataflow-batch-gbk-1-0427100252"
},
{
"key": "experiments",
"namespace": "options",
"type": "STRING",
"value": "use_unified_****,use_portable_job_submission"
},
{
"key": "project",
"namespace": "options",
"type": "STRING",
"value": "apache-beam-testing"
},
{
"key": "region",
"namespace": "options",
"type": "STRING",
"value": "us-central1"
},
{
"key": "container_images",
"namespace": "options",
"type": "STRING",
"value": "apache/beam_go_sdk:2.39.0.dev"
},
{
"key": "temp_location",
"namespace": "options",
"type": "STRING",
"value": "gs://temp-storage-for-perf-tests/loadtests"
},
{
"key": "fanout",
"namespace": "go_options",
"type": "STRING",
"value": "1"
},
{
"key": "influx_measurement",
"namespace": "go_options",
"type": "STRING",
"value": "go_batch_gbk_1"
},
{
"key": "iterations",
"namespace": "go_options",
"type": "STRING",
"value": "1"
},
{
"key": "influx_db_name",
"namespace": "go_options",
"type": "STRING",
"value": "beam_test_metrics"
},
{
"key": "influx_namespace",
"namespace": "go_options",
"type": "STRING",
"value": "dataflow"
},
{
"key": "hookOrder",
"namespace": "go_options",
"type": "STRING",
"value": "[\"default_remote_logging\"]"
},
{
"key": "hooks",
"namespace": "go_options",
"type": "STRING",
"value": "{\"default_remote_logging\":null}"
},
{
"key": "influx_hostname",
"namespace": "go_options",
"type": "STRING",
"value": "http://10.128.0.96:8086"
},
{
"key": "input_options",
"namespace": "go_options",
"type": "STRING",
"value": "{\"num_records\": 200000000,\"key_size\": 1,\"value_size\": 9}"
},
{
"key": "****_binary",
"namespace": "go_options",
"type": "STRING",
"value": "linux_amd64/group_by_key"
}
],
"options": {
"experiments": [
"use_unified_****",
"use_portable_job_submission",
"beam_fn_api"
],
"pipelineUrl": "gs://temp-storage-for-perf-tests/loadtests/go-1-1651054480905275410/model",
"region": "us-central1",
"tempLocation": "gs://temp-storage-for-perf-tests/loadtests"
},
"beam:option:go_options:v1": {
"options": {
"fanout": "1",
"hookOrder": "[\"default_remote_logging\"]",
"hooks": "{\"default_remote_logging\":null}",
"influx_db_name": "beam_test_metrics",
"influx_hostname": "http://10.128.0.96:8086",
"influx_measurement": "go_batch_gbk_1",
"influx_namespace": "dataflow",
"input_options": "{\"num_records\": 200000000,\"key_size\": 1,\"value_size\": 9}",
"iterations": "1",
"****_binary": "linux_amd64/group_by_key"
}
}
},
"tempStoragePrefix": "gs://temp-storage-for-perf-tests/loadtests",
"userAgent": {
"name": "Apache Beam SDK for Go",
"version": "2.39.0.dev"
},
"version": {
"job_type": "FNAPI_BATCH",
"major": "6"
},
"****Pools": [
{
"autoscalingSettings": {
"algorithm": "AUTOSCALING_ALGORITHM_NONE"
},
"ipConfiguration": "WORKER_IP_UNSPECIFIED",
"kind": "harness",
"numWorkers": 5,
"packages": [
{
"location": "gs://temp-storage-for-perf-tests/loadtests/go-1-1651054480905275410/****",
"name": "****"
}
],
"sdkHarnessContainerImages": [
{
"containerImage": "apache/beam_go_sdk:2.39.0.dev"
}
],
"****HarnessContainerImage": "apache/beam_go_sdk:2.39.0.dev"
}
]
},
"name": "load-tests-go-dataflow-batch-gbk-1-0427100252",
"projectId": "apache-beam-testing",
"type": "JOB_TYPE_BATCH"
}
2022/04/27 10:14:42 Submitted job: 2022-04-27_03_14_41-4546868229711315500
2022/04/27 10:14:42 Console: https://console.cloud.google.com/dataflow/jobs/us-central1/2022-04-27_03_14_41-4546868229711315500?project=apache-beam-testing
2022/04/27 10:14:42 Logs: https://console.cloud.google.com/logs/viewer?project=apache-beam-testing&resource=dataflow_step%2Fjob_id%2F2022-04-27_03_14_41-4546868229711315500
2022/04/27 10:14:42 Job state: JOB_STATE_PENDING ...
2022/04/27 10:15:12 Job still running ...
2022/04/27 10:15:42 Job still running ...
2022/04/27 10:16:12 Job still running ...
2022/04/27 10:16:42 Job still running ...
2022/04/27 10:17:13 Job still running ...
2022/04/27 10:17:43 Job still running ...
2022/04/27 10:18:13 Job still running ...
2022/04/27 10:18:43 Job still running ...
2022/04/27 10:19:13 Job still running ...
2022/04/27 10:19:43 Failed to execute job: job 2022-04-27_03_14_41-4546868229711315500 failed
panic: Failed to execute job: job 2022-04-27_03_14_41-4546868229711315500 failed
goroutine 1 [running]:
github.com/apache/beam/sdks/v2/go/pkg/beam/log.Fatalf(0x1208188, 0xc000120000, 0x10e5d1c, 0x19, 0xc0007d5e78, 0x1, 0x1)
<https://ci-beam.apache.org/job/beam_LoadTests_Go_GBK_Dataflow_Batch/ws/src/sdks/go/pkg/beam/log/log.go>:153 +0xec
main.main()
<https://ci-beam.apache.org/job/beam_LoadTests_Go_GBK_Dataflow_Batch/ws/src/sdks/go/test/load/group_by_key/group_by_key.go>:82 +0x418
> Task :sdks:go:test:load:run FAILED
FAILURE: Build failed with an exception.
* Where:
Build file '<https://ci-beam.apache.org/job/beam_LoadTests_Go_GBK_Dataflow_Batch/ws/src/sdks/go/test/load/build.gradle'> line: 31
* What went wrong:
Execution failed for task ':sdks:go:test:load:run'.
> Process 'command 'sh'' finished with non-zero exit value 2
* Try:
> Run with --stacktrace option to get the stack trace.
> Run with --info or --debug option to get more log output.
> Run with --scan to get full insights.
* Get more help at https://help.gradle.org
BUILD FAILED in 5m 20s
12 actionable tasks: 6 executed, 4 from cache, 2 up-to-date
Publishing build scan...
https://gradle.com/s/eub3wuizqtxzq
Build step 'Invoke Gradle script' changed build result to FAILURE
Build step 'Invoke Gradle script' marked build as failure
---------------------------------------------------------------------
To unsubscribe, e-mail: builds-unsubscribe@beam.apache.org
For additional commands, e-mail: builds-help@beam.apache.org
Build failed in Jenkins: beam_LoadTests_Go_GBK_Dataflow_Batch #492
Posted by Apache Jenkins Server <je...@builds.apache.org>.
See <https://ci-beam.apache.org/job/beam_LoadTests_Go_GBK_Dataflow_Batch/492/display/redirect?page=changes>
Changes:
[Heejong Lee] [BEAM-14343] Allow expansion service override in ExternalPythonTransform
[Heejong Lee] update
[Heejong Lee] allows remote host
[Heejong Lee] improve compatibility with python rowcoder
[ahmedabualsaud] added tempLocation to test pipeline options
[ahmedabualsaud] using tempRoot for temp bucket location
[ahmedabualsaud] small fixes
[noreply] [BEAM-14320] Update programming-guide w/Java GroupByKey example (#17369)
[noreply] Minor: Fix release script for `current` symlinks (#17457)
[noreply] Minor: fix typo (#17452)
[noreply] Change return type for PytorchInferenceRunner (#17460)
[noreply] [BEAM-13608] JmsIO dynamic topics feature (#17163)
[Heejong Lee] add test
------------------------------------------
[...truncated 17.38 KB...]
urn: "beam:env:docker:v1"
payload: "\n\035apache/beam_go_sdk:2.39.0.dev"
capabilities: "beam:protocol:progress_reporting:v0"
capabilities: "beam:protocol:multi_core_bundle_processing:v1"
capabilities: "beam:version:sdk_base:go"
capabilities: "beam:coder:bytes:v1"
capabilities: "beam:coder:bool:v1"
capabilities: "beam:coder:varint:v1"
capabilities: "beam:coder:double:v1"
capabilities: "beam:coder:string_utf8:v1"
capabilities: "beam:coder:length_prefix:v1"
capabilities: "beam:coder:kv:v1"
capabilities: "beam:coder:iterable:v1"
capabilities: "beam:coder:state_backed_iterable:v1"
capabilities: "beam:coder:windowed_value:v1"
capabilities: "beam:coder:global_window:v1"
capabilities: "beam:coder:interval_window:v1"
capabilities: "beam:coder:row:v1"
capabilities: "beam:coder:nullable:v1"
dependencies: <
type_urn: "beam:artifact:type:url:v1"
type_payload: "\nJgs://temp-storage-for-perf-tests/loadtests/go-1-1650968075452734331/****\022@d5227fb8580dab9ef4f7a9c2283df6593f46e843f8a6eb662cb5fda78b2283c1"
role_urn: "beam:artifact:role:go_****_binary:v1"
>
>
>
>
root_transform_ids: "s1"
root_transform_ids: "e4"
root_transform_ids: "e5"
root_transform_ids: "e6"
root_transform_ids: "e7"
requirements: "beam:requirement:pardo:splittable_dofn:v1"
2022/04/26 10:14:36 Staged model pipeline: gs://temp-storage-for-perf-tests/loadtests/go-1-1650968075452734331/model
2022/04/26 10:14:36 {
"environment": {
"experiments": [
"use_unified_****",
"use_portable_job_submission",
"beam_fn_api"
],
"sdkPipelineOptions": {
"display_data": [
{
"key": "name",
"namespace": "options",
"type": "STRING",
"value": "load-tests-go-dataflow-batch-gbk-1-0426100248"
},
{
"key": "experiments",
"namespace": "options",
"type": "STRING",
"value": "use_unified_****,use_portable_job_submission"
},
{
"key": "project",
"namespace": "options",
"type": "STRING",
"value": "apache-beam-testing"
},
{
"key": "region",
"namespace": "options",
"type": "STRING",
"value": "us-central1"
},
{
"key": "container_images",
"namespace": "options",
"type": "STRING",
"value": "apache/beam_go_sdk:2.39.0.dev"
},
{
"key": "temp_location",
"namespace": "options",
"type": "STRING",
"value": "gs://temp-storage-for-perf-tests/loadtests"
},
{
"key": "hooks",
"namespace": "go_options",
"type": "STRING",
"value": "{\"default_remote_logging\":null}"
},
{
"key": "input_options",
"namespace": "go_options",
"type": "STRING",
"value": "{\"num_records\": 200000000,\"key_size\": 1,\"value_size\": 9}"
},
{
"key": "influx_db_name",
"namespace": "go_options",
"type": "STRING",
"value": "beam_test_metrics"
},
{
"key": "influx_hostname",
"namespace": "go_options",
"type": "STRING",
"value": "http://10.128.0.96:8086"
},
{
"key": "influx_measurement",
"namespace": "go_options",
"type": "STRING",
"value": "go_batch_gbk_1"
},
{
"key": "influx_namespace",
"namespace": "go_options",
"type": "STRING",
"value": "dataflow"
},
{
"key": "fanout",
"namespace": "go_options",
"type": "STRING",
"value": "1"
},
{
"key": "****_binary",
"namespace": "go_options",
"type": "STRING",
"value": "linux_amd64/group_by_key"
},
{
"key": "iterations",
"namespace": "go_options",
"type": "STRING",
"value": "1"
},
{
"key": "hookOrder",
"namespace": "go_options",
"type": "STRING",
"value": "[\"default_remote_logging\"]"
}
],
"options": {
"experiments": [
"use_unified_****",
"use_portable_job_submission",
"beam_fn_api"
],
"pipelineUrl": "gs://temp-storage-for-perf-tests/loadtests/go-1-1650968075452734331/model",
"region": "us-central1",
"tempLocation": "gs://temp-storage-for-perf-tests/loadtests"
},
"beam:option:go_options:v1": {
"options": {
"fanout": "1",
"hookOrder": "[\"default_remote_logging\"]",
"hooks": "{\"default_remote_logging\":null}",
"influx_db_name": "beam_test_metrics",
"influx_hostname": "http://10.128.0.96:8086",
"influx_measurement": "go_batch_gbk_1",
"influx_namespace": "dataflow",
"input_options": "{\"num_records\": 200000000,\"key_size\": 1,\"value_size\": 9}",
"iterations": "1",
"****_binary": "linux_amd64/group_by_key"
}
}
},
"tempStoragePrefix": "gs://temp-storage-for-perf-tests/loadtests",
"userAgent": {
"name": "Apache Beam SDK for Go",
"version": "2.39.0.dev"
},
"version": {
"job_type": "FNAPI_BATCH",
"major": "6"
},
"****Pools": [
{
"autoscalingSettings": {
"algorithm": "AUTOSCALING_ALGORITHM_NONE"
},
"ipConfiguration": "WORKER_IP_UNSPECIFIED",
"kind": "harness",
"numWorkers": 5,
"packages": [
{
"location": "gs://temp-storage-for-perf-tests/loadtests/go-1-1650968075452734331/****",
"name": "****"
}
],
"sdkHarnessContainerImages": [
{
"containerImage": "apache/beam_go_sdk:2.39.0.dev"
}
],
"****HarnessContainerImage": "apache/beam_go_sdk:2.39.0.dev"
}
]
},
"name": "load-tests-go-dataflow-batch-gbk-1-0426100248",
"projectId": "apache-beam-testing",
"type": "JOB_TYPE_BATCH"
}
2022/04/26 10:14:36 Submitted job: 2022-04-26_03_14_36-4488797451829970442
2022/04/26 10:14:36 Console: https://console.cloud.google.com/dataflow/jobs/us-central1/2022-04-26_03_14_36-4488797451829970442?project=apache-beam-testing
2022/04/26 10:14:36 Logs: https://console.cloud.google.com/logs/viewer?project=apache-beam-testing&resource=dataflow_step%2Fjob_id%2F2022-04-26_03_14_36-4488797451829970442
2022/04/26 10:14:36 Job state: JOB_STATE_PENDING ...
2022/04/26 10:15:06 Job still running ...
2022/04/26 10:15:36 Job still running ...
2022/04/26 10:16:06 Job still running ...
2022/04/26 10:16:37 Job still running ...
2022/04/26 10:17:07 Job still running ...
2022/04/26 10:17:37 Job still running ...
2022/04/26 10:18:07 Job still running ...
2022/04/26 10:18:37 Job still running ...
2022/04/26 10:19:07 Job still running ...
2022/04/26 10:19:37 Failed to execute job: job 2022-04-26_03_14_36-4488797451829970442 failed
panic: Failed to execute job: job 2022-04-26_03_14_36-4488797451829970442 failed
goroutine 1 [running]:
github.com/apache/beam/sdks/v2/go/pkg/beam/log.Fatalf(0x1202f68, 0xc000120000, 0x10e17e5, 0x19, 0xc000631e78, 0x1, 0x1)
<https://ci-beam.apache.org/job/beam_LoadTests_Go_GBK_Dataflow_Batch/ws/src/sdks/go/pkg/beam/log/log.go>:153 +0xec
main.main()
<https://ci-beam.apache.org/job/beam_LoadTests_Go_GBK_Dataflow_Batch/ws/src/sdks/go/test/load/group_by_key/group_by_key.go>:82 +0x418
> Task :sdks:go:test:load:run FAILED
FAILURE: Build failed with an exception.
* Where:
Build file '<https://ci-beam.apache.org/job/beam_LoadTests_Go_GBK_Dataflow_Batch/ws/src/sdks/go/test/load/build.gradle'> line: 31
* What went wrong:
Execution failed for task ':sdks:go:test:load:run'.
> Process 'command 'sh'' finished with non-zero exit value 2
* Try:
> Run with --stacktrace option to get the stack trace.
> Run with --info or --debug option to get more log output.
> Run with --scan to get full insights.
* Get more help at https://help.gradle.org
BUILD FAILED in 5m 14s
12 actionable tasks: 6 executed, 4 from cache, 2 up-to-date
Publishing build scan...
https://gradle.com/s/ltdbzuw7gaygu
Build step 'Invoke Gradle script' changed build result to FAILURE
Build step 'Invoke Gradle script' marked build as failure
---------------------------------------------------------------------
To unsubscribe, e-mail: builds-unsubscribe@beam.apache.org
For additional commands, e-mail: builds-help@beam.apache.org
Build failed in Jenkins: beam_LoadTests_Go_GBK_Dataflow_Batch #491
Posted by Apache Jenkins Server <je...@builds.apache.org>.
See <https://ci-beam.apache.org/job/beam_LoadTests_Go_GBK_Dataflow_Batch/491/display/redirect>
Changes:
------------------------------------------
[...truncated 17.36 KB...]
>
environments: <
key: "go"
value: <
urn: "beam:env:docker:v1"
payload: "\n\035apache/beam_go_sdk:2.39.0.dev"
capabilities: "beam:protocol:progress_reporting:v0"
capabilities: "beam:protocol:multi_core_bundle_processing:v1"
capabilities: "beam:version:sdk_base:go"
capabilities: "beam:coder:bytes:v1"
capabilities: "beam:coder:bool:v1"
capabilities: "beam:coder:varint:v1"
capabilities: "beam:coder:double:v1"
capabilities: "beam:coder:string_utf8:v1"
capabilities: "beam:coder:length_prefix:v1"
capabilities: "beam:coder:kv:v1"
capabilities: "beam:coder:iterable:v1"
capabilities: "beam:coder:state_backed_iterable:v1"
capabilities: "beam:coder:windowed_value:v1"
capabilities: "beam:coder:global_window:v1"
capabilities: "beam:coder:interval_window:v1"
capabilities: "beam:coder:row:v1"
capabilities: "beam:coder:nullable:v1"
dependencies: <
type_urn: "beam:artifact:type:url:v1"
type_payload: "\nJgs://temp-storage-for-perf-tests/loadtests/go-1-1650881676131203195/****\022@d5227fb8580dab9ef4f7a9c2283df6593f46e843f8a6eb662cb5fda78b2283c1"
role_urn: "beam:artifact:role:go_****_binary:v1"
>
>
>
>
root_transform_ids: "s1"
root_transform_ids: "e4"
root_transform_ids: "e5"
root_transform_ids: "e6"
root_transform_ids: "e7"
requirements: "beam:requirement:pardo:splittable_dofn:v1"
2022/04/25 10:14:36 Staged model pipeline: gs://temp-storage-for-perf-tests/loadtests/go-1-1650881676131203195/model
2022/04/25 10:14:36 {
"environment": {
"experiments": [
"use_unified_****",
"use_portable_job_submission",
"beam_fn_api"
],
"sdkPipelineOptions": {
"display_data": [
{
"key": "name",
"namespace": "options",
"type": "STRING",
"value": "load-tests-go-dataflow-batch-gbk-1-0425100237"
},
{
"key": "experiments",
"namespace": "options",
"type": "STRING",
"value": "use_unified_****,use_portable_job_submission"
},
{
"key": "project",
"namespace": "options",
"type": "STRING",
"value": "apache-beam-testing"
},
{
"key": "region",
"namespace": "options",
"type": "STRING",
"value": "us-central1"
},
{
"key": "container_images",
"namespace": "options",
"type": "STRING",
"value": "apache/beam_go_sdk:2.39.0.dev"
},
{
"key": "temp_location",
"namespace": "options",
"type": "STRING",
"value": "gs://temp-storage-for-perf-tests/loadtests"
},
{
"key": "influx_hostname",
"namespace": "go_options",
"type": "STRING",
"value": "http://10.128.0.96:8086"
},
{
"key": "hooks",
"namespace": "go_options",
"type": "STRING",
"value": "{\"default_remote_logging\":null}"
},
{
"key": "influx_measurement",
"namespace": "go_options",
"type": "STRING",
"value": "go_batch_gbk_1"
},
{
"key": "influx_namespace",
"namespace": "go_options",
"type": "STRING",
"value": "dataflow"
},
{
"key": "****_binary",
"namespace": "go_options",
"type": "STRING",
"value": "linux_amd64/group_by_key"
},
{
"key": "hookOrder",
"namespace": "go_options",
"type": "STRING",
"value": "[\"default_remote_logging\"]"
},
{
"key": "fanout",
"namespace": "go_options",
"type": "STRING",
"value": "1"
},
{
"key": "input_options",
"namespace": "go_options",
"type": "STRING",
"value": "{\"num_records\": 200000000,\"key_size\": 1,\"value_size\": 9}"
},
{
"key": "iterations",
"namespace": "go_options",
"type": "STRING",
"value": "1"
},
{
"key": "influx_db_name",
"namespace": "go_options",
"type": "STRING",
"value": "beam_test_metrics"
}
],
"options": {
"experiments": [
"use_unified_****",
"use_portable_job_submission",
"beam_fn_api"
],
"pipelineUrl": "gs://temp-storage-for-perf-tests/loadtests/go-1-1650881676131203195/model",
"region": "us-central1",
"tempLocation": "gs://temp-storage-for-perf-tests/loadtests"
},
"beam:option:go_options:v1": {
"options": {
"fanout": "1",
"hookOrder": "[\"default_remote_logging\"]",
"hooks": "{\"default_remote_logging\":null}",
"influx_db_name": "beam_test_metrics",
"influx_hostname": "http://10.128.0.96:8086",
"influx_measurement": "go_batch_gbk_1",
"influx_namespace": "dataflow",
"input_options": "{\"num_records\": 200000000,\"key_size\": 1,\"value_size\": 9}",
"iterations": "1",
"****_binary": "linux_amd64/group_by_key"
}
}
},
"tempStoragePrefix": "gs://temp-storage-for-perf-tests/loadtests",
"userAgent": {
"name": "Apache Beam SDK for Go",
"version": "2.39.0.dev"
},
"version": {
"job_type": "FNAPI_BATCH",
"major": "6"
},
"****Pools": [
{
"autoscalingSettings": {
"algorithm": "AUTOSCALING_ALGORITHM_NONE"
},
"ipConfiguration": "WORKER_IP_UNSPECIFIED",
"kind": "harness",
"numWorkers": 5,
"packages": [
{
"location": "gs://temp-storage-for-perf-tests/loadtests/go-1-1650881676131203195/****",
"name": "****"
}
],
"sdkHarnessContainerImages": [
{
"containerImage": "apache/beam_go_sdk:2.39.0.dev"
}
],
"****HarnessContainerImage": "apache/beam_go_sdk:2.39.0.dev"
}
]
},
"name": "load-tests-go-dataflow-batch-gbk-1-0425100237",
"projectId": "apache-beam-testing",
"type": "JOB_TYPE_BATCH"
}
2022/04/25 10:14:37 Submitted job: 2022-04-25_03_14_36-14684707291423957406
2022/04/25 10:14:37 Console: https://console.cloud.google.com/dataflow/jobs/us-central1/2022-04-25_03_14_36-14684707291423957406?project=apache-beam-testing
2022/04/25 10:14:37 Logs: https://console.cloud.google.com/logs/viewer?project=apache-beam-testing&resource=dataflow_step%2Fjob_id%2F2022-04-25_03_14_36-14684707291423957406
2022/04/25 10:14:37 Job state: JOB_STATE_PENDING ...
2022/04/25 10:15:07 Job still running ...
2022/04/25 10:15:37 Job still running ...
2022/04/25 10:16:07 Job still running ...
2022/04/25 10:16:37 Job still running ...
2022/04/25 10:17:07 Job still running ...
2022/04/25 10:17:37 Failed to execute job: job 2022-04-25_03_14_36-14684707291423957406 failed
panic: Failed to execute job: job 2022-04-25_03_14_36-14684707291423957406 failed
goroutine 1 [running]:
github.com/apache/beam/sdks/v2/go/pkg/beam/log.Fatalf(0x1202f68, 0xc000120000, 0x10e17e5, 0x19, 0xc00028de78, 0x1, 0x1)
<https://ci-beam.apache.org/job/beam_LoadTests_Go_GBK_Dataflow_Batch/ws/src/sdks/go/pkg/beam/log/log.go>:153 +0xec
main.main()
<https://ci-beam.apache.org/job/beam_LoadTests_Go_GBK_Dataflow_Batch/ws/src/sdks/go/test/load/group_by_key/group_by_key.go>:82 +0x418
> Task :sdks:go:test:load:run FAILED
FAILURE: Build failed with an exception.
* Where:
Build file '<https://ci-beam.apache.org/job/beam_LoadTests_Go_GBK_Dataflow_Batch/ws/src/sdks/go/test/load/build.gradle'> line: 31
* What went wrong:
Execution failed for task ':sdks:go:test:load:run'.
> Process 'command 'sh'' finished with non-zero exit value 2
* Try:
> Run with --stacktrace option to get the stack trace.
> Run with --info or --debug option to get more log output.
> Run with --scan to get full insights.
* Get more help at https://help.gradle.org
BUILD FAILED in 3m 14s
12 actionable tasks: 6 executed, 4 from cache, 2 up-to-date
Publishing build scan...
https://gradle.com/s/x2p3eexvwt6le
Build step 'Invoke Gradle script' changed build result to FAILURE
Build step 'Invoke Gradle script' marked build as failure
---------------------------------------------------------------------
To unsubscribe, e-mail: builds-unsubscribe@beam.apache.org
For additional commands, e-mail: builds-help@beam.apache.org
Build failed in Jenkins: beam_LoadTests_Go_GBK_Dataflow_Batch #490
Posted by Apache Jenkins Server <je...@builds.apache.org>.
See <https://ci-beam.apache.org/job/beam_LoadTests_Go_GBK_Dataflow_Batch/490/display/redirect?page=changes>
Changes:
[noreply] [BEAM-13953] added documentation for BQ Storage Write API (#17391)
------------------------------------------
[...truncated 17.40 KB...]
urn: "beam:env:docker:v1"
payload: "\n\035apache/beam_go_sdk:2.39.0.dev"
capabilities: "beam:protocol:progress_reporting:v0"
capabilities: "beam:protocol:multi_core_bundle_processing:v1"
capabilities: "beam:version:sdk_base:go"
capabilities: "beam:coder:bytes:v1"
capabilities: "beam:coder:bool:v1"
capabilities: "beam:coder:varint:v1"
capabilities: "beam:coder:double:v1"
capabilities: "beam:coder:string_utf8:v1"
capabilities: "beam:coder:length_prefix:v1"
capabilities: "beam:coder:kv:v1"
capabilities: "beam:coder:iterable:v1"
capabilities: "beam:coder:state_backed_iterable:v1"
capabilities: "beam:coder:windowed_value:v1"
capabilities: "beam:coder:global_window:v1"
capabilities: "beam:coder:interval_window:v1"
capabilities: "beam:coder:row:v1"
capabilities: "beam:coder:nullable:v1"
dependencies: <
type_urn: "beam:artifact:type:url:v1"
type_payload: "\nJgs://temp-storage-for-perf-tests/loadtests/go-1-1650795276233105459/****\022@d5227fb8580dab9ef4f7a9c2283df6593f46e843f8a6eb662cb5fda78b2283c1"
role_urn: "beam:artifact:role:go_****_binary:v1"
>
>
>
>
root_transform_ids: "s1"
root_transform_ids: "e4"
root_transform_ids: "e5"
root_transform_ids: "e6"
root_transform_ids: "e7"
requirements: "beam:requirement:pardo:splittable_dofn:v1"
2022/04/24 10:14:36 Staged model pipeline: gs://temp-storage-for-perf-tests/loadtests/go-1-1650795276233105459/model
2022/04/24 10:14:36 {
"environment": {
"experiments": [
"use_unified_****",
"use_portable_job_submission",
"beam_fn_api"
],
"sdkPipelineOptions": {
"display_data": [
{
"key": "name",
"namespace": "options",
"type": "STRING",
"value": "load-tests-go-dataflow-batch-gbk-1-0424100238"
},
{
"key": "experiments",
"namespace": "options",
"type": "STRING",
"value": "use_unified_****,use_portable_job_submission"
},
{
"key": "project",
"namespace": "options",
"type": "STRING",
"value": "apache-beam-testing"
},
{
"key": "region",
"namespace": "options",
"type": "STRING",
"value": "us-central1"
},
{
"key": "container_images",
"namespace": "options",
"type": "STRING",
"value": "apache/beam_go_sdk:2.39.0.dev"
},
{
"key": "temp_location",
"namespace": "options",
"type": "STRING",
"value": "gs://temp-storage-for-perf-tests/loadtests"
},
{
"key": "influx_measurement",
"namespace": "go_options",
"type": "STRING",
"value": "go_batch_gbk_1"
},
{
"key": "influx_namespace",
"namespace": "go_options",
"type": "STRING",
"value": "dataflow"
},
{
"key": "input_options",
"namespace": "go_options",
"type": "STRING",
"value": "{\"num_records\": 200000000,\"key_size\": 1,\"value_size\": 9}"
},
{
"key": "****_binary",
"namespace": "go_options",
"type": "STRING",
"value": "linux_amd64/group_by_key"
},
{
"key": "influx_db_name",
"namespace": "go_options",
"type": "STRING",
"value": "beam_test_metrics"
},
{
"key": "influx_hostname",
"namespace": "go_options",
"type": "STRING",
"value": "http://10.128.0.96:8086"
},
{
"key": "iterations",
"namespace": "go_options",
"type": "STRING",
"value": "1"
},
{
"key": "hooks",
"namespace": "go_options",
"type": "STRING",
"value": "{\"default_remote_logging\":null}"
},
{
"key": "hookOrder",
"namespace": "go_options",
"type": "STRING",
"value": "[\"default_remote_logging\"]"
},
{
"key": "fanout",
"namespace": "go_options",
"type": "STRING",
"value": "1"
}
],
"options": {
"experiments": [
"use_unified_****",
"use_portable_job_submission",
"beam_fn_api"
],
"pipelineUrl": "gs://temp-storage-for-perf-tests/loadtests/go-1-1650795276233105459/model",
"region": "us-central1",
"tempLocation": "gs://temp-storage-for-perf-tests/loadtests"
},
"beam:option:go_options:v1": {
"options": {
"fanout": "1",
"hookOrder": "[\"default_remote_logging\"]",
"hooks": "{\"default_remote_logging\":null}",
"influx_db_name": "beam_test_metrics",
"influx_hostname": "http://10.128.0.96:8086",
"influx_measurement": "go_batch_gbk_1",
"influx_namespace": "dataflow",
"input_options": "{\"num_records\": 200000000,\"key_size\": 1,\"value_size\": 9}",
"iterations": "1",
"****_binary": "linux_amd64/group_by_key"
}
}
},
"tempStoragePrefix": "gs://temp-storage-for-perf-tests/loadtests",
"userAgent": {
"name": "Apache Beam SDK for Go",
"version": "2.39.0.dev"
},
"version": {
"job_type": "FNAPI_BATCH",
"major": "6"
},
"****Pools": [
{
"autoscalingSettings": {
"algorithm": "AUTOSCALING_ALGORITHM_NONE"
},
"ipConfiguration": "WORKER_IP_UNSPECIFIED",
"kind": "harness",
"numWorkers": 5,
"packages": [
{
"location": "gs://temp-storage-for-perf-tests/loadtests/go-1-1650795276233105459/****",
"name": "****"
}
],
"sdkHarnessContainerImages": [
{
"containerImage": "apache/beam_go_sdk:2.39.0.dev"
}
],
"****HarnessContainerImage": "apache/beam_go_sdk:2.39.0.dev"
}
]
},
"name": "load-tests-go-dataflow-batch-gbk-1-0424100238",
"projectId": "apache-beam-testing",
"type": "JOB_TYPE_BATCH"
}
2022/04/24 10:14:37 Submitted job: 2022-04-24_03_14_36-5315818999145448678
2022/04/24 10:14:37 Console: https://console.cloud.google.com/dataflow/jobs/us-central1/2022-04-24_03_14_36-5315818999145448678?project=apache-beam-testing
2022/04/24 10:14:37 Logs: https://console.cloud.google.com/logs/viewer?project=apache-beam-testing&resource=dataflow_step%2Fjob_id%2F2022-04-24_03_14_36-5315818999145448678
2022/04/24 10:14:37 Job state: JOB_STATE_PENDING ...
2022/04/24 10:15:07 Job still running ...
2022/04/24 10:15:37 Job still running ...
2022/04/24 10:16:07 Job still running ...
2022/04/24 10:16:37 Job still running ...
2022/04/24 10:17:07 Job still running ...
2022/04/24 10:17:37 Job still running ...
2022/04/24 10:18:07 Job still running ...
2022/04/24 10:18:37 Job still running ...
2022/04/24 10:19:07 Job still running ...
2022/04/24 10:19:38 Failed to execute job: job 2022-04-24_03_14_36-5315818999145448678 failed
panic: Failed to execute job: job 2022-04-24_03_14_36-5315818999145448678 failed
goroutine 1 [running]:
github.com/apache/beam/sdks/v2/go/pkg/beam/log.Fatalf(0x1202f68, 0xc000120000, 0x10e17e5, 0x19, 0xc000427e78, 0x1, 0x1)
<https://ci-beam.apache.org/job/beam_LoadTests_Go_GBK_Dataflow_Batch/ws/src/sdks/go/pkg/beam/log/log.go>:153 +0xec
main.main()
<https://ci-beam.apache.org/job/beam_LoadTests_Go_GBK_Dataflow_Batch/ws/src/sdks/go/test/load/group_by_key/group_by_key.go>:82 +0x418
> Task :sdks:go:test:load:run FAILED
FAILURE: Build failed with an exception.
* Where:
Build file '<https://ci-beam.apache.org/job/beam_LoadTests_Go_GBK_Dataflow_Batch/ws/src/sdks/go/test/load/build.gradle'> line: 31
* What went wrong:
Execution failed for task ':sdks:go:test:load:run'.
> Process 'command 'sh'' finished with non-zero exit value 2
* Try:
> Run with --stacktrace option to get the stack trace.
> Run with --info or --debug option to get more log output.
> Run with --scan to get full insights.
* Get more help at https://help.gradle.org
BUILD FAILED in 5m 14s
12 actionable tasks: 6 executed, 4 from cache, 2 up-to-date
Publishing build scan...
https://gradle.com/s/r36k2b3lcpfwi
Build step 'Invoke Gradle script' changed build result to FAILURE
Build step 'Invoke Gradle script' marked build as failure
---------------------------------------------------------------------
To unsubscribe, e-mail: builds-unsubscribe@beam.apache.org
For additional commands, e-mail: builds-help@beam.apache.org
Build failed in Jenkins: beam_LoadTests_Go_GBK_Dataflow_Batch #489
Posted by Apache Jenkins Server <je...@builds.apache.org>.
See <https://ci-beam.apache.org/job/beam_LoadTests_Go_GBK_Dataflow_Batch/489/display/redirect?page=changes>
Changes:
[Andrew Pilloud] [BEAM-14321] SQL passes Null for Null aggregates
[noreply] Create apache-hop-with-dataflow.md
[noreply] Add files via upload
[noreply] Delete website/www/site/content/en/blog/apache-hop-with-dataflow
[noreply] Add files via upload
[Andrew Pilloud] [BEAM-14348] Upgrade to ZetaSQL 2022.04.1
[Andrew Pilloud] [BEAM-13735] Enable ZetaSQL tests for Java 17
[noreply] Update apache-hop-with-dataflow.md
[noreply] Update apache-hop-with-dataflow.md
[noreply] Update apache-hop-with-dataflow.md
[danielamartinmtz] Moved up get-credentials instruction for getting the kubeconfig file
[noreply] [BEAM-13657] Add python 3.6 update to CHANGES.md (#17435)
[noreply] Merge pull request #17438: [BEAM-8127] The GCP module to declare
[noreply] Merge pull request #17428: [BEAM-14326] Make sure BigQuery daemon thread
[noreply] [BEAM-14301] Add lint:ignore to noescape() func (#17355)
[noreply] [BEAM-14286] Remove unused vars in harness package (#17392)
[noreply] [BEAM-14327] Convert Results to QueryResults directly (#17398)
[noreply] [BEAM-14302] Simplify boolean check in fn.go (#17399)
[noreply] [BEAM-13983] Sklearn Loader for RunInference (#17368)
[noreply] Update authors.yml
[noreply] [BEAM-14358] add retry to connect to testcontainer (#17449)
[noreply] [BEAM-13106] Bump flink docs to 1.14 (#17430)
------------------------------------------
[...truncated 17.34 KB...]
>
environments: <
key: "go"
value: <
urn: "beam:env:docker:v1"
payload: "\n\035apache/beam_go_sdk:2.39.0.dev"
capabilities: "beam:protocol:progress_reporting:v0"
capabilities: "beam:protocol:multi_core_bundle_processing:v1"
capabilities: "beam:version:sdk_base:go"
capabilities: "beam:coder:bytes:v1"
capabilities: "beam:coder:bool:v1"
capabilities: "beam:coder:varint:v1"
capabilities: "beam:coder:double:v1"
capabilities: "beam:coder:string_utf8:v1"
capabilities: "beam:coder:length_prefix:v1"
capabilities: "beam:coder:kv:v1"
capabilities: "beam:coder:iterable:v1"
capabilities: "beam:coder:state_backed_iterable:v1"
capabilities: "beam:coder:windowed_value:v1"
capabilities: "beam:coder:global_window:v1"
capabilities: "beam:coder:interval_window:v1"
capabilities: "beam:coder:row:v1"
capabilities: "beam:coder:nullable:v1"
dependencies: <
type_urn: "beam:artifact:type:url:v1"
type_payload: "\nJgs://temp-storage-for-perf-tests/loadtests/go-1-1650708880987327506/****\022@d5227fb8580dab9ef4f7a9c2283df6593f46e843f8a6eb662cb5fda78b2283c1"
role_urn: "beam:artifact:role:go_****_binary:v1"
>
>
>
>
root_transform_ids: "s1"
root_transform_ids: "e4"
root_transform_ids: "e5"
root_transform_ids: "e6"
root_transform_ids: "e7"
requirements: "beam:requirement:pardo:splittable_dofn:v1"
2022/04/23 10:14:41 Staged model pipeline: gs://temp-storage-for-perf-tests/loadtests/go-1-1650708880987327506/model
2022/04/23 10:14:41 {
"environment": {
"experiments": [
"use_unified_****",
"use_portable_job_submission",
"beam_fn_api"
],
"sdkPipelineOptions": {
"display_data": [
{
"key": "name",
"namespace": "options",
"type": "STRING",
"value": "load-tests-go-dataflow-batch-gbk-1-0423100247"
},
{
"key": "experiments",
"namespace": "options",
"type": "STRING",
"value": "use_unified_****,use_portable_job_submission"
},
{
"key": "project",
"namespace": "options",
"type": "STRING",
"value": "apache-beam-testing"
},
{
"key": "region",
"namespace": "options",
"type": "STRING",
"value": "us-central1"
},
{
"key": "container_images",
"namespace": "options",
"type": "STRING",
"value": "apache/beam_go_sdk:2.39.0.dev"
},
{
"key": "temp_location",
"namespace": "options",
"type": "STRING",
"value": "gs://temp-storage-for-perf-tests/loadtests"
},
{
"key": "iterations",
"namespace": "go_options",
"type": "STRING",
"value": "1"
},
{
"key": "****_binary",
"namespace": "go_options",
"type": "STRING",
"value": "linux_amd64/group_by_key"
},
{
"key": "influx_namespace",
"namespace": "go_options",
"type": "STRING",
"value": "dataflow"
},
{
"key": "fanout",
"namespace": "go_options",
"type": "STRING",
"value": "1"
},
{
"key": "influx_db_name",
"namespace": "go_options",
"type": "STRING",
"value": "beam_test_metrics"
},
{
"key": "hooks",
"namespace": "go_options",
"type": "STRING",
"value": "{\"default_remote_logging\":null}"
},
{
"key": "hookOrder",
"namespace": "go_options",
"type": "STRING",
"value": "[\"default_remote_logging\"]"
},
{
"key": "influx_measurement",
"namespace": "go_options",
"type": "STRING",
"value": "go_batch_gbk_1"
},
{
"key": "input_options",
"namespace": "go_options",
"type": "STRING",
"value": "{\"num_records\": 200000000,\"key_size\": 1,\"value_size\": 9}"
},
{
"key": "influx_hostname",
"namespace": "go_options",
"type": "STRING",
"value": "http://10.128.0.96:8086"
}
],
"options": {
"experiments": [
"use_unified_****",
"use_portable_job_submission",
"beam_fn_api"
],
"pipelineUrl": "gs://temp-storage-for-perf-tests/loadtests/go-1-1650708880987327506/model",
"region": "us-central1",
"tempLocation": "gs://temp-storage-for-perf-tests/loadtests"
},
"beam:option:go_options:v1": {
"options": {
"fanout": "1",
"hookOrder": "[\"default_remote_logging\"]",
"hooks": "{\"default_remote_logging\":null}",
"influx_db_name": "beam_test_metrics",
"influx_hostname": "http://10.128.0.96:8086",
"influx_measurement": "go_batch_gbk_1",
"influx_namespace": "dataflow",
"input_options": "{\"num_records\": 200000000,\"key_size\": 1,\"value_size\": 9}",
"iterations": "1",
"****_binary": "linux_amd64/group_by_key"
}
}
},
"tempStoragePrefix": "gs://temp-storage-for-perf-tests/loadtests",
"userAgent": {
"name": "Apache Beam SDK for Go",
"version": "2.39.0.dev"
},
"version": {
"job_type": "FNAPI_BATCH",
"major": "6"
},
"****Pools": [
{
"autoscalingSettings": {
"algorithm": "AUTOSCALING_ALGORITHM_NONE"
},
"ipConfiguration": "WORKER_IP_UNSPECIFIED",
"kind": "harness",
"numWorkers": 5,
"packages": [
{
"location": "gs://temp-storage-for-perf-tests/loadtests/go-1-1650708880987327506/****",
"name": "****"
}
],
"sdkHarnessContainerImages": [
{
"containerImage": "apache/beam_go_sdk:2.39.0.dev"
}
],
"****HarnessContainerImage": "apache/beam_go_sdk:2.39.0.dev"
}
]
},
"name": "load-tests-go-dataflow-batch-gbk-1-0423100247",
"projectId": "apache-beam-testing",
"type": "JOB_TYPE_BATCH"
}
2022/04/23 10:14:42 Submitted job: 2022-04-23_03_14_41-13310528930982567675
2022/04/23 10:14:42 Console: https://console.cloud.google.com/dataflow/jobs/us-central1/2022-04-23_03_14_41-13310528930982567675?project=apache-beam-testing
2022/04/23 10:14:42 Logs: https://console.cloud.google.com/logs/viewer?project=apache-beam-testing&resource=dataflow_step%2Fjob_id%2F2022-04-23_03_14_41-13310528930982567675
2022/04/23 10:14:42 Job state: JOB_STATE_PENDING ...
2022/04/23 10:15:12 Job still running ...
2022/04/23 10:15:42 Job still running ...
2022/04/23 10:16:12 Job still running ...
2022/04/23 10:16:42 Job still running ...
2022/04/23 10:17:12 Job still running ...
2022/04/23 10:17:43 Failed to execute job: job 2022-04-23_03_14_41-13310528930982567675 failed
panic: Failed to execute job: job 2022-04-23_03_14_41-13310528930982567675 failed
goroutine 1 [running]:
github.com/apache/beam/sdks/v2/go/pkg/beam/log.Fatalf(0x1202f68, 0xc000120000, 0x10e17e5, 0x19, 0xc000417e78, 0x1, 0x1)
<https://ci-beam.apache.org/job/beam_LoadTests_Go_GBK_Dataflow_Batch/ws/src/sdks/go/pkg/beam/log/log.go>:153 +0xec
main.main()
<https://ci-beam.apache.org/job/beam_LoadTests_Go_GBK_Dataflow_Batch/ws/src/sdks/go/test/load/group_by_key/group_by_key.go>:82 +0x418
> Task :sdks:go:test:load:run FAILED
FAILURE: Build failed with an exception.
* Where:
Build file '<https://ci-beam.apache.org/job/beam_LoadTests_Go_GBK_Dataflow_Batch/ws/src/sdks/go/test/load/build.gradle'> line: 31
* What went wrong:
Execution failed for task ':sdks:go:test:load:run'.
> Process 'command 'sh'' finished with non-zero exit value 2
* Try:
> Run with --stacktrace option to get the stack trace.
> Run with --info or --debug option to get more log output.
> Run with --scan to get full insights.
* Get more help at https://help.gradle.org
BUILD FAILED in 3m 19s
12 actionable tasks: 6 executed, 4 from cache, 2 up-to-date
Publishing build scan...
https://gradle.com/s/or2uf66prz7pg
Build step 'Invoke Gradle script' changed build result to FAILURE
Build step 'Invoke Gradle script' marked build as failure
---------------------------------------------------------------------
To unsubscribe, e-mail: builds-unsubscribe@beam.apache.org
For additional commands, e-mail: builds-help@beam.apache.org