You are viewing a plain text version of this content. The canonical link for it is here.
Posted to yarn-dev@hadoop.apache.org by Apache Jenkins Server <je...@builds.apache.org> on 2012/12/18 22:14:08 UTC
Failed: YARN-147 PreCommit Build #233
Jira: https://issues.apache.org/jira/browse/YARN-147
Build: https://builds.apache.org/job/PreCommit-YARN-Build/233/
###################################################################################
########################## LAST 60 LINES OF THE CONSOLE ###########################
Started by user tucu
Building remotely on hadoop4 in workspace /home/jenkins/jenkins-slave/workspace/PreCommit-YARN-Build
Reverting /home/jenkins/jenkins-slave/workspace/PreCommit-YARN-Build/trunk
Updating http://svn.apache.org/repos/asf/hadoop/common/trunk
At revision 1423653
Reverting /home/jenkins/jenkins-slave/workspace/PreCommit-YARN-Build/nightly
Updating http://svn.apache.org/repos/asf/hadoop/nightly
At revision 1423653
no change for http://svn.apache.org/repos/asf/hadoop/common/trunk since the previous build
no change for http://svn.apache.org/repos/asf/hadoop/nightly since the previous build
No emails were triggered.
[PreCommit-YARN-Build] $ /bin/bash /tmp/hudson7750894471623758205.sh
32768
Running in Jenkins mode
======================================================================
======================================================================
Testing patch for YARN-147.
======================================================================
======================================================================
At revision 1423653.
YARN-147 is not "Patch Available". Exiting.
======================================================================
======================================================================
Finished build.
======================================================================
======================================================================
Archiving artifacts
Description set: YARN-147
Recording test results
No test report files were found. Configuration error?
Build step 'Publish JUnit test result report' changed build result to FAILURE
Email was triggered for: Failure
Sending email for trigger: Failure
###################################################################################
############################## FAILED TESTS (if any) ##############################
No tests ran.
Success: YARN-147 PreCommit Build #235
Posted by Apache Jenkins Server <je...@builds.apache.org>.
Jira: https://issues.apache.org/jira/browse/YARN-147
Build: https://builds.apache.org/job/PreCommit-YARN-Build/235/
###################################################################################
########################## LAST 60 LINES OF THE CONSOLE ###########################
[...truncated 2930 lines...]
/bin/kill -9 9856
kill: No such process
NOP
{color:green}+1 overall{color}. Here are the results of testing the latest attachment
http://issues.apache.org/jira/secure/attachment/12561571/YARN-147-v9.patch
against trunk revision .
{color:green}+1 @author{color}. The patch does not contain any @author tags.
{color:green}+1 tests included{color}. The patch appears to include 2 new or modified test files.
{color:green}+1 javac{color}. The applied patch does not increase the total number of javac compiler warnings.
{color:green}+1 javadoc{color}. The javadoc tool did not generate any warning messages.
{color:green}+1 eclipse:eclipse{color}. The patch built with eclipse:eclipse.
{color:green}+1 findbugs{color}. The patch does not introduce any new Findbugs (version 1.3.9) warnings.
{color:green}+1 release audit{color}. The applied patch does not increase the total number of release audit warnings.
{color:green}+1 core tests{color}. The patch passed unit tests in hadoop-yarn-project/hadoop-yarn/hadoop-yarn-common hadoop-yarn-project/hadoop-yarn/hadoop-yarn-server/hadoop-yarn-server-nodemanager.
{color:green}+1 contrib tests{color}. The patch passed contrib unit tests.
Test results: https://builds.apache.org/job/PreCommit-YARN-Build/235//testReport/
Console output: https://builds.apache.org/job/PreCommit-YARN-Build/235//console
This message is automatically generated.
======================================================================
======================================================================
Adding comment to Jira.
======================================================================
======================================================================
Comment added.
47acf56fd6b93aa748c276f929318b6bcfbdee89 logged out
======================================================================
======================================================================
Finished build.
======================================================================
======================================================================
Archiving artifacts
Description set: YARN-147
Recording test results
Email was triggered for: Success
Sending email for trigger: Success
###################################################################################
############################## FAILED TESTS (if any) ##############################
All tests passed
Failed: YARN-272 PreCommit Build #234
Posted by Apache Jenkins Server <je...@builds.apache.org>.
Jira: https://issues.apache.org/jira/browse/YARN-272
Build: https://builds.apache.org/job/PreCommit-YARN-Build/234/
###################################################################################
########################## LAST 60 LINES OF THE CONSOLE ###########################
[...truncated 2731 lines...]
NOP
{color:red}-1 overall{color}. Here are the results of testing the latest attachment
http://issues.apache.org/jira/secure/attachment/12561574/YARN-272-1.patch
against trunk revision .
{color:green}+1 @author{color}. The patch does not contain any @author tags.
{color:red}-1 tests included{color}. The patch doesn't appear to include any new or modified tests.
Please justify why no new tests are needed for this patch.
Also please list what manual steps were performed to verify this patch.
{color:green}+1 javac{color}. The applied patch does not increase the total number of javac compiler warnings.
{color:green}+1 javadoc{color}. The javadoc tool did not generate any warning messages.
{color:green}+1 eclipse:eclipse{color}. The patch built with eclipse:eclipse.
{color:green}+1 findbugs{color}. The patch does not introduce any new Findbugs (version 1.3.9) warnings.
{color:green}+1 release audit{color}. The applied patch does not increase the total number of release audit warnings.
{color:green}+1 core tests{color}. The patch passed unit tests in hadoop-yarn-project/hadoop-yarn/hadoop-yarn-api hadoop-yarn-project/hadoop-yarn/hadoop-yarn-server/hadoop-yarn-server-resourcemanager.
{color:green}+1 contrib tests{color}. The patch passed contrib unit tests.
Test results: https://builds.apache.org/job/PreCommit-YARN-Build/234//testReport/
Console output: https://builds.apache.org/job/PreCommit-YARN-Build/234//console
This message is automatically generated.
======================================================================
======================================================================
Adding comment to Jira.
======================================================================
======================================================================
Comment added.
2cf3994766d77634073b94b5f6277257a8328e02 logged out
======================================================================
======================================================================
Finished build.
======================================================================
======================================================================
Build step 'Execute shell' marked build as failure
Archiving artifacts
[description-setter] Could not determine description.
Recording test results
Email was triggered for: Failure
Sending email for trigger: Failure
###################################################################################
############################## FAILED TESTS (if any) ##############################
All tests passed