You are viewing a plain text version of this content. The canonical link for it is here.
Posted to builds@beam.apache.org by Apache Jenkins Server <je...@builds.apache.org> on 2023/10/12 04:20:28 UTC
Build failed in Jenkins: beam_PostCommit_XVR_Flink #7458
See <https://ci-beam.apache.org/job/beam_PostCommit_XVR_Flink/7458/display/redirect>
Changes:
------------------------------------------
[...truncated 47.96 KB...]
> Task :release:go-licenses:py:docker
#1 [internal] load build definition from Dockerfile
#1 transferring dockerfile: 1.24kB done
#1 DONE 0.0s
#2 [internal] load .dockerignore
#2 transferring context: 2B done
#2 DONE 0.0s
> Task :sdks:java:io:expansion-service:processResources NO-SOURCE
> Task :sdks:java:io:expansion-service:processTestResources NO-SOURCE
> Task :sdks:java:io:expansion-service:spotlessJava FROM-CACHE
> Task :sdks:java:io:expansion-service:spotlessJavaCheck UP-TO-DATE
> Task :sdks:java:io:expansion-service:spotlessCheck UP-TO-DATE
> Task :sdks:python:container:goBuild
/home/jenkins/go/bin/go1.21.2 build -o ./build/target/launcher/linux_amd64/boot boot.go piputil.go
> Task :sdks:java:testing:kafka-service:createCheckerFrameworkManifest
> Task :sdks:java:testing:kafka-service:compileJava NO-SOURCE
> Task :sdks:java:testing:kafka-service:processResources NO-SOURCE
> Task :sdks:java:testing:kafka-service:classes UP-TO-DATE
> Task :release:go-licenses:py:docker
#3 [internal] load metadata for docker.io/library/golang:1.20-bullseye
#3 DONE 0.2s
#4 [internal] load build context
#4 transferring context: 1.96kB done
#4 DONE 0.0s
#5 [1/5] FROM docker.io/library/golang:1.20-bullseye@sha256:a10abe6014fae120db1f525f6dc35692430af86c56fa76347a7ee0d3456f4cf9
#5 resolve docker.io/library/golang:1.20-bullseye@sha256:a10abe6014fae120db1f525f6dc35692430af86c56fa76347a7ee0d3456f4cf9 0.0s done
#5 DONE 0.0s
#6 [2/5] WORKDIR /usr/src/app
#6 CACHED
#7 [3/5] COPY go.mod ./
#7 CACHED
#8 [4/5] RUN go install github.com/google/go-licenses@latest
#8 CACHED
#9 [5/5] COPY get-licenses.sh /opt/apache/beam/
#9 CACHED
#10 exporting to image
#10 exporting layers done
#10 writing image sha256:3dd5752f75a17c4b0b95d8595b28df2f08643b86783734c438bf282f66fef8de 0.0s done
#10 naming to docker.io/library/golicenses-python
#10 naming to docker.io/library/golicenses-python done
#10 DONE 0.0s
> Task :sdks:java:testing:kafka-service:compileTestJava FROM-CACHE
> Task :sdks:java:testing:kafka-service:processTestResources
> Task :sdks:java:testing:kafka-service:testClasses
> Task :sdks:go:container:goBuild
> Task :sdks:java:io:debezium:createCheckerFrameworkManifest
> Task :sdks:java:io:debezium:processResources NO-SOURCE
> Task :sdks:java:io:debezium:expansion-service:createCheckerFrameworkManifest
> Task :sdks:java:io:debezium:expansion-service:processResources NO-SOURCE
> Task :sdks:java:io:debezium:expansion-service:processTestResources NO-SOURCE
> Task :sdks:java:io:debezium:expansion-service:spotlessJava FROM-CACHE
> Task :sdks:java:io:debezium:expansion-service:spotlessJavaCheck UP-TO-DATE
> Task :sdks:java:io:debezium:expansion-service:spotlessCheck UP-TO-DATE
> Task :sdks:java:io:google-cloud-platform:expansion-service:createCheckerFrameworkManifest
> Task :sdks:java:io:google-cloud-platform:expansion-service:processResources NO-SOURCE
> Task :sdks:java:io:google-cloud-platform:expansion-service:processTestResources NO-SOURCE
> Task :sdks:java:io:google-cloud-platform:expansion-service:spotlessJava FROM-CACHE
> Task :sdks:java:io:google-cloud-platform:expansion-service:spotlessJavaCheck UP-TO-DATE
> Task :sdks:java:io:google-cloud-platform:expansion-service:spotlessCheck UP-TO-DATE
> Task :runners:core-construction-java:processTestResources NO-SOURCE
> Task :runners:core-java:processTestResources NO-SOURCE
> Task :runners:flink:1.15:copyTestSourceOverrides
> Task :runners:flink:1.15:copyTestResourcesOverrides NO-SOURCE
> Task :runners:flink:1.15:processTestResources
> Task :runners:portability:java:createCheckerFrameworkManifest
> Task :runners:portability:java:processResources NO-SOURCE
> Task :runners:portability:java:processTestResources NO-SOURCE
> Task :sdks:java:extensions:python:createCheckerFrameworkManifest
> Task :sdks:java:extensions:python:processResources
> Task :sdks:java:extensions:python:processTestResources NO-SOURCE
> Task :sdks:java:extensions:sql:compileJavacc
File "TokenMgrError.java" does not exist. Will create one.
File "ParseException.java" does not exist. Will create one.
File "Token.java" does not exist. Will create one.
File "SimpleCharStream.java" does not exist. Will create one.
Parser generated with 0 errors and 1 warnings.
> Task :sdks:python:container:goBuild FAILED
# command-line-arguments
/home/jenkins/sdk/go1.21.2/pkg/tool/linux_amd64/link: mapping output file failed: no space left on device
> Task :sdks:java:testing:kafka-service:buildTestKafkaServiceJar FAILED
> Task :release:go-licenses:java:dockerRun
-> unzip /go/pkg/mod/cache/download/github.com/apache/beam/@v/v2.51.0+incompatible.zip: write /go/pkg/mod/github.com/apache/beam@v2.51.0+incompatible/runners/flink/src/test/java/org/apache/beam/runners/flink/streaming/TopWikipediaSessionsTest.java: no space left on device
> Task :sdks:java:extensions:sql:createCheckerFrameworkManifest
> Task :sdks:java:extensions:sql:processResources
> Task :sdks:java:container:java8:copySdkHarnessLauncher
> Task :release:go-licenses:java:dockerRun FAILED
go: github.com/apache/beam/sdks/v2/java/container: unzip /go/pkg/mod/cache/download/github.com/apache/beam/sdks/v2/@v/v2.51.0.zip: write /go/pkg/mod/github.com/apache/beam/sdks/v2@v2.51.0/java/core/src/test/java/org/apache/beam/sdk/testing/SourceTestUtilsTest.java: no space left on device
> Task :release:go-licenses:py:dockerRun
+ rm -rf '/output/*'
+ go get github.com/apache/beam/sdks/v2/python/container
go: downloading github.com/apache/beam/sdks/v2 v2.51.0
go: downloading github.com/apache/beam v2.51.0+incompatible
-> unzip /go/pkg/mod/cache/download/github.com/apache/beam/@v/v2.51.0+incompatible.zip: mkdir /go/pkg/mod/github.com/apache/beam@v2.51.0+incompatible: no space left on device
-> unzip /go/pkg/mod/cache/download/github.com/apache/beam/sdks/v2/@v/v2.51.0.zip: mkdir /go/pkg/mod/github.com/apache/beam/sdks/v2@v2.51.0/java/io/azure-cosmos/src/main/java/org/apache/beam: no space left on device
go: github.com/apache/beam/sdks/v2/python/container: unzip /go/pkg/mod/cache/download/github.com/apache/beam/sdks/v2/@v/v2.51.0.zip: mkdir /go/pkg/mod/github.com/apache/beam/sdks/v2@v2.51.0/java/io/azure-cosmos/src/main/java/org/apache/beam: no space left on device
> Task :release:go-licenses:py:dockerRun FAILED
> Task :sdks:python:setupVirtualenv
ERROR: Could not install packages due to an OSError: [Errno 28] No space left on device: '/tmp/pip-unpack-86qom5e2'
> Task :sdks:python:setupVirtualenv FAILED
FAILURE: Build completed with 9 failures.
1: Task failed with an exception.
-----------
* What went wrong:
Execution failed for task ':sdks:java:container:generateLicenseReport'.
> java.lang.reflect.UndeclaredThrowableException (no error message)
* Try:
> Run with --stacktrace option to get the stack trace.
> Run with --info or --debug option to get more log output.
> Get more help at https://help.gradle.org.
==============================================================================
2: Task failed with an exception.
-----------
* What went wrong:
Execution failed for task ':sdks:go:test:goBuild'.
> Process 'command 'sh'' finished with non-zero exit value 1
* Try:
> Run with --stacktrace option to get the stack trace.
> Run with --info or --debug option to get more log output.
> Get more help at https://help.gradle.org.
==============================================================================
3: Task failed with an exception.
-----------
* What went wrong:
Execution failed for task ':model:pipeline:compileJava'.
> Failed to load cache entry 14c1f5b22d3b163c2d2f4742b56b5a1e for task ':model:pipeline:compileJava': Could not load from remote cache: No space left on device
* Try:
> Run with --stacktrace option to get the stack trace.
> Run with --info or --debug option to get more log output.
> Get more help at https://help.gradle.org.
==============================================================================
4: Task failed with an exception.
-----------
* What went wrong:
Execution failed for task ':release:go-licenses:go:dockerRun'.
> Process 'command 'docker'' finished with non-zero exit value 1
* Try:
> Run with --stacktrace option to get the stack trace.
> Run with --info or --debug option to get more log output.
> Get more help at https://help.gradle.org.
==============================================================================
5: Task failed with an exception.
-----------
* What went wrong:
Execution failed for task ':sdks:python:container:goBuild'.
> Process 'command 'sh'' finished with non-zero exit value 1
* Try:
> Run with --stacktrace option to get the stack trace.
> Run with --info or --debug option to get more log output.
> Get more help at https://help.gradle.org.
==============================================================================
6: Task failed with an exception.
-----------
* What went wrong:
Execution failed for task ':sdks:java:testing:kafka-service:buildTestKafkaServiceJar'.
> Failed to load cache entry 0bfc20b30fa0a26d28ac62c90d88e1d7 for task ':sdks:java:testing:kafka-service:buildTestKafkaServiceJar': Could not load from local cache: No space left on device
* Try:
> Run with --stacktrace option to get the stack trace.
> Run with --info or --debug option to get more log output.
> Get more help at https://help.gradle.org.
==============================================================================
7: Task failed with an exception.
-----------
* What went wrong:
Execution failed for task ':release:go-licenses:java:dockerRun'.
> Process 'command 'docker'' finished with non-zero exit value 1
* Try:
> Run with --stacktrace option to get the stack trace.
> Run with --info or --debug option to get more log output.
> Get more help at https://help.gradle.org.
==============================================================================
8: Task failed with an exception.
-----------
* What went wrong:
Execution failed for task ':release:go-licenses:py:dockerRun'.
> Process 'command 'docker'' finished with non-zero exit value 1
* Try:
> Run with --stacktrace option to get the stack trace.
> Run with --info or --debug option to get more log output.
> Get more help at https://help.gradle.org.
==============================================================================
9: Task failed with an exception.
-----------
* What went wrong:
Execution failed for task ':sdks:python:setupVirtualenv'.
> Process 'command 'sh'' finished with non-zero exit value 1
* Try:
> Run with --stacktrace option to get the stack trace.
> Run with --info or --debug option to get more log output.
> Get more help at https://help.gradle.org.
==============================================================================
Deprecated Gradle features were used in this build, making it incompatible with Gradle 9.0.
You can use '--warning-mode all' to show the individual deprecation warnings and determine if they come from your own scripts or plugins.
For more on this, please refer to https://docs.gradle.org/8.3/userguide/command_line_interface.html#sec:command_line_warnings in the Gradle documentation.
BUILD FAILED in 1m 42s
126 actionable tasks: 102 executed, 14 from cache, 10 up-to-date
Publishing build scan...
https://ge.apache.org/s/vcckbivy6zjhg
Build step 'Invoke Gradle script' changed build result to FAILURE
Build step 'Invoke Gradle script' marked build as failure
---------------------------------------------------------------------
To unsubscribe, e-mail: builds-unsubscribe@beam.apache.org
For additional commands, e-mail: builds-help@beam.apache.org
Jenkins build is back to normal : beam_PostCommit_XVR_Flink #7459
Posted by Apache Jenkins Server <je...@builds.apache.org>.
See <https://ci-beam.apache.org/job/beam_PostCommit_XVR_Flink/7459/display/redirect>
---------------------------------------------------------------------
To unsubscribe, e-mail: builds-unsubscribe@beam.apache.org
For additional commands, e-mail: builds-help@beam.apache.org