You are viewing a plain text version of this content. The canonical link for it is here.
Posted to builds@cassandra.apache.org by Apache Jenkins Server <je...@builds.apache.org> on 2021/05/28 03:07:48 UTC

Build complete: Cassandra-4.0 #63 [UNSTABLE] 0d3ead9f556cd3b04830a996518596182e78c3d4

-------------------------------------------------------------------------------
Build Cassandra-4.0 #63 Still unstable
URL: https://ci-cassandra.apache.org/job/Cassandra-4.0/63/
-------------------------------------------------------------------------------
Changes:
No changes

-------------------------------------------------------------------------------
Failed Tests:
3 tests failed.
FAILED:  dtest-offheap.offline_tools_test.TestOfflineTools.test_sstableofflinerelevel
FAILED:  dtest.consistency_test.TestConsistency.test_13880
FAILED:  org.apache.cassandra.cql3.ViewComplexTest.testPartialDeleteSelectedColumnWithFlush[3]

-------------------------------------------------------------------------------
For complete test report and logs see https://nightlies.apache.org/cassandra/Cassandra-4.0/63/