You are viewing a plain text version of this content. The canonical link for it is here.
Posted to commits@sling.apache.org by Apache Jenkins Server <je...@builds.apache.org> on 2016/01/11 23:50:35 UTC
Build failed in Jenkins: sling-trunk-1.7 #3123
See <https://builds.apache.org/job/sling-trunk-1.7/3123/>
------------------------------------------
[...truncated 588960 lines...]
[INFO] Apache Sling Service User Mapper .................. SUCCESS [5.817s]
[INFO] Apache Sling Settings ............................. SUCCESS [6.774s]
[INFO] Apache Sling Web Console Branding ................. SUCCESS [7.267s]
[INFO] Apache Sling Web Console Security Provider ........ SUCCESS [4.747s]
[INFO] Apache Sling Explorer ............................. SUCCESS [8.450s]
[INFO] Apache Sling Health Check Core .................... SUCCESS [14.537s]
[INFO] Apache Sling Health Check Annotations ............. SUCCESS [7.999s]
[INFO] Apache Sling Health Check Samples ................. SUCCESS [11.873s]
[INFO] Apache Sling Health Check Support Components ...... SUCCESS [10.441s]
[INFO] Apache Sling Health Check Webconsole Plugin ....... SUCCESS [9.060s]
[INFO] Apache Sling Health Check JUnit Bridge ............ SUCCESS [10.158s]
[INFO] Apache Sling Health Check Integration Tests ....... SUCCESS [39.765s]
[INFO] Apache Sling Health Check Reactor POM ............. SUCCESS [2.986s]
[INFO] Apache Sling Resource Access Security ............. SUCCESS [7.692s]
[INFO] Apache Sling Test Tools ........................... SUCCESS [20.956s]
[INFO] Apache Sling Resource Access Security Integration Tests SUCCESS [1:51.493s]
[INFO] Apache Sling Validation Framework API ............. SUCCESS [8.031s]
[INFO] Apache Sling Validation Framework Core Implementation SUCCESS [11.005s]
[INFO] Apache Sling Validation Framework Testing Services SUCCESS [11.478s]
[INFO] Apache Sling Validation Framework Integration Tests SUCCESS [1:00.451s]
[INFO] Apache Sling Validation Framework Examples ........ SUCCESS [5.968s]
[INFO] Apache Sling Validation Framework Builder ......... SUCCESS [2.085s]
[INFO] Apache Sling Models API ........................... SUCCESS [7.055s]
[INFO] Apache Sling Models Implementation ................ SUCCESS [10.180s]
[INFO] Apache Sling Models Validation Implementation ..... SUCCESS [10.591s]
[INFO] Apache Sling Models Integration Tests ............. FAILURE [1:04.929s]
[INFO] Apache Sling Internationalization Support ......... SKIPPED
[INFO] Apache Sling XSS Protection Bundle ................ SKIPPED
[INFO] Apache Sling Resource Builder ..................... SKIPPED
[INFO] Apache Sling Testing Hamcrest ..................... SKIPPED
[INFO] Apache Sling JUnit Core ........................... SKIPPED
[INFO] Apache Sling JUnit Scriptable Tests Provider ...... SKIPPED
[INFO] Apache Sling JUnit Health Checks .................. SKIPPED
[INFO] Apache Sling JUnit Remote Tests Runners ........... SKIPPED
[INFO] Apache Sling JUnit Performance .................... SKIPPED
[INFO] Apache Sling JUnit Tests Teleporter ............... SKIPPED
[INFO] Apache Sling Testing Mock Log Configuration ....... SKIPPED
[INFO] Apache Sling Testing Resource Resolver Mock ....... SKIPPED
[INFO] Apache Sling Testing JCR Mock ..................... SKIPPED
[INFO] Apache Sling Testing OSGi Mock .................... SKIPPED
[INFO] Apache Sling Testing Sling Mock ................... SKIPPED
[INFO] Apache Sling Testing Sling Mock Jackrabbit-based Resource Resolver SKIPPED
[INFO] Apache Sling Testing Sling Mock Oak-based Resource Resolver SKIPPED
[INFO] Apache Sling Sample Server-Side Tests ............. SKIPPED
[INFO] Apache Sling Failing Server-Side Tests ............ SKIPPED
[INFO] Apache Sling Sample Integration Tests ............. SKIPPED
[INFO] Apache Sling Testing - sample bundle with integration tests SKIPPED
[INFO] Apache Sling Testing Modules Reactor .............. SKIPPED
[INFO] Apache Sling Installer ............................ SKIPPED
[INFO] Apache Sling File Installer ....................... SKIPPED
[INFO] Apache Sling JCR Installer ........................ SKIPPED
[INFO] Apache Sling Installer Configuration Admin Support SKIPPED
[INFO] Apache Sling Deployment Package Installer ......... SKIPPED
[INFO] Apache Sling Subsystems Installer ................. SKIPPED
[INFO] Apache Sling Installer Integration Tests .......... SKIPPED
[INFO] Apache Sling Launchpad API ........................ SKIPPED
[INFO] Apache Sling Launchpad Base ....................... SKIPPED
[INFO] Apache Sling Launchpad Installer .................. SKIPPED
[INFO] Apache Sling Launchpad Content .................... SKIPPED
[INFO] Apache Sling Launchpad Application Builder ........ SKIPPED
[INFO] Apache Sling Launchpad Testing Services ........... SKIPPED
[INFO] Apache Sling Launchpad Testing Services WAR ....... SKIPPED
[INFO] Apache Sling Launchpad Testing Fragment Bundle .... SKIPPED
[INFO] Apache Sling Launchpad Test Bundles ............... SKIPPED
[INFO] Apache Sling Integration Tests .................... SKIPPED
[INFO] Apache Sling Launchpad Testing .................... SKIPPED
[INFO] Apache Sling (Builder) ............................ SKIPPED
[INFO] ------------------------------------------------------------------------
[INFO] BUILD FAILURE
[INFO] ------------------------------------------------------------------------
[INFO] Total time: 1:58:37.607s
[INFO] Finished at: Mon Jan 11 22:50:10 UTC 2016
[INFO] Final Memory: 179M/391M
[INFO] ------------------------------------------------------------------------
[JENKINS] Archiving disabled
[JENKINS] Archiving disabled
[JENKINS] Archiving disabled
[JENKINS] Archiving disabled
[JENKINS] Archiving disabled
[JENKINS] Archiving disabled
[JENKINS] Archiving disabled
[JENKINS] Archiving disabled
[JENKINS] Archiving disabled
[JENKINS] Archiving disabled
[JENKINS] Archiving disabled
[JENKINS] Archiving disabled
[JENKINS] Archiving disabled
[JENKINS] Archiving disabled
[JENKINS] Archiving disabled
[JENKINS] Archiving disabled
[JENKINS] Archiving disabled
[JENKINS] Archiving disabled
[JENKINS] Archiving disabled
[JENKINS] Archiving disabled
[JENKINS] Archiving disabled
[JENKINS] Archiving disabled
[JENKINS] Archiving disabled
[JENKINS] Archiving disabled
[JENKINS] Archiving disabled
[JENKINS] Archiving disabled
[JENKINS] Archiving disabled
[JENKINS] Archiving disabled
[JENKINS] Archiving disabled
[JENKINS] Archiving disabled
[JENKINS] Archiving disabled
[JENKINS] Archiving disabled
[JENKINS] Archiving disabled
[JENKINS] Archiving disabled
[JENKINS] Archiving disabled
[JENKINS] Archiving disabled
[JENKINS] Archiving disabled
[JENKINS] Archiving disabled
[JENKINS] Archiving disabled
[JENKINS] Archiving disabled
[JENKINS] Archiving disabled
[JENKINS] Archiving disabled
[JENKINS] Archiving disabled
[JENKINS] Archiving disabled
[JENKINS] Archiving disabled
[JENKINS] Archiving disabled
[JENKINS] Archiving disabled
[JENKINS] Archiving disabled
[JENKINS] Archiving disabled
[JENKINS] Archiving disabled
[JENKINS] Archiving disabled
[JENKINS] Archiving disabled
[JENKINS] Archiving disabled
[JENKINS] Archiving disabled
[JENKINS] Archiving disabled
[JENKINS] Archiving disabled
[JENKINS] Archiving disabled
[JENKINS] Archiving disabled
[JENKINS] Archiving disabled
[JENKINS] Archiving disabled
[JENKINS] Archiving disabled
[JENKINS] Archiving disabled
[JENKINS] Archiving disabled
[JENKINS] Archiving disabled
[JENKINS] Archiving disabled
[JENKINS] Archiving disabled
[JENKINS] Archiving disabled
[JENKINS] Archiving disabled
[JENKINS] Archiving disabled
[JENKINS] Archiving disabled
[JENKINS] Archiving disabled
[JENKINS] Archiving disabled
[JENKINS] Archiving disabled
[JENKINS] Archiving disabled
[JENKINS] Archiving disabled
[JENKINS] Archiving disabled
[JENKINS] Archiving disabled
[JENKINS] Archiving disabled
[JENKINS] Archiving disabled
[JENKINS] Archiving disabled
[JENKINS] Archiving disabled
[JENKINS] Archiving disabled
[JENKINS] Archiving disabled
[JENKINS] Archiving disabled
[JENKINS] Archiving disabled
[JENKINS] Archiving disabled
[JENKINS] Archiving disabled
[JENKINS] Archiving disabled
[JENKINS] Archiving disabled
[JENKINS] Archiving disabled
[JENKINS] Archiving disabled
[JENKINS] Archiving disabled
[JENKINS] Archiving disabled
[JENKINS] Archiving disabled
[JENKINS] Archiving disabled
[JENKINS] Archiving disabled
[JENKINS] Archiving disabled
[JENKINS] Archiving disabled
[JENKINS] Archiving disabled
[JENKINS] Archiving disabled
[JENKINS] Archiving disabled
[JENKINS] Archiving disabled
[JENKINS] Archiving disabled
[JENKINS] Archiving disabled
[JENKINS] Archiving disabled
[JENKINS] Archiving disabled
[JENKINS] Archiving disabled
[JENKINS] Archiving disabled
[JENKINS] Archiving disabled
[JENKINS] Archiving disabled
[JENKINS] Archiving disabled
[JENKINS] Archiving disabled
[JENKINS] Archiving disabled
[JENKINS] Archiving disabled
[JENKINS] Archiving disabled
[JENKINS] Archiving disabled
[JENKINS] Archiving disabled
[JENKINS] Archiving disabled
[JENKINS] Archiving disabled
[JENKINS] Archiving disabled
[JENKINS] Archiving disabled
[JENKINS] Archiving disabled
[JENKINS] Archiving disabled
[JENKINS] Archiving disabled
[JENKINS] Archiving disabled
[JENKINS] Archiving disabled
[JENKINS] Archiving disabled
[JENKINS] Archiving disabled
[JENKINS] Archiving disabled
[JENKINS] Archiving disabled
[JENKINS] Archiving disabled
[JENKINS] Archiving disabled
[JENKINS] Archiving disabled
[JENKINS] Archiving disabled
[JENKINS] Archiving disabled
[JENKINS] Archiving disabled
[JENKINS] Archiving disabled
[JENKINS] Archiving disabled
[JENKINS] Archiving disabled
[JENKINS] Archiving disabled
[JENKINS] Archiving disabled
[JENKINS] Archiving disabled
[JENKINS] Archiving disabled
Waiting for Jenkins to finish collecting data
[ERROR] Failed to execute goal org.apache.maven.plugins:maven-failsafe-plugin:2.18.1:integration-test (integration-test) on project org.apache.sling.models.integration-tests: Execution integration-test of goal org.apache.maven.plugins:maven-failsafe-plugin:2.18.1:integration-test failed: There was an error in the forked process
[ERROR] java.lang.AssertionError: Server not ready after 60 seconds, giving up
[ERROR] at org.junit.Assert.fail(Assert.java:88)
[ERROR] at org.apache.sling.testing.tools.sling.SlingTestBase.waitForServerReady(SlingTestBase.java:326)
[ERROR] at org.apache.sling.testing.tools.sling.SlingTestBase.startServerIfNeeded(SlingTestBase.java:169)
[ERROR] at org.apache.sling.testing.tools.sling.SlingTestBase.getServerBaseUrl(SlingTestBase.java:231)
[ERROR] at org.apache.sling.models.it.RemoteIT.getJunitServletUrl(RemoteIT.java:28)
[ERROR] at org.apache.sling.junit.remote.testrunner.SlingRemoteTestRunner.maybeExecuteTests(SlingRemoteTestRunner.java:95)
[ERROR] at org.apache.sling.junit.remote.testrunner.SlingRemoteTestRunner.getChildren(SlingRemoteTestRunner.java:138)
[ERROR] at org.junit.runners.ParentRunner.getFilteredChildren(ParentRunner.java:426)
[ERROR] at org.junit.runners.ParentRunner.getDescription(ParentRunner.java:351)
[ERROR] at org.junit.runners.Suite.describeChild(Suite.java:123)
[ERROR] at org.junit.runners.Suite.describeChild(Suite.java:27)
[ERROR] at org.junit.runners.ParentRunner.getDescription(ParentRunner.java:352)
[ERROR] at org.apache.maven.surefire.common.junit4.JUnit4ProviderUtil.createSuiteDescription(JUnit4ProviderUtil.java:113)
[ERROR] at org.apache.maven.surefire.junit4.JUnit4Provider.createTestsDescription(JUnit4Provider.java:257)
[ERROR] at org.apache.maven.surefire.junit4.JUnit4Provider.invoke(JUnit4Provider.java:124)
[ERROR] at org.apache.maven.surefire.booter.ForkedBooter.invokeProviderInSameClassLoader(ForkedBooter.java:203)
[ERROR] at org.apache.maven.surefire.booter.ForkedBooter.runSuitesInProcess(ForkedBooter.java:155)
[ERROR] at org.apache.maven.surefire.booter.ForkedBooter.main(ForkedBooter.java:103)
[ERROR] -> [Help 1]
[ERROR]
[ERROR] To see the full stack trace of the errors, re-run Maven with the -e switch.
[ERROR] Re-run Maven using the -X switch to enable full debug logging.
[ERROR]
[ERROR] For more information about the errors and possible solutions, please read the following articles:
[ERROR] [Help 1] http://cwiki.apache.org/confluence/display/MAVEN/PluginExecutionException
[ERROR]
[ERROR] After correcting the problems, you can resume the build with the command
[ERROR] mvn <goals> -rf :org.apache.sling.models.integration-tests
channel stopped
Jenkins build is back to stable : sling-trunk-1.7 #3128
Posted by Apache Jenkins Server <je...@builds.apache.org>.
See <https://builds.apache.org/job/sling-trunk-1.7/3128/>
Jenkins build is still unstable: sling-trunk-1.7 #3127
Posted by Apache Jenkins Server <je...@builds.apache.org>.
See <https://builds.apache.org/job/sling-trunk-1.7/changes>
Jenkins build is still unstable: sling-trunk-1.7 #3126
Posted by Apache Jenkins Server <je...@builds.apache.org>.
See <https://builds.apache.org/job/sling-trunk-1.7/changes>
Jenkins build is still unstable: sling-trunk-1.7 #3125
Posted by Apache Jenkins Server <je...@builds.apache.org>.
See <https://builds.apache.org/job/sling-trunk-1.7/changes>
Jenkins build is unstable: sling-trunk-1.7 #3124
Posted by Apache Jenkins Server <je...@builds.apache.org>.
See <https://builds.apache.org/job/sling-trunk-1.7/3124/>