You are viewing a plain text version of this content. The canonical link for it is here.
Posted to builds@beam.apache.org by Apache Jenkins Server <je...@builds.apache.org> on 2019/11/22 18:58:01 UTC

Build failed in Jenkins: beam_PostCommit_Python36 #1061

See <https://builds.apache.org/job/beam_PostCommit_Python36/1061/display/redirect>

Changes:


------------------------------------------
[...truncated 519.92 KB...]
INFO:apache_beam.runners.worker.sdk_worker:State channel established.
INFO:apache_beam.runners.worker.data_plane:Creating client data channel for localhost:33201
19/11/22 18:08:53 INFO org.apache.beam.runners.fnexecution.data.GrpcDataService: Beam Fn Data client connected.
19/11/22 18:08:53 WARN org.apache.beam.runners.spark.translation.GroupNonMergingWindowsFunctions: Either coder LengthPrefixCoder(ByteArrayCoder) or GlobalWindow$Coder is not consistent with equals. That might cause issues on some runners.
WARNING:apache_beam.io.filebasedsink:Deleting 4 existing files in target path matching: -*-of-%(num_shards)05d
19/11/22 18:09:13 INFO org.apache.beam.runners.spark.SparkPipelineRunner: Job BeamApp-jenkins-1122180848-c0082cd3_352a08b3-06a9-4b43-8980-1c8c81a77a83: Pipeline translated successfully. Computing outputs
INFO:apache_beam.io.filebasedsink:Starting finalize_write threads with num_shards: 4 (skipped: 0), batches: 4, num_threads: 4
INFO:apache_beam.io.filebasedsink:Renamed 4 shards in 0.10 seconds.
19/11/22 18:09:32 INFO org.apache.beam.runners.spark.SparkPipelineRunner: Job BeamApp-jenkins-1122180848-c0082cd3_352a08b3-06a9-4b43-8980-1c8c81a77a83 finished.
19/11/22 18:09:32 WARN org.apache.beam.runners.spark.SparkPipelineResult$BatchMode: Collecting monitoring infos is not implemented yet in Spark portable runner.
19/11/22 18:09:32 INFO org.apache.beam.runners.fnexecution.artifact.AbstractArtifactRetrievalService: Manifest at /tmp/beam-tempdjvkwd9s/artifacts5mj61m03/job_4a3d0a53-c286-4b1a-b38b-6df6e8fbf18a/MANIFEST has 1 artifact locations
19/11/22 18:09:32 INFO org.apache.beam.runners.fnexecution.artifact.BeamFileSystemArtifactStagingService: Removed dir /tmp/beam-tempdjvkwd9s/artifacts5mj61m03/job_4a3d0a53-c286-4b1a-b38b-6df6e8fbf18a/
INFO:apache_beam.runners.portability.portable_runner:Job state changed to DONE
19/11/22 18:09:32 INFO org.apache.beam.runners.fnexecution.jobsubmission.InMemoryJobService: Getting job metrics for BeamApp-jenkins-1122180848-c0082cd3_352a08b3-06a9-4b43-8980-1c8c81a77a83
19/11/22 18:09:32 INFO org.apache.beam.runners.fnexecution.jobsubmission.InMemoryJobService: Finished getting job metrics for BeamApp-jenkins-1122180848-c0082cd3_352a08b3-06a9-4b43-8980-1c8c81a77a83
ERROR:apache_beam.runners.worker.data_plane:Failed to read inputs in the data plane.
Traceback (most recent call last):
  File "<https://builds.apache.org/job/beam_PostCommit_Python36/ws/src/sdks/python/apache_beam/runners/worker/data_plane.py",> line 272, in _read_inputs
    for elements in elements_iterator:
  File "<https://builds.apache.org/job/beam_PostCommit_Python36/ws/src/build/gradleenv/2022703440/lib/python3.6/site-packages/grpc/_channel.py",> line 392, in __next__
    return self._next()
  File "<https://builds.apache.org/job/beam_PostCommit_Python36/ws/src/build/gradleenv/2022703440/lib/python3.6/site-packages/grpc/_channel.py",> line 561, in _next
    raise self
grpc._channel._Rendezvous: <_Rendezvous of RPC that terminated with:
	status = StatusCode.UNAVAILABLE
	details = "Socket closed"
	debug_error_string = "{"created":"@1574446172.580346068","description":"Error received from peer ipv4:127.0.0.1:33201","file":"src/core/lib/surface/call.cc","file_line":1055,"grpc_message":"Socket closed","grpc_status":14}"
>
Exception in thread read_state:
Traceback (most recent call last):
  File "/usr/lib/python3.6/threading.py", line 916, in _bootstrap_inner
    self.run()
  File "/usr/lib/python3.6/threading.py", line 864, in run
    self._target(*self._args, **self._kwargs)
  File "<https://builds.apache.org/job/beam_PostCommit_Python36/ws/src/sdks/python/apache_beam/runners/worker/sdk_worker.py",> line 532, in pull_responses
    for response in responses:
  File "<https://builds.apache.org/job/beam_PostCommit_Python36/ws/src/build/gradleenv/2022703440/lib/python3.6/site-packages/grpc/_channel.py",> line 392, in __next__
    return self._next()
  File "<https://builds.apache.org/job/beam_PostCommit_Python36/ws/src/build/gradleenv/2022703440/lib/python3.6/site-packages/grpc/_channel.py",> line 561, in _next
    raise self
grpc._channel._Rendezvous: <_Rendezvous of RPC that terminated with:
	status = StatusCode.UNAVAILABLE
	details = "Socket closed"
	debug_error_string = "{"created":"@1574446172.580369727","description":"Error received from peer ipv4:127.0.0.1:45331","file":"src/core/lib/surface/call.cc","file_line":1055,"grpc_message":"Socket closed","grpc_status":14}"
>

Exception in thread run_worker_1-1:
Traceback (most recent call last):
  File "/usr/lib/python3.6/threading.py", line 916, in _bootstrap_inner
    self.run()
  File "/usr/lib/python3.6/threading.py", line 864, in run
    self._target(*self._args, **self._kwargs)
  File "<https://builds.apache.org/job/beam_PostCommit_Python36/ws/src/sdks/python/apache_beam/runners/worker/sdk_worker.py",> line 111, in run
    for work_request in control_stub.Control(get_responses()):
  File "<https://builds.apache.org/job/beam_PostCommit_Python36/ws/src/build/gradleenv/2022703440/lib/python3.6/site-packages/grpc/_channel.py",> line 392, in __next__
    return self._next()
  File "<https://builds.apache.org/job/beam_PostCommit_Python36/ws/src/build/gradleenv/2022703440/lib/python3.6/site-packages/grpc/_channel.py",> line 561, in _next
    raise self
grpc._channel._Rendezvous: <_Rendezvous of RPC that terminated with:
	status = StatusCode.UNAVAILABLE
	details = "Socket closed"
	debug_error_string = "{"created":"@1574446172.580397633","description":"Error received from peer ipv4:127.0.0.1:46665","file":"src/core/lib/surface/call.cc","file_line":1055,"grpc_message":"Socket closed","grpc_status":14}"
>

Exception in thread read_grpc_client_inputs:
Traceback (most recent call last):
  File "/usr/lib/python3.6/threading.py", line 916, in _bootstrap_inner
    self.run()
  File "/usr/lib/python3.6/threading.py", line 864, in run
    self._target(*self._args, **self._kwargs)
  File "<https://builds.apache.org/job/beam_PostCommit_Python36/ws/src/sdks/python/apache_beam/runners/worker/data_plane.py",> line 286, in <lambda>
    target=lambda: self._read_inputs(elements_iterator),
  File "<https://builds.apache.org/job/beam_PostCommit_Python36/ws/src/sdks/python/apache_beam/runners/worker/data_plane.py",> line 272, in _read_inputs
    for elements in elements_iterator:
  File "<https://builds.apache.org/job/beam_PostCommit_Python36/ws/src/build/gradleenv/2022703440/lib/python3.6/site-packages/grpc/_channel.py",> line 392, in __next__
    return self._next()
  File "<https://builds.apache.org/job/beam_PostCommit_Python36/ws/src/build/gradleenv/2022703440/lib/python3.6/site-packages/grpc/_channel.py",> line 561, in _next
    raise self
grpc._channel._Rendezvous: <_Rendezvous of RPC that terminated with:
	status = StatusCode.UNAVAILABLE
	details = "Socket closed"
	debug_error_string = "{"created":"@1574446172.580346068","description":"Error received from peer ipv4:127.0.0.1:33201","file":"src/core/lib/surface/call.cc","file_line":1055,"grpc_message":"Socket closed","grpc_status":14}"
>


> Task :sdks:python:test-suites:portable:py36:postCommitPy36

> Task :sdks:python:test-suites:dataflow:py36:postCommitIT
Worker logs: https://console.cloud.google.com/dataflow/jobsDetail/locations/us-central1/jobs/2019-11-22_10_06_52-5518167836157395988?project=apache-beam-testing
<https://builds.apache.org/job/beam_PostCommit_Python36/ws/src/sdks/python/apache_beam/io/gcp/bigquery.py>:1214: BeamDeprecationWarning: options is deprecated since First stable release. References to <pipeline>.options will not be supported
Worker logs: https://console.cloud.google.com/dataflow/jobsDetail/locations/us-central1/jobs/2019-11-22_10_21_47-13802602764746568050?project=apache-beam-testing
  experiments = p.options.view_as(DebugOptions).experiments or []
Worker logs: https://console.cloud.google.com/dataflow/jobsDetail/locations/us-central1/jobs/2019-11-22_10_29_28-17645876010391401419?project=apache-beam-testing
Worker logs: https://console.cloud.google.com/dataflow/jobsDetail/locations/us-central1/jobs/2019-11-22_10_37_32-17888862983565431161?project=apache-beam-testing
Worker logs: https://console.cloud.google.com/dataflow/jobsDetail/locations/us-central1/jobs/2019-11-22_10_46_26-16230479961457879182?project=apache-beam-testing
Worker logs: https://console.cloud.google.com/dataflow/jobsDetail/locations/us-central1/jobs/2019-11-22_10_06_50-5948186472376123733?project=apache-beam-testing
<https://builds.apache.org/job/beam_PostCommit_Python36/ws/src/sdks/python/apache_beam/runners/dataflow/dataflow_runner.py>:726: BeamDeprecationWarning: BigQuerySink is deprecated since 2.11.0. Use WriteToBigQuery instead.
Worker logs: https://console.cloud.google.com/dataflow/jobsDetail/locations/us-central1/jobs/2019-11-22_10_28_35-1686825617076961640?project=apache-beam-testing
  kms_key=transform.kms_key))
Worker logs: https://console.cloud.google.com/dataflow/jobsDetail/locations/us-central1/jobs/2019-11-22_10_45_33-13512559371014220352?project=apache-beam-testing
<https://builds.apache.org/job/beam_PostCommit_Python36/ws/src/sdks/python/apache_beam/io/gcp/bigquery.py>:1211: BeamDeprecationWarning: options is deprecated since First stable release. References to <pipeline>.options will not be supported
  self.table_reference.projectId = pcoll.pipeline.options.view_as(
Worker logs: https://console.cloud.google.com/dataflow/jobsDetail/locations/us-central1/jobs/2019-11-22_10_06_52-6790265014738583877?project=apache-beam-testing
Worker logs: https://console.cloud.google.com/dataflow/jobsDetail/locations/us-central1/jobs/2019-11-22_10_19_41-14183225308929635758?project=apache-beam-testing
<https://builds.apache.org/job/beam_PostCommit_Python36/ws/src/sdks/python/apache_beam/io/gcp/bigquery.py>:1214: BeamDeprecationWarning: options is deprecated since First stable release. References to <pipeline>.options will not be supported
Worker logs: https://console.cloud.google.com/dataflow/jobsDetail/locations/us-central1/jobs/2019-11-22_10_28_50-5541414631833692584?project=apache-beam-testing
  experiments = p.options.view_as(DebugOptions).experiments or []
Worker logs: https://console.cloud.google.com/dataflow/jobsDetail/locations/us-central1/jobs/2019-11-22_10_37_36-17439039356843345446?project=apache-beam-testing
<https://builds.apache.org/job/beam_PostCommit_Python36/ws/src/sdks/python/apache_beam/runners/dataflow/dataflow_runner.py>:726: BeamDeprecationWarning: BigQuerySink is deprecated since 2.11.0. Use WriteToBigQuery instead.
  kms_key=transform.kms_key))
<https://builds.apache.org/job/beam_PostCommit_Python36/ws/src/sdks/python/apache_beam/runners/dataflow/dataflow_runner.py>:726: BeamDeprecationWarning: BigQuerySink is deprecated since 2.11.0. Use WriteToBigQuery instead.
  kms_key=transform.kms_key))
<https://builds.apache.org/job/beam_PostCommit_Python36/ws/src/sdks/python/apache_beam/runners/dataflow/dataflow_runner.py>:726: BeamDeprecationWarning: BigQuerySink is deprecated since 2.11.0. Use WriteToBigQuery instead.
  kms_key=transform.kms_key))
Worker logs: https://console.cloud.google.com/dataflow/jobsDetail/locations/us-central1/jobs/2019-11-22_10_46_17-4563842955817740203?project=apache-beam-testing
Worker logs: https://console.cloud.google.com/dataflow/jobsDetail/locations/us-central1/jobs/2019-11-22_10_06_49-5938532816039564636?project=apache-beam-testing
<https://builds.apache.org/job/beam_PostCommit_Python36/ws/src/sdks/python/apache_beam/io/gcp/bigquery.py>:1214: BeamDeprecationWarning: options is deprecated since First stable release. References to <pipeline>.options will not be supported
Worker logs: https://console.cloud.google.com/dataflow/jobsDetail/locations/us-central1/jobs/2019-11-22_10_25_36-2163971056049974244?project=apache-beam-testing
Worker logs: https://console.cloud.google.com/dataflow/jobsDetail/locations/us-central1/jobs/2019-11-22_10_35_19-6232165532067863861?project=apache-beam-testing
  experiments = p.options.view_as(DebugOptions).experiments or []
<https://builds.apache.org/job/beam_PostCommit_Python36/ws/src/sdks/python/apache_beam/io/gcp/bigquery_file_loads.py>:797: BeamDeprecationWarning: options is deprecated since First stable release. References to <pipeline>.options will not be supported
  temp_location = p.options.view_as(GoogleCloudOptions).temp_location
Worker logs: https://console.cloud.google.com/dataflow/jobsDetail/locations/us-central1/jobs/2019-11-22_10_44_50-8169677278483136197?project=apache-beam-testing
<https://builds.apache.org/job/beam_PostCommit_Python36/ws/src/sdks/python/apache_beam/io/fileio_test.py>:296: FutureWarning: MatchAll is experimental.
  | 'GetPath' >> beam.Map(lambda metadata: metadata.path))
<https://builds.apache.org/job/beam_PostCommit_Python36/ws/src/sdks/python/apache_beam/io/fileio_test.py>:307: FutureWarning: MatchAll is experimental.
  | 'Checksums' >> beam.Map(compute_hash))
<https://builds.apache.org/job/beam_PostCommit_Python36/ws/src/sdks/python/apache_beam/io/fileio_test.py>:307: FutureWarning: ReadMatches is experimental.
  | 'Checksums' >> beam.Map(compute_hash))
Worker logs: https://console.cloud.google.com/dataflow/jobsDetail/locations/us-central1/jobs/2019-11-22_10_06_49-15456026374770223412?project=apache-beam-testing
<https://builds.apache.org/job/beam_PostCommit_Python36/ws/src/sdks/python/apache_beam/io/gcp/bigquery.py>:1214: BeamDeprecationWarning: options is deprecated since First stable release. References to <pipeline>.options will not be supported
Worker logs: https://console.cloud.google.com/dataflow/jobsDetail/locations/us-central1/jobs/2019-11-22_10_17_01-15116004952399931100?project=apache-beam-testing
  experiments = p.options.view_as(DebugOptions).experiments or []
Worker logs: https://console.cloud.google.com/dataflow/jobsDetail/locations/us-central1/jobs/2019-11-22_10_28_19-396436179678044965?project=apache-beam-testing
<https://builds.apache.org/job/beam_PostCommit_Python36/ws/src/sdks/python/apache_beam/io/gcp/bigquery_file_loads.py>:797: BeamDeprecationWarning: options is deprecated since First stable release. References to <pipeline>.options will not be supported
Worker logs: https://console.cloud.google.com/dataflow/jobsDetail/locations/us-central1/jobs/2019-11-22_10_36_51-2352061867539093685?project=apache-beam-testing
  temp_location = p.options.view_as(GoogleCloudOptions).temp_location
<https://builds.apache.org/job/beam_PostCommit_Python36/ws/src/sdks/python/apache_beam/io/gcp/bigquery.py>:1214: BeamDeprecationWarning: options is deprecated since First stable release. References to <pipeline>.options will not be supported
  experiments = p.options.view_as(DebugOptions).experiments or []
<https://builds.apache.org/job/beam_PostCommit_Python36/ws/src/sdks/python/apache_beam/io/gcp/bigquery_file_loads.py>:797: BeamDeprecationWarning: options is deprecated since First stable release. References to <pipeline>.options will not be supported
  temp_location = p.options.view_as(GoogleCloudOptions).temp_location
Worker logs: https://console.cloud.google.com/dataflow/jobsDetail/locations/us-central1/jobs/2019-11-22_10_06_48-3453244843193046705?project=apache-beam-testing
<https://builds.apache.org/job/beam_PostCommit_Python36/ws/src/sdks/python/apache_beam/runners/dataflow/dataflow_runner.py>:726: BeamDeprecationWarning: BigQuerySink is deprecated since 2.11.0. Use WriteToBigQuery instead.
  kms_key=transform.kms_key))
Worker logs: https://console.cloud.google.com/dataflow/jobsDetail/locations/us-central1/jobs/2019-11-22_10_15_05-17267255560389856444?project=apache-beam-testing
<https://builds.apache.org/job/beam_PostCommit_Python36/ws/src/sdks/python/apache_beam/io/gcp/bigquery_test.py>:651: BeamDeprecationWarning: options is deprecated since First stable release. References to <pipeline>.options will not be supported
Worker logs: https://console.cloud.google.com/dataflow/jobsDetail/locations/us-central1/jobs/2019-11-22_10_24_11-14948734392864744255?project=apache-beam-testing
  streaming = self.test_pipeline.options.view_as(StandardOptions).streaming
Worker logs: https://console.cloud.google.com/dataflow/jobsDetail/locations/us-central1/jobs/2019-11-22_10_33_36-960414059384537161?project=apache-beam-testing
<https://builds.apache.org/job/beam_PostCommit_Python36/ws/src/sdks/python/apache_beam/io/gcp/bigquery.py>:1214: BeamDeprecationWarning: options is deprecated since First stable release. References to <pipeline>.options will not be supported
Worker logs: https://console.cloud.google.com/dataflow/jobsDetail/locations/us-central1/jobs/2019-11-22_10_41_42-5734246545643961658?project=apache-beam-testing
  experiments = p.options.view_as(DebugOptions).experiments or []
Worker logs: https://console.cloud.google.com/dataflow/jobsDetail/locations/us-central1/jobs/2019-11-22_10_06_53-3886645332790709579?project=apache-beam-testing
Worker logs: https://console.cloud.google.com/dataflow/jobsDetail/locations/us-central1/jobs/2019-11-22_10_16_00-4891036902094357126?project=apache-beam-testing
Worker logs: https://console.cloud.google.com/dataflow/jobsDetail/locations/us-central1/jobs/2019-11-22_10_23_49-9984700458784992472?project=apache-beam-testing
Worker logs: https://console.cloud.google.com/dataflow/jobsDetail/locations/us-central1/jobs/2019-11-22_10_32_33-8488499603414051500?project=apache-beam-testing
Worker logs: https://console.cloud.google.com/dataflow/jobsDetail/locations/us-central1/jobs/2019-11-22_10_41_01-5914822310755152998?project=apache-beam-testing
Worker logs: https://console.cloud.google.com/dataflow/jobsDetail/locations/us-central1/jobs/2019-11-22_10_49_25-8287504904503748532?project=apache-beam-testing
<https://builds.apache.org/job/beam_PostCommit_Python36/ws/src/sdks/python/apache_beam/runners/dataflow/dataflow_runner.py>:726: BeamDeprecationWarning: BigQuerySink is deprecated since 2.11.0. Use WriteToBigQuery instead.
  kms_key=transform.kms_key))
Worker logs: https://console.cloud.google.com/dataflow/jobsDetail/locations/us-central1/jobs/2019-11-22_10_06_50-14038523926361224687?project=apache-beam-testing
Worker logs: https://console.cloud.google.com/dataflow/jobsDetail/locations/us-central1/jobs/2019-11-22_10_16_10-4595811570192444313?project=apache-beam-testing
<https://builds.apache.org/job/beam_PostCommit_Python36/ws/src/sdks/python/apache_beam/runners/dataflow/dataflow_runner.py>:726: BeamDeprecationWarning: BigQuerySink is deprecated since 2.11.0. Use WriteToBigQuery instead.
Worker logs: https://console.cloud.google.com/dataflow/jobsDetail/locations/us-central1/jobs/2019-11-22_10_24_38-11718288350650389864?project=apache-beam-testing
  kms_key=transform.kms_key))
Worker logs: https://console.cloud.google.com/dataflow/jobsDetail/locations/us-central1/jobs/2019-11-22_10_33_09-7881270764410508657?project=apache-beam-testing
<https://builds.apache.org/job/beam_PostCommit_Python36/ws/src/sdks/python/apache_beam/runners/dataflow/dataflow_runner.py>:726: BeamDeprecationWarning: BigQuerySink is deprecated since 2.11.0. Use WriteToBigQuery instead.
Worker logs: https://console.cloud.google.com/dataflow/jobsDetail/locations/us-central1/jobs/2019-11-22_10_42_25-9717087576976472367?project=apache-beam-testing
  kms_key=transform.kms_key))
<https://builds.apache.org/job/beam_PostCommit_Python36/ws/src/sdks/python/apache_beam/io/gcp/big_query_query_to_table_pipeline.py>:73: BeamDeprecationWarning: BigQuerySink is deprecated since 2.11.0. Use WriteToBigQuery instead.
  kms_key=kms_key))
test_datastore_wordcount_it (apache_beam.examples.cookbook.datastore_wordcount_it_test.DatastoreWordCountIT) ... SKIP: This test still needs to be fixed on Python 3TODO: BEAM-4543
test_avro_it (apache_beam.examples.fastavro_it_test.FastavroIT) ... SKIP: Due to a known issue in avro-python3 package, thistest is skipped until BEAM-6522 is addressed. 
test_bigquery_tornadoes_it (apache_beam.examples.cookbook.bigquery_tornadoes_it_test.BigqueryTornadoesIT) ... ok
test_streaming_wordcount_it (apache_beam.examples.streaming_wordcount_it_test.StreamingWordCountIT) ... ok
test_wordcount_fnapi_it (apache_beam.examples.wordcount_it_test.WordCountIT) ... ok
test_autocomplete_it (apache_beam.examples.complete.autocomplete_test.AutocompleteTest) ... ok
test_leader_board_it (apache_beam.examples.complete.game.leader_board_it_test.LeaderBoardIT) ... ok
test_game_stats_it (apache_beam.examples.complete.game.game_stats_it_test.GameStatsIT) ... ok
test_wordcount_it (apache_beam.examples.wordcount_it_test.WordCountIT) ... ok
test_user_score_it (apache_beam.examples.complete.game.user_score_it_test.UserScoreIT) ... ok
test_hourly_team_score_it (apache_beam.examples.complete.game.hourly_team_score_it_test.HourlyTeamScoreIT) ... ok
test_bigquery_read_1M_python (apache_beam.io.gcp.bigquery_io_read_it_test.BigqueryIOReadIT) ... ok
test_multiple_destinations_transform (apache_beam.io.gcp.bigquery_test.BigQueryStreamingInsertTransformIntegrationTests) ... ok
test_datastore_write_limit (apache_beam.io.gcp.datastore_write_it_test.DatastoreWriteIT) ... SKIP: This test still needs to be fixed on Python 3TODO: BEAM-4543
test_copy (apache_beam.io.gcp.gcsio_integration_test.GcsIOIntegrationTest) ... ok
test_copy_batch (apache_beam.io.gcp.gcsio_integration_test.GcsIOIntegrationTest) ... ok
test_copy_batch_kms (apache_beam.io.gcp.gcsio_integration_test.GcsIOIntegrationTest) ... ok
test_copy_batch_rewrite_token (apache_beam.io.gcp.gcsio_integration_test.GcsIOIntegrationTest) ... ok
test_copy_kms (apache_beam.io.gcp.gcsio_integration_test.GcsIOIntegrationTest) ... ok
test_copy_rewrite_token (apache_beam.io.gcp.gcsio_integration_test.GcsIOIntegrationTest) ... ok
test_value_provider_transform (apache_beam.io.gcp.bigquery_test.BigQueryStreamingInsertTransformIntegrationTests) ... ok
test_bqfl_streaming (apache_beam.io.gcp.bigquery_file_loads_test.BigQueryFileLoadsIT) ... SKIP: TestStream is not supported on TestDataflowRunner
test_multiple_destinations_transform (apache_beam.io.gcp.bigquery_file_loads_test.BigQueryFileLoadsIT) ... ok
test_one_job_fails_all_jobs_fail (apache_beam.io.gcp.bigquery_file_loads_test.BigQueryFileLoadsIT) ... ok
test_big_query_read (apache_beam.io.gcp.bigquery_read_it_test.BigQueryReadIntegrationTests) ... ok
test_big_query_read_new_types (apache_beam.io.gcp.bigquery_read_it_test.BigQueryReadIntegrationTests) ... ok
test_transform_on_gcs (apache_beam.io.fileio_test.MatchIntegrationTest) ... ok
test_file_loads (apache_beam.io.gcp.bigquery_test.PubSubBigQueryIT) ... SKIP: https://issuetracker.google.com/issues/118375066
test_streaming_inserts (apache_beam.io.gcp.bigquery_test.PubSubBigQueryIT) ... ok
test_parquetio_it (apache_beam.io.parquetio_it_test.TestParquetIT) ... ok
test_streaming_data_only (apache_beam.io.gcp.pubsub_integration_test.PubSubIntegrationTest) ... ok
test_streaming_with_attributes (apache_beam.io.gcp.pubsub_integration_test.PubSubIntegrationTest) ... ok
test_big_query_legacy_sql (apache_beam.io.gcp.big_query_query_to_table_it_test.BigQueryQueryToTableIT) ... ok
test_big_query_new_types (apache_beam.io.gcp.big_query_query_to_table_it_test.BigQueryQueryToTableIT) ... ok
test_big_query_standard_sql (apache_beam.io.gcp.big_query_query_to_table_it_test.BigQueryQueryToTableIT) ... ok
test_big_query_standard_sql_kms_key_native (apache_beam.io.gcp.big_query_query_to_table_it_test.BigQueryQueryToTableIT) ... ok
Runs streaming Dataflow job and verifies that user metrics are reported ... ok
test_job_python_from_python_it (apache_beam.transforms.external_test_it.ExternalTransformIT) ... ok
test_big_query_write (apache_beam.io.gcp.bigquery_write_it_test.BigQueryWriteIntegrationTests) ... ok
test_big_query_write_new_types (apache_beam.io.gcp.bigquery_write_it_test.BigQueryWriteIntegrationTests) ... ok
test_big_query_write_schema_autodetect (apache_beam.io.gcp.bigquery_write_it_test.BigQueryWriteIntegrationTests) ... SKIP: DataflowRunner does not support schema autodetection
test_big_query_write_without_schema (apache_beam.io.gcp.bigquery_write_it_test.BigQueryWriteIntegrationTests) ... ok
test_metrics_fnapi_it (apache_beam.runners.dataflow.dataflow_exercise_metrics_pipeline_test.ExerciseMetricsPipelineTest) ... ok
test_metrics_it (apache_beam.runners.dataflow.dataflow_exercise_metrics_pipeline_test.ExerciseMetricsPipelineTest) ... ok
test_datastore_write_limit (apache_beam.io.gcp.datastore.v1new.datastore_write_it_test.DatastoreWriteIT) ... ok

----------------------------------------------------------------------
XML: nosetests-postCommitIT-df-py36.xml
----------------------------------------------------------------------
XML: <https://builds.apache.org/job/beam_PostCommit_Python36/ws/src/sdks/python/nosetests.xml>
----------------------------------------------------------------------
Ran 45 tests in 3086.758s

OK (SKIP=6)

FAILURE: Build failed with an exception.

* What went wrong:
Execution failed for task ':sdks:python:test-suites:direct:py36:installGcpTest'.
> Process 'command 'sh'' finished with non-zero exit value 1

* Try:
Run with --stacktrace option to get the stack trace. Run with --info or --debug option to get more log output. Run with --scan to get full insights.

* Get more help at https://help.gradle.org

Deprecated Gradle features were used in this build, making it incompatible with Gradle 6.0.
Use '--warning-mode all' to show the individual deprecation warnings.
See https://docs.gradle.org/5.2.1/userguide/command_line_interface.html#sec:command_line_warnings

BUILD FAILED in 52m 35s
82 actionable tasks: 61 executed, 21 from cache

Publishing build scan...
https://gradle.com/s/p2rjhd7u5tcgw

Build step 'Invoke Gradle script' changed build result to FAILURE
Build step 'Invoke Gradle script' marked build as failure

---------------------------------------------------------------------
To unsubscribe, e-mail: builds-unsubscribe@beam.apache.org
For additional commands, e-mail: builds-help@beam.apache.org


Jenkins build is back to normal : beam_PostCommit_Python36 #1064

Posted by Apache Jenkins Server <je...@builds.apache.org>.
See <https://builds.apache.org/job/beam_PostCommit_Python36/1064/display/redirect>


---------------------------------------------------------------------
To unsubscribe, e-mail: builds-unsubscribe@beam.apache.org
For additional commands, e-mail: builds-help@beam.apache.org


beam_PostCommit_Python36 - Build # 1063 - Aborted

Posted by Apache Jenkins Server <je...@builds.apache.org>.
The Apache Jenkins build system has built beam_PostCommit_Python36 (build #1063)

Status: Aborted

Check console output at https://builds.apache.org/job/beam_PostCommit_Python36/1063/ to view the results.

beam_PostCommit_Python36 - Build # 1062 - Aborted

Posted by Apache Jenkins Server <je...@builds.apache.org>.
The Apache Jenkins build system has built beam_PostCommit_Python36 (build #1062)

Status: Aborted

Check console output at https://builds.apache.org/job/beam_PostCommit_Python36/1062/ to view the results.