You are viewing a plain text version of this content. The canonical link for it is here.
Posted to builds@solr.apache.org by Policeman Jenkins Server <je...@thetaphi.de> on 2022/04/07 23:00:41 UTC

[JENKINS] Solr-main-Linux (64bit/jdk-16.0.2) - Build # 3960 - Unstable!

Build: https://jenkins.thetaphi.de/job/Solr-main-Linux/3960/
Java: 64bit/jdk-16.0.2 -XX:+UseCompressedOops -XX:+UseSerialGC

3 tests failed.
FAILED:  org.apache.solr.handler.designer.TestSchemaDesignerSettingsDAO.classMethod

Error Message:
com.carrotsearch.randomizedtesting.ThreadLeakError: 1 thread leaked from SUITE scope at org.apache.solr.handler.designer.TestSchemaDesignerSettingsDAO: 
   1) Thread[id=3501, name=ZKEventListenerThread, state=TIMED_WAITING, group=TGRP-TestSchemaDesignerSettingsDAO]
        at java.base@16.0.2/java.lang.Thread.sleep(Native Method)
        at app//org.apache.solr.common.cloud.ZkCmdExecutor.retryDelay(ZkCmdExecutor.java:161)
        at app//org.apache.solr.common.cloud.ZkCmdExecutor.retryOperation(ZkCmdExecutor.java:82)
        at app//org.apache.solr.common.cloud.SolrZkClient.exists(SolrZkClient.java:328)
        at app//org.apache.solr.cloud.ZkController.pathExists(ZkController.java:1228)
        at app//org.apache.solr.cloud.ZkSolrResourceLoader.openResource(ZkSolrResourceLoader.java:73)
        at app//org.apache.lucene.analysis.AbstractAnalysisFactory.getSnowballWordSet(AbstractAnalysisFactory.java:321)
        at app//org.apache.lucene.analysis.en.AbstractWordsFileFilterFactory.inform(AbstractWordsFileFilterFactory.java:90)
        at app//org.apache.solr.core.SolrResourceLoader.informAware(SolrResourceLoader.java:762)
        at app//org.apache.solr.schema.ManagedIndexSchema.informResourceLoaderAwareObjectsInChain(ManagedIndexSchema.java:1470)
        at app//org.apache.solr.schema.ManagedIndexSchema.informResourceLoaderAwareObjectsForFieldType(ManagedIndexSchema.java:1319)
        at app//org.apache.solr.schema.ManagedIndexSchema.postReadInform(ManagedIndexSchema.java:1307)
        at app//org.apache.solr.schema.IndexSchema.readSchema(IndexSchema.java:654)
        at app//org.apache.solr.schema.IndexSchema.<init>(IndexSchema.java:188)
        at app//org.apache.solr.schema.ManagedIndexSchema.<init>(ManagedIndexSchema.java:119)
        at app//org.apache.solr.schema.ManagedIndexSchemaFactory.create(ManagedIndexSchemaFactory.java:279)
        at app//org.apache.solr.schema.ManagedIndexSchemaFactory.create(ManagedIndexSchemaFactory.java:51)
        at app//org.apache.solr.core.ConfigSetService.createIndexSchema(ConfigSetService.java:342)
        at app//org.apache.solr.core.ConfigSetService.lambda$loadConfigSet$0(ConfigSetService.java:253)
        at app//org.apache.solr.core.ConfigSetService$$Lambda$373/0x00000008010b8e10.get(Unknown Source)
        at app//org.apache.solr.core.ConfigSet.<init>(ConfigSet.java:49)
        at app//org.apache.solr.core.ConfigSetService.loadConfigSet(ConfigSetService.java:249)
        at app//org.apache.solr.core.CoreContainer.reload(CoreContainer.java:1850)
        at app//org.apache.solr.core.SolrCore.lambda$getConfListener$21(SolrCore.java:3394)
        at app//org.apache.solr.core.SolrCore$$Lambda$990/0x000000080155b9d8.run(Unknown Source)
        at app//org.apache.solr.cloud.ZkController.lambda$fireEventListeners$18(ZkController.java:2761)
        at app//org.apache.solr.cloud.ZkController$$Lambda$1404/0x00000008017969b0.run(Unknown Source)
        at java.base@16.0.2/java.lang.Thread.run(Thread.java:831)

Stack Trace:
com.carrotsearch.randomizedtesting.ThreadLeakError: 1 thread leaked from SUITE scope at org.apache.solr.handler.designer.TestSchemaDesignerSettingsDAO: 
   1) Thread[id=3501, name=ZKEventListenerThread, state=TIMED_WAITING, group=TGRP-TestSchemaDesignerSettingsDAO]
        at java.base@16.0.2/java.lang.Thread.sleep(Native Method)
        at app//org.apache.solr.common.cloud.ZkCmdExecutor.retryDelay(ZkCmdExecutor.java:161)
        at app//org.apache.solr.common.cloud.ZkCmdExecutor.retryOperation(ZkCmdExecutor.java:82)
        at app//org.apache.solr.common.cloud.SolrZkClient.exists(SolrZkClient.java:328)
        at app//org.apache.solr.cloud.ZkController.pathExists(ZkController.java:1228)
        at app//org.apache.solr.cloud.ZkSolrResourceLoader.openResource(ZkSolrResourceLoader.java:73)
        at app//org.apache.lucene.analysis.AbstractAnalysisFactory.getSnowballWordSet(AbstractAnalysisFactory.java:321)
        at app//org.apache.lucene.analysis.en.AbstractWordsFileFilterFactory.inform(AbstractWordsFileFilterFactory.java:90)
        at app//org.apache.solr.core.SolrResourceLoader.informAware(SolrResourceLoader.java:762)
        at app//org.apache.solr.schema.ManagedIndexSchema.informResourceLoaderAwareObjectsInChain(ManagedIndexSchema.java:1470)
        at app//org.apache.solr.schema.ManagedIndexSchema.informResourceLoaderAwareObjectsForFieldType(ManagedIndexSchema.java:1319)
        at app//org.apache.solr.schema.ManagedIndexSchema.postReadInform(ManagedIndexSchema.java:1307)
        at app//org.apache.solr.schema.IndexSchema.readSchema(IndexSchema.java:654)
        at app//org.apache.solr.schema.IndexSchema.<init>(IndexSchema.java:188)
        at app//org.apache.solr.schema.ManagedIndexSchema.<init>(ManagedIndexSchema.java:119)
        at app//org.apache.solr.schema.ManagedIndexSchemaFactory.create(ManagedIndexSchemaFactory.java:279)
        at app//org.apache.solr.schema.ManagedIndexSchemaFactory.create(ManagedIndexSchemaFactory.java:51)
        at app//org.apache.solr.core.ConfigSetService.createIndexSchema(ConfigSetService.java:342)
        at app//org.apache.solr.core.ConfigSetService.lambda$loadConfigSet$0(ConfigSetService.java:253)
        at app//org.apache.solr.core.ConfigSetService$$Lambda$373/0x00000008010b8e10.get(Unknown Source)
        at app//org.apache.solr.core.ConfigSet.<init>(ConfigSet.java:49)
        at app//org.apache.solr.core.ConfigSetService.loadConfigSet(ConfigSetService.java:249)
        at app//org.apache.solr.core.CoreContainer.reload(CoreContainer.java:1850)
        at app//org.apache.solr.core.SolrCore.lambda$getConfListener$21(SolrCore.java:3394)
        at app//org.apache.solr.core.SolrCore$$Lambda$990/0x000000080155b9d8.run(Unknown Source)
        at app//org.apache.solr.cloud.ZkController.lambda$fireEventListeners$18(ZkController.java:2761)
        at app//org.apache.solr.cloud.ZkController$$Lambda$1404/0x00000008017969b0.run(Unknown Source)
        at java.base@16.0.2/java.lang.Thread.run(Thread.java:831)
	at __randomizedtesting.SeedInfo.seed([AC9F7039E7A6C8C2]:0)


FAILED:  org.apache.solr.schema.TestBulkSchemaConcurrent.classMethod

Error Message:
com.carrotsearch.randomizedtesting.ThreadLeakError: 2 threads leaked from SUITE scope at org.apache.solr.schema.TestBulkSchemaConcurrent: 
   1) Thread[id=21079, name=searcherExecutor-12789-thread-1-processing-127.0.0.1:42303_, state=WAITING, group=TGRP-TestBulkSchemaConcurrent]
        at java.base@16.0.2/jdk.internal.misc.Unsafe.park(Native Method)
        at java.base@16.0.2/java.util.concurrent.locks.LockSupport.park(LockSupport.java:211)
        at java.base@16.0.2/java.util.concurrent.locks.AbstractQueuedSynchronizer.acquire(AbstractQueuedSynchronizer.java:714)
        at java.base@16.0.2/java.util.concurrent.locks.AbstractQueuedSynchronizer.acquireSharedInterruptibly(AbstractQueuedSynchronizer.java:1046)
        at java.base@16.0.2/java.util.concurrent.CountDownLatch.await(CountDownLatch.java:232)
        at app//org.apache.solr.core.SolrCore.lambda$new$2(SolrCore.java:1142)
        at app//org.apache.solr.core.SolrCore$$Lambda$445/0x000000080116f5a8.call(Unknown Source)
        at java.base@16.0.2/java.util.concurrent.FutureTask.run(FutureTask.java:264)
        at app//org.apache.solr.common.util.ExecutorUtil$MDCAwareThreadPoolExecutor.lambda$execute$0(ExecutorUtil.java:259)
        at app//org.apache.solr.common.util.ExecutorUtil$MDCAwareThreadPoolExecutor$$Lambda$307/0x000000080105c8a8.run(Unknown Source)
        at java.base@16.0.2/java.util.concurrent.ThreadPoolExecutor.runWorker(ThreadPoolExecutor.java:1130)
        at java.base@16.0.2/java.util.concurrent.ThreadPoolExecutor$Worker.run(ThreadPoolExecutor.java:630)
        at java.base@16.0.2/java.lang.Thread.run(Thread.java:831)
   2) Thread[id=20995, name=ZKEventListenerThread, state=TIMED_WAITING, group=TGRP-TestBulkSchemaConcurrent]
        at java.base@16.0.2/java.lang.Thread.sleep(Native Method)
        at app//org.apache.solr.common.cloud.ZkCmdExecutor.retryDelay(ZkCmdExecutor.java:161)
        at app//org.apache.solr.common.cloud.ZkCmdExecutor.retryOperation(ZkCmdExecutor.java:82)
        at app//org.apache.solr.common.cloud.SolrZkClient.exists(SolrZkClient.java:328)
        at app//org.apache.solr.schema.ManagedIndexSchemaFactory.lookupZKManagedSchemaPath(ManagedIndexSchemaFactory.java:125)
        at app//org.apache.solr.schema.ZkIndexSchemaReader.<init>(ZkIndexSchemaReader.java:56)
        at app//org.apache.solr.schema.ManagedIndexSchemaFactory.inform(ManagedIndexSchemaFactory.java:537)
        at app//org.apache.solr.core.SolrResourceLoader.inform(SolrResourceLoader.java:728)
        at app//org.apache.solr.core.SolrCore.<init>(SolrCore.java:1155)
        at app//org.apache.solr.core.SolrCore.reload(SolrCore.java:780)
        at app//org.apache.solr.core.CoreContainer.reload(CoreContainer.java:1857)
        at app//org.apache.solr.core.SolrCore.lambda$getConfListener$21(SolrCore.java:3394)
        at app//org.apache.solr.core.SolrCore$$Lambda$990/0x000000080155b9d8.run(Unknown Source)
        at app//org.apache.solr.cloud.ZkController.lambda$fireEventListeners$18(ZkController.java:2761)
        at app//org.apache.solr.cloud.ZkController$$Lambda$1404/0x00000008017969b0.run(Unknown Source)
        at java.base@16.0.2/java.lang.Thread.run(Thread.java:831)

Stack Trace:
com.carrotsearch.randomizedtesting.ThreadLeakError: 2 threads leaked from SUITE scope at org.apache.solr.schema.TestBulkSchemaConcurrent: 
   1) Thread[id=21079, name=searcherExecutor-12789-thread-1-processing-127.0.0.1:42303_, state=WAITING, group=TGRP-TestBulkSchemaConcurrent]
        at java.base@16.0.2/jdk.internal.misc.Unsafe.park(Native Method)
        at java.base@16.0.2/java.util.concurrent.locks.LockSupport.park(LockSupport.java:211)
        at java.base@16.0.2/java.util.concurrent.locks.AbstractQueuedSynchronizer.acquire(AbstractQueuedSynchronizer.java:714)
        at java.base@16.0.2/java.util.concurrent.locks.AbstractQueuedSynchronizer.acquireSharedInterruptibly(AbstractQueuedSynchronizer.java:1046)
        at java.base@16.0.2/java.util.concurrent.CountDownLatch.await(CountDownLatch.java:232)
        at app//org.apache.solr.core.SolrCore.lambda$new$2(SolrCore.java:1142)
        at app//org.apache.solr.core.SolrCore$$Lambda$445/0x000000080116f5a8.call(Unknown Source)
        at java.base@16.0.2/java.util.concurrent.FutureTask.run(FutureTask.java:264)
        at app//org.apache.solr.common.util.ExecutorUtil$MDCAwareThreadPoolExecutor.lambda$execute$0(ExecutorUtil.java:259)
        at app//org.apache.solr.common.util.ExecutorUtil$MDCAwareThreadPoolExecutor$$Lambda$307/0x000000080105c8a8.run(Unknown Source)
        at java.base@16.0.2/java.util.concurrent.ThreadPoolExecutor.runWorker(ThreadPoolExecutor.java:1130)
        at java.base@16.0.2/java.util.concurrent.ThreadPoolExecutor$Worker.run(ThreadPoolExecutor.java:630)
        at java.base@16.0.2/java.lang.Thread.run(Thread.java:831)
   2) Thread[id=20995, name=ZKEventListenerThread, state=TIMED_WAITING, group=TGRP-TestBulkSchemaConcurrent]
        at java.base@16.0.2/java.lang.Thread.sleep(Native Method)
        at app//org.apache.solr.common.cloud.ZkCmdExecutor.retryDelay(ZkCmdExecutor.java:161)
        at app//org.apache.solr.common.cloud.ZkCmdExecutor.retryOperation(ZkCmdExecutor.java:82)
        at app//org.apache.solr.common.cloud.SolrZkClient.exists(SolrZkClient.java:328)
        at app//org.apache.solr.schema.ManagedIndexSchemaFactory.lookupZKManagedSchemaPath(ManagedIndexSchemaFactory.java:125)
        at app//org.apache.solr.schema.ZkIndexSchemaReader.<init>(ZkIndexSchemaReader.java:56)
        at app//org.apache.solr.schema.ManagedIndexSchemaFactory.inform(ManagedIndexSchemaFactory.java:537)
        at app//org.apache.solr.core.SolrResourceLoader.inform(SolrResourceLoader.java:728)
        at app//org.apache.solr.core.SolrCore.<init>(SolrCore.java:1155)
        at app//org.apache.solr.core.SolrCore.reload(SolrCore.java:780)
        at app//org.apache.solr.core.CoreContainer.reload(CoreContainer.java:1857)
        at app//org.apache.solr.core.SolrCore.lambda$getConfListener$21(SolrCore.java:3394)
        at app//org.apache.solr.core.SolrCore$$Lambda$990/0x000000080155b9d8.run(Unknown Source)
        at app//org.apache.solr.cloud.ZkController.lambda$fireEventListeners$18(ZkController.java:2761)
        at app//org.apache.solr.cloud.ZkController$$Lambda$1404/0x00000008017969b0.run(Unknown Source)
        at java.base@16.0.2/java.lang.Thread.run(Thread.java:831)
	at __randomizedtesting.SeedInfo.seed([AC9F7039E7A6C8C2]:0)


FAILED:  org.apache.solr.search.TestMainQueryCaching.testConstantScoreNonScoreSort

Error Message:
java.lang.AssertionError: Bad full sort count expected:<1> but was:<0>

Stack Trace:
java.lang.AssertionError: Bad full sort count expected:<1> but was:<0>
	at __randomizedtesting.SeedInfo.seed([AC9F7039E7A6C8C2:1A73DF0380CB4E5F]:0)
	at org.junit.Assert.fail(Assert.java:89)
	at org.junit.Assert.failNotEquals(Assert.java:835)
	at org.junit.Assert.assertEquals(Assert.java:647)
	at org.apache.solr.search.TestMainQueryCaching.assertMetricCounts(TestMainQueryCaching.java:379)
	at org.apache.solr.search.TestMainQueryCaching.assertMetricCounts(TestMainQueryCaching.java:355)
	at org.apache.solr.search.TestMainQueryCaching.testConstantScoreNonScoreSort(TestMainQueryCaching.java:204)
	at java.base/jdk.internal.reflect.NativeMethodAccessorImpl.invoke0(Native Method)
	at java.base/jdk.internal.reflect.NativeMethodAccessorImpl.invoke(NativeMethodAccessorImpl.java:78)
	at java.base/jdk.internal.reflect.DelegatingMethodAccessorImpl.invoke(DelegatingMethodAccessorImpl.java:43)
	at java.base/java.lang.reflect.Method.invoke(Method.java:567)
	at com.carrotsearch.randomizedtesting.RandomizedRunner.invoke(RandomizedRunner.java:1758)
	at com.carrotsearch.randomizedtesting.RandomizedRunner$8.evaluate(RandomizedRunner.java:946)
	at com.carrotsearch.randomizedtesting.RandomizedRunner$9.evaluate(RandomizedRunner.java:982)
	at com.carrotsearch.randomizedtesting.RandomizedRunner$10.evaluate(RandomizedRunner.java:996)
	at com.carrotsearch.randomizedtesting.rules.SystemPropertiesRestoreRule$1.evaluate(SystemPropertiesRestoreRule.java:57)
	at org.junit.rules.RunRules.evaluate(RunRules.java:20)
	at org.apache.lucene.util.TestRuleSetupTeardownChained$1.evaluate(TestRuleSetupTeardownChained.java:44)
	at org.apache.lucene.util.AbstractBeforeAfterRule$1.evaluate(AbstractBeforeAfterRule.java:43)
	at org.apache.lucene.util.TestRuleThreadAndTestName$1.evaluate(TestRuleThreadAndTestName.java:45)
	at org.apache.lucene.util.TestRuleIgnoreAfterMaxFailures$1.evaluate(TestRuleIgnoreAfterMaxFailures.java:60)
	at org.apache.lucene.util.TestRuleMarkFailure$1.evaluate(TestRuleMarkFailure.java:44)
	at org.junit.rules.RunRules.evaluate(RunRules.java:20)
	at com.carrotsearch.randomizedtesting.rules.StatementAdapter.evaluate(StatementAdapter.java:36)
	at com.carrotsearch.randomizedtesting.ThreadLeakControl$StatementRunner.run(ThreadLeakControl.java:375)
	at com.carrotsearch.randomizedtesting.ThreadLeakControl.forkTimeoutingTask(ThreadLeakControl.java:824)
	at com.carrotsearch.randomizedtesting.ThreadLeakControl$3.evaluate(ThreadLeakControl.java:475)
	at com.carrotsearch.randomizedtesting.RandomizedRunner.runSingleTest(RandomizedRunner.java:955)
	at com.carrotsearch.randomizedtesting.RandomizedRunner$5.evaluate(RandomizedRunner.java:840)
	at com.carrotsearch.randomizedtesting.RandomizedRunner$6.evaluate(RandomizedRunner.java:891)
	at com.carrotsearch.randomizedtesting.RandomizedRunner$7.evaluate(RandomizedRunner.java:902)
	at com.carrotsearch.randomizedtesting.rules.StatementAdapter.evaluate(StatementAdapter.java:36)
	at org.apache.lucene.util.AbstractBeforeAfterRule$1.evaluate(AbstractBeforeAfterRule.java:43)
	at org.apache.lucene.util.AbstractBeforeAfterRule$1.evaluate(AbstractBeforeAfterRule.java:43)
	at com.carrotsearch.randomizedtesting.rules.SystemPropertiesRestoreRule$1.evaluate(SystemPropertiesRestoreRule.java:57)
	at org.junit.rules.RunRules.evaluate(RunRules.java:20)
	at org.apache.lucene.util.AbstractBeforeAfterRule$1.evaluate(AbstractBeforeAfterRule.java:43)
	at com.carrotsearch.randomizedtesting.rules.StatementAdapter.evaluate(StatementAdapter.java:36)
	at org.apache.lucene.util.TestRuleStoreClassName$1.evaluate(TestRuleStoreClassName.java:38)
	at com.carrotsearch.randomizedtesting.rules.NoShadowingOrOverridesOnMethodsRule$1.evaluate(NoShadowingOrOverridesOnMethodsRule.java:40)
	at com.carrotsearch.randomizedtesting.rules.NoShadowingOrOverridesOnMethodsRule$1.evaluate(NoShadowingOrOverridesOnMethodsRule.java:40)
	at com.carrotsearch.randomizedtesting.rules.StatementAdapter.evaluate(StatementAdapter.java:36)
	at com.carrotsearch.randomizedtesting.rules.StatementAdapter.evaluate(StatementAdapter.java:36)
	at org.apache.lucene.util.TestRuleAssertionsRequired$1.evaluate(TestRuleAssertionsRequired.java:53)
	at org.apache.lucene.util.AbstractBeforeAfterRule$1.evaluate(AbstractBeforeAfterRule.java:43)
	at org.apache.lucene.util.TestRuleMarkFailure$1.evaluate(TestRuleMarkFailure.java:44)
	at org.apache.lucene.util.TestRuleIgnoreAfterMaxFailures$1.evaluate(TestRuleIgnoreAfterMaxFailures.java:60)
	at org.apache.lucene.util.TestRuleIgnoreTestSuites$1.evaluate(TestRuleIgnoreTestSuites.java:47)
	at org.junit.rules.RunRules.evaluate(RunRules.java:20)
	at com.carrotsearch.randomizedtesting.rules.StatementAdapter.evaluate(StatementAdapter.java:36)
	at com.carrotsearch.randomizedtesting.ThreadLeakControl$StatementRunner.run(ThreadLeakControl.java:375)
	at com.carrotsearch.randomizedtesting.ThreadLeakControl.lambda$forkTimeoutingTask$0(ThreadLeakControl.java:831)
	at java.base/java.lang.Thread.run(Thread.java:831)

[JENKINS-EA] Solr-main-Linux (64bit/jdk-19-ea+14) - Build # 3961 - Still Unstable!

Posted by Policeman Jenkins Server <je...@thetaphi.de>.
Build: https://jenkins.thetaphi.de/job/Solr-main-Linux/3961/
Java: 64bit/jdk-19-ea+14 -XX:-UseCompressedOops -XX:+UseParallelGC

1 tests failed.
FAILED:  org.apache.solr.schema.TestBulkSchemaConcurrent.classMethod

Error Message:
com.carrotsearch.randomizedtesting.ThreadLeakError: 2 threads leaked from SUITE scope at org.apache.solr.schema.TestBulkSchemaConcurrent: 
   1) Thread[id=19955, name=ZKEventListenerThread, state=TIMED_WAITING, group=TGRP-TestBulkSchemaConcurrent]
        at java.base@19-ea/java.lang.Thread.sleep(Native Method)
        at app//org.apache.solr.common.cloud.ZkCmdExecutor.retryDelay(ZkCmdExecutor.java:161)
        at app//org.apache.solr.common.cloud.ZkCmdExecutor.retryOperation(ZkCmdExecutor.java:82)
        at app//org.apache.solr.common.cloud.SolrZkClient.exists(SolrZkClient.java:328)
        at app//org.apache.solr.rest.ManagedResourceStorage$ZooKeeperStorageIO.openInputStream(ManagedResourceStorage.java:275)
        at app//org.apache.solr.rest.ManagedResourceStorage.load(ManagedResourceStorage.java:505)
        at app//org.apache.solr.rest.RestManager$RestManagerManagedResource.reloadFromStorage(RestManager.java:426)
        at app//org.apache.solr.rest.ManagedResource.loadManagedDataAndNotify(ManagedResource.java:81)
        at app//org.apache.solr.rest.RestManager.init(RestManager.java:580)
        at app//org.apache.solr.core.SolrCore.initRestManager(SolrCore.java:3208)
        at app//org.apache.solr.core.SolrCore.<init>(SolrCore.java:1151)
        at app//org.apache.solr.core.SolrCore.reload(SolrCore.java:780)
        at app//org.apache.solr.core.CoreContainer.reload(CoreContainer.java:1857)
        at app//org.apache.solr.core.SolrCore.lambda$getConfListener$21(SolrCore.java:3394)
        at app//org.apache.solr.core.SolrCore$$Lambda$991/0x00000008014520b8.run(Unknown Source)
        at app//org.apache.solr.cloud.ZkController.lambda$fireEventListeners$18(ZkController.java:2761)
        at app//org.apache.solr.cloud.ZkController$$Lambda$1421/0x00000008015d57b0.run(Unknown Source)
        at java.base@19-ea/java.lang.Thread.run(Thread.java:828)
   2) Thread[id=20006, name=searcherExecutor-12111-thread-1-processing-127.0.0.1:42265_mu%2Fhv, state=WAITING, group=TGRP-TestBulkSchemaConcurrent]
        at java.base@19-ea/jdk.internal.misc.Unsafe.park(Native Method)
        at java.base@19-ea/java.util.concurrent.locks.LockSupport.park(LockSupport.java:211)
        at java.base@19-ea/java.util.concurrent.locks.AbstractQueuedSynchronizer.acquire(AbstractQueuedSynchronizer.java:715)
        at java.base@19-ea/java.util.concurrent.locks.AbstractQueuedSynchronizer.acquireSharedInterruptibly(AbstractQueuedSynchronizer.java:1047)
        at java.base@19-ea/java.util.concurrent.CountDownLatch.await(CountDownLatch.java:230)
        at app//org.apache.solr.core.SolrCore.lambda$new$2(SolrCore.java:1142)
        at app//org.apache.solr.core.SolrCore$$Lambda$448/0x0000000801171868.call(Unknown Source)
        at java.base@19-ea/java.util.concurrent.FutureTask.run(FutureTask.java:264)
        at app//org.apache.solr.common.util.ExecutorUtil$MDCAwareThreadPoolExecutor.lambda$execute$0(ExecutorUtil.java:259)
        at app//org.apache.solr.common.util.ExecutorUtil$MDCAwareThreadPoolExecutor$$Lambda$309/0x0000000801025000.run(Unknown Source)
        at java.base@19-ea/java.util.concurrent.ThreadPoolExecutor.runWorker(ThreadPoolExecutor.java:1136)
        at java.base@19-ea/java.util.concurrent.ThreadPoolExecutor$Worker.run(ThreadPoolExecutor.java:635)
        at java.base@19-ea/java.lang.Thread.run(Thread.java:828)

Stack Trace:
com.carrotsearch.randomizedtesting.ThreadLeakError: 2 threads leaked from SUITE scope at org.apache.solr.schema.TestBulkSchemaConcurrent: 
   1) Thread[id=19955, name=ZKEventListenerThread, state=TIMED_WAITING, group=TGRP-TestBulkSchemaConcurrent]
        at java.base@19-ea/java.lang.Thread.sleep(Native Method)
        at app//org.apache.solr.common.cloud.ZkCmdExecutor.retryDelay(ZkCmdExecutor.java:161)
        at app//org.apache.solr.common.cloud.ZkCmdExecutor.retryOperation(ZkCmdExecutor.java:82)
        at app//org.apache.solr.common.cloud.SolrZkClient.exists(SolrZkClient.java:328)
        at app//org.apache.solr.rest.ManagedResourceStorage$ZooKeeperStorageIO.openInputStream(ManagedResourceStorage.java:275)
        at app//org.apache.solr.rest.ManagedResourceStorage.load(ManagedResourceStorage.java:505)
        at app//org.apache.solr.rest.RestManager$RestManagerManagedResource.reloadFromStorage(RestManager.java:426)
        at app//org.apache.solr.rest.ManagedResource.loadManagedDataAndNotify(ManagedResource.java:81)
        at app//org.apache.solr.rest.RestManager.init(RestManager.java:580)
        at app//org.apache.solr.core.SolrCore.initRestManager(SolrCore.java:3208)
        at app//org.apache.solr.core.SolrCore.<init>(SolrCore.java:1151)
        at app//org.apache.solr.core.SolrCore.reload(SolrCore.java:780)
        at app//org.apache.solr.core.CoreContainer.reload(CoreContainer.java:1857)
        at app//org.apache.solr.core.SolrCore.lambda$getConfListener$21(SolrCore.java:3394)
        at app//org.apache.solr.core.SolrCore$$Lambda$991/0x00000008014520b8.run(Unknown Source)
        at app//org.apache.solr.cloud.ZkController.lambda$fireEventListeners$18(ZkController.java:2761)
        at app//org.apache.solr.cloud.ZkController$$Lambda$1421/0x00000008015d57b0.run(Unknown Source)
        at java.base@19-ea/java.lang.Thread.run(Thread.java:828)
   2) Thread[id=20006, name=searcherExecutor-12111-thread-1-processing-127.0.0.1:42265_mu%2Fhv, state=WAITING, group=TGRP-TestBulkSchemaConcurrent]
        at java.base@19-ea/jdk.internal.misc.Unsafe.park(Native Method)
        at java.base@19-ea/java.util.concurrent.locks.LockSupport.park(LockSupport.java:211)
        at java.base@19-ea/java.util.concurrent.locks.AbstractQueuedSynchronizer.acquire(AbstractQueuedSynchronizer.java:715)
        at java.base@19-ea/java.util.concurrent.locks.AbstractQueuedSynchronizer.acquireSharedInterruptibly(AbstractQueuedSynchronizer.java:1047)
        at java.base@19-ea/java.util.concurrent.CountDownLatch.await(CountDownLatch.java:230)
        at app//org.apache.solr.core.SolrCore.lambda$new$2(SolrCore.java:1142)
        at app//org.apache.solr.core.SolrCore$$Lambda$448/0x0000000801171868.call(Unknown Source)
        at java.base@19-ea/java.util.concurrent.FutureTask.run(FutureTask.java:264)
        at app//org.apache.solr.common.util.ExecutorUtil$MDCAwareThreadPoolExecutor.lambda$execute$0(ExecutorUtil.java:259)
        at app//org.apache.solr.common.util.ExecutorUtil$MDCAwareThreadPoolExecutor$$Lambda$309/0x0000000801025000.run(Unknown Source)
        at java.base@19-ea/java.util.concurrent.ThreadPoolExecutor.runWorker(ThreadPoolExecutor.java:1136)
        at java.base@19-ea/java.util.concurrent.ThreadPoolExecutor$Worker.run(ThreadPoolExecutor.java:635)
        at java.base@19-ea/java.lang.Thread.run(Thread.java:828)
	at __randomizedtesting.SeedInfo.seed([8F796008AFD64067]:0)