You are viewing a plain text version of this content. The canonical link for it is here.
Posted to notifications@qpid.apache.org by Apache Jenkins Server <je...@builds.apache.org> on 2012/01/28 03:59:22 UTC

Build failed in Jenkins: Qpid-Java-Java-TestMatrix » JDK 1.6 (latest),Ubuntu,java-bdb.0-10 #299

See <https://builds.apache.org/job/Qpid-Java-Java-TestMatrix/./jdk=JDK%201.6%20(latest),label=Ubuntu,profile=java-bdb.0-10/299/changes>

Changes:

[kwall] QPID-3775: Automate the manual persistent store tests.

Add new testcase BDBBackupTest to test the operation of the BDB store backup mechanism (backup.sh).
Changed test case PersistentStoreTest to implement the manually scripted BDB tests.
This required changes to QBTC and BrokerHolder to allow an external Brokers to be forcibly kill'd with -9.
Remove script and class for manual tests.

------------------------------------------
[...truncated 2527 lines...]
    [junit] Running org.apache.qpid.info.test.SoapClientTest
    [junit] Tests run: 3, Failures: 0, Errors: 0, Time elapsed: 1.01 sec
    [junit] Running org.apache.qpid.info.test.SystemInfoTest
    [junit] Tests run: 1, Failures: 0, Errors: 0, Time elapsed: 0.007 sec
    [junit] Running org.apache.qpid.info.test.XMLWriterTest
    [junit] Tests run: 9, Failures: 0, Errors: 0, Time elapsed: 0.008 sec
     [echo] Running ant for module : broker-plugins/experimental/info
   [delete] Deleting: <https://builds.apache.org/job/Qpid-Java-Java-TestMatrix/./jdk=JDK%201.6%20(latest),label=Ubuntu,profile=java-bdb.0-10/ws/trunk/qpid/java/build/scratch/test-java-bdb.0-10.properties>

touch-failed:
     [echo] Running ant for module : broker-plugins/experimental/shutdown
   [delete] Deleting: <https://builds.apache.org/job/Qpid-Java-Java-TestMatrix/./jdk=JDK%201.6%20(latest),label=Ubuntu,profile=java-bdb.0-10/ws/trunk/qpid/java/build/scratch/test-java-bdb.0-10.properties>

prepare:

precompile:

compile:
     [echo] Targeting : 1.5

jar.manifest:

jar.nomanifest:

jar:

precompile-tests:

compile-tests:

jar-tests:

jar-sources:

libs:

copy-bin:

copy-etc:

postbuild:

build:

test:
     [echo] Running ant for module : broker-plugins/extras
   [delete] Deleting: <https://builds.apache.org/job/Qpid-Java-Java-TestMatrix/./jdk=JDK%201.6%20(latest),label=Ubuntu,profile=java-bdb.0-10/ws/trunk/qpid/java/build/scratch/test-java-bdb.0-10.properties>

prepare:

precompile:

compile:
     [echo] Targeting : 1.5

jar.manifest:

jar.nomanifest:

jar:

precompile-tests:

compile-tests:

jar-tests:

jar-sources:

libs:

copy-bin:

copy-etc:

postbuild:

build:

test:
     [echo] Using profile:java-bdb.0-10
    [junit] Running org.apache.qpid.server.plugins.ExtrasTest
    [junit] Tests run: 2, Failures: 0, Errors: 0, Time elapsed: 0.864 sec
     [echo] Running ant for module : broker-plugins/extras
   [delete] Deleting: <https://builds.apache.org/job/Qpid-Java-Java-TestMatrix/./jdk=JDK%201.6%20(latest),label=Ubuntu,profile=java-bdb.0-10/ws/trunk/qpid/java/build/scratch/test-java-bdb.0-10.properties>

touch-failed:
     [echo] Running ant for module : broker-plugins/firewall
   [delete] Deleting: <https://builds.apache.org/job/Qpid-Java-Java-TestMatrix/./jdk=JDK%201.6%20(latest),label=Ubuntu,profile=java-bdb.0-10/ws/trunk/qpid/java/build/scratch/test-java-bdb.0-10.properties>

prepare:

precompile:

compile:
     [echo] Targeting : 1.5

jar.manifest:

jar.nomanifest:

jar:

precompile-tests:

compile-tests:

jar-tests:

jar-sources:

libs:

copy-bin:

copy-etc:

postbuild:

build:

test:
     [echo] Using profile:java-bdb.0-10
    [junit] Running org.apache.qpid.server.security.access.FirewallConfigurationTest
    [junit] Tests run: 5, Failures: 0, Errors: 0, Time elapsed: 1.185 sec
    [junit] Running org.apache.qpid.server.security.access.FirewallPluginTest
    [junit] Tests run: 10, Failures: 0, Errors: 0, Time elapsed: 0.437 sec
     [echo] Running ant for module : broker-plugins/firewall
   [delete] Deleting: <https://builds.apache.org/job/Qpid-Java-Java-TestMatrix/./jdk=JDK%201.6%20(latest),label=Ubuntu,profile=java-bdb.0-10/ws/trunk/qpid/java/build/scratch/test-java-bdb.0-10.properties>

touch-failed:
     [echo] Running ant for module : bdbstore
   [delete] Deleting: <https://builds.apache.org/job/Qpid-Java-Java-TestMatrix/./jdk=JDK%201.6%20(latest),label=Ubuntu,profile=java-bdb.0-10/ws/trunk/qpid/java/build/scratch/test-java-bdb.0-10.properties>

check-request-props:
     [echo] Running ant for module : bdbstore
   [delete] Deleting: <https://builds.apache.org/job/Qpid-Java-Java-TestMatrix/./jdk=JDK%201.6%20(latest),label=Ubuntu,profile=java-bdb.0-10/ws/trunk/qpid/java/build/scratch/test-java-bdb.0-10.properties>

bdb-licence-note:
     [echo] *NOTE* The BDB JE library required by this optional module is licensed under the Sleepycat Licence, which is not compatible with the Apache Licence v2.0.
     [echo] 
     [echo] For a copy of the Sleepycat Licence, please see:
     [echo] http://www.oracle.com/technetwork/database/berkeleydb/downloads/jeoslicense-086837.html

download-bdb:
     [echo] Downloading BDB JE
      [get] Getting: http://download.oracle.com/maven/com/sleepycat/je/5.0.34/je-5.0.34.jar
      [get] To: <https://builds.apache.org/job/Qpid-Java-Java-TestMatrix/./jdk=JDK%201.6%20(latest),label=Ubuntu,profile=java-bdb.0-10/ws/trunk/qpid/java/lib/bdbstore/je-5.0.34.jar>
      [get] Not modified - so not downloaded

check-bdb-jar:

bdb-licence-note-optional:

bdb-jar-required:

prepare:

precompile:

compile:
     [echo] Targeting : 1.5

jar.manifest:

jar.nomanifest:

jar:

precompile-tests:

compile-tests:

jar-tests:

jar-sources:

libs:

copy-bin:

copy-etc:

copy-store-to-upgrade:

postbuild:

module.build:

build:

test:
     [echo] Using profile:java-bdb.0-10
    [junit] Running org.apache.qpid.server.store.berkeleydb.AMQShortStringEncodingTest
    [junit] Tests run: 3, Failures: 0, Errors: 0, Time elapsed: 0.149 sec
    [junit] Running org.apache.qpid.server.store.berkeleydb.BDBBackupTest
    [junit] Tests run: 1, Failures: 1, Errors: 0, Time elapsed: 2.34 sec
    [junit] TEST org.apache.qpid.server.store.berkeleydb.BDBBackupTest FAILED
    [junit] Running org.apache.qpid.server.store.berkeleydb.BDBMessageStoreTest
    [junit] Tests run: 14, Failures: 0, Errors: 0, Time elapsed: 1.679 sec
    [junit] Running org.apache.qpid.server.store.berkeleydb.BDBUpgradeTest
    [junit] Tests run: 6, Failures: 0, Errors: 0, Time elapsed: 5.979 sec
    [junit] Tests FAILED
     [echo] Running ant for module : bdbstore
   [delete] Deleting: <https://builds.apache.org/job/Qpid-Java-Java-TestMatrix/./jdk=JDK%201.6%20(latest),label=Ubuntu,profile=java-bdb.0-10/ws/trunk/qpid/java/build/scratch/test-java-bdb.0-10.properties>

touch-failed:
    [touch] Creating <https://builds.apache.org/job/Qpid-Java-Java-TestMatrix/./jdk=JDK%201.6%20(latest),label=Ubuntu,profile=java-bdb.0-10/ws/trunk/qpid/java/build/results/bdbstore/FAILED>
    [touch] Creating <https://builds.apache.org/job/Qpid-Java-Java-TestMatrix/./jdk=JDK%201.6%20(latest),label=Ubuntu,profile=java-bdb.0-10/ws/trunk/qpid/java/build/results/FAILED>
     [echo] Running ant for module : jca
   [delete] Deleting: <https://builds.apache.org/job/Qpid-Java-Java-TestMatrix/./jdk=JDK%201.6%20(latest),label=Ubuntu,profile=java-bdb.0-10/ws/trunk/qpid/java/build/scratch/test-java-bdb.0-10.properties>

prepare:

precompile:

compile:
     [echo] Targeting : 1.5

jar.manifest:

jar.nomanifest:

jar:

rar:

example-properties-file:

example-jars:

examples:

build:

precompile-tests:

compile-tests:

test:

BUILD FAILED
<https://builds.apache.org/job/Qpid-Java-Java-TestMatrix/./jdk=JDK%201.6%20(latest),label=Ubuntu,profile=java-bdb.0-10/ws/trunk/qpid/java/build.xml>:94: TEST SUITE FAILED

Total time: 15 minutes 32 seconds
Build step 'Invoke Ant' marked build as failure
[locks-and-latches] Releasing all the locks
[locks-and-latches] All the locks released
Recording test results


Jenkins build is back to normal : Qpid-Java-Java-TestMatrix » JDK 1.6 (latest),Ubuntu,java-bdb.0-10 #300

Posted by Apache Jenkins Server <je...@builds.apache.org>.
See <https://builds.apache.org/job/Qpid-Java-Java-TestMatrix/./jdk=JDK%201.6%20(latest),label=Ubuntu,profile=java-bdb.0-10/300/changes>